 




﻿"Item Id","Item URI","Dublin Core:Title","Dublin Core:Subject","Dublin Core:Description","Dublin Core:Creator","Dublin Core:Source","Dublin Core:Publisher","Dublin Core:Date","Dublin Core:Contributor","Dublin Core:Rights","Dublin Core:Relation","Dublin Core:Format","Dublin Core:Language","Dublin Core:Type","Dublin Core:Identifier","Dublin Core:Coverage","Item Type Metadata:Text","Item Type Metadata:Interviewer","Item Type Metadata:Interviewee","Item Type Metadata:Location","Item Type Metadata:Transcription","Item Type Metadata:Local URL","Item Type Metadata:Original Format","Item Type Metadata:Physical Dimensions","Item Type Metadata:Duration","Item Type Metadata:Compression","Item Type Metadata:Producer","Item Type Metadata:Director","Item Type Metadata:Bit Rate/Frequency","Item Type Metadata:Time Summary","Item Type Metadata:Email Body","Item Type Metadata:Subject Line","Item Type Metadata:From","Item Type Metadata:To","Item Type Metadata:CC","Item Type Metadata:BCC","Item Type Metadata:Number of Attachments","Item Type Metadata:Standards","Item Type Metadata:Objectives","Item Type Metadata:Materials","Item Type Metadata:Lesson Plan Text","Item Type Metadata:URL","Item Type Metadata:Event Type","Item Type Metadata:Participants","Item Type Metadata:Birth Date","Item Type Metadata:Birthplace","Item Type Metadata:Death Date","Item Type Metadata:Occupation","Item Type Metadata:Biographical Text","Item Type Metadata:Bibliography","Item Type Metadata:Digital Reproduction Information","Item Type Metadata:Repository","Item Type Metadata:Repository Collection","Item Type Metadata:Contact information.","Item Type Metadata:File Name","Item Type Metadata:Notes","Item Type Metadata:Digital item created","Item Type Metadata:Digital item modified","Item Type Metadata:Executive Orders","Item Type Metadata:Record Created","Item Type Metadata:Record Modified","Item Type Metadata:Transcription2","Item Type Metadata:Source URL","Omeka Legacy File:Additional Creator","Omeka Legacy File:Transcriber","Omeka Legacy File:Producer","Omeka Legacy File:Render Device","Omeka Legacy File:Render Details","Omeka Legacy File:Capture Date","Omeka Legacy File:Capture Device","Omeka Legacy File:Capture Details","Omeka Legacy File:Change History","Omeka Legacy File:Watermark","Omeka Legacy File:Encryption","Omeka Legacy File:Compression","Omeka Legacy File:Post Processing","Omeka Image File:Width","Omeka Image File:Height","Omeka Image File:Bit Depth","Omeka Image File:Channels","Omeka Image File:Exif String","Omeka Image File:Exif Array","Omeka Image File:IPTC String","Omeka Image File:IPTC Array","Omeka Video File:Bitrate","Omeka Video File:Duration","Omeka Video File:Sample Rate","Omeka Video File:Codec","Omeka Video File:Width","Omeka Video File:Height",tags,file,itemType,collection,public,featured
96947,https://www.iowaheritage.org/items/show/96947,"  Clarke County Soil and Water Conservation District Scrapbook, 1960 - 1963","Clarke County Soil and Water Conservation District |Soil Stewardship Week |Queen of Conservation |Grand Valley Watershed |Long Creek Watershed|Whitebreast Watershed ","Scrapbook contains news clippings gathered by the district office from 1960-1963. Articles focus on various soil and water conservation activities within Clarke County including Soil Stewardship Week, Queen of Conservation, Whitebreast Watershed, Long Creek Watershed, and Grand Valley Watershed. ","Clarke County Soil and Water Conservation District",,"State Library of Iowa","1960-08 to 1963-06","Clarke County Soil and Water Conservation District of Iowa. For questions about copyright, contact the State Library of Iowa at  <a href=""http://www.statelibraryofiowa.org"">http://www.statelibraryofiowa.org</a>.","This item is protected by copyright and/or related rights. Your are free to use this Item in any way that is permitted by the copyright and related rights legislation that applies to your use. For other uses you need to obtain permission from the rights-holder(s). <a href=""http://rightsstatements.org/"">http://rightsstatements.org</a>",,pdf,eng,"Text; Newspaper ",,,,,,,,,,,,,,,,,,,,,,,,,,,,,,,,,,,,,,,,,OCR1960_August_1963_June_,,,,,,,,,,,,,,,,,,,,,,,,,,,,,,,,,,,,"Addison Bowlsby,Adrian Fuller,Barbara Blanchard,Clarence Ford,Clarke County Soil and Water Conservation District,Clyde Spry,Dean Baird,Dennis Chaney,Donna Kennedy,Doyce Miller,Farm Recreation Areas,FFA,Governor Hughes,Grand Valley Watershed,Guthrie Center Field Day and Plowing Match,Harold Anderson,Harold Brim,Harry Funston,Jan Smith,Jesse Burgus,Joyce Sandell,Juanita Louse McVey,Judy Hartman,Karen Paul,Kenneth Winters Farm,Long Creek Watershed,Mary Louise Jones,Moulton Watershed,Multiflora Rose,Patty Gray,Queen of Conservation,R.S. Meyer Farm,Robert Foland,Rosalee Sklenar,Royal Bettis,Russel Brierly,Soil Conservation Awards Banquet,Soil Conservation Week,Soil Report,Soil Stewardship Week,Steve Evans,Stock Pond,Strip Cropping,Terrace,Tom Barr Farm,Vice President Richard Nixon,Whitebreast Watershed Project,Wildlife Area,William Greiner",https://www.iowaheritage.org/files/original/68936a67461860c0c458dd689e4a1eac.pdf,Document,"Clarke County Soil and Water Conservation District Historical Collection",1,0
97529,https://www.iowaheritage.org/items/show/97529," Monroe County Soil and Water Conservation District scrapbook, ""Oldies But Goodies, John Botts Era"" ","Monroe County Soil and Water Conservation District |Botts, John ","District created scrapbook with black and white photographs of people, conservation practices, farmland, and aerial views of land. Scrapbook had been labeled, ""Oldies but Goodies, The John Botts Era"". Photographs date from 1902 to 1950s. ","Monroe County Soil and Water Conservation District ",,"State Library of Iowa",1950,"Monroe County Soil and Water Conservation District of Iowa. For questions about copyright, contact the State Library of Iowa at  <a href=""http://www.statelibraryofiowa.org"">http://www.statelibraryofiowa.org</a>.","This item is protected by copyright and/or related rights. Your are free to use this Item in any way that is permitted by the copyright and related rights legislation that applies to your use. For other uses you need to obtain permission from the rights-holder(s). <a href=""http://rightsstatements.org/"">http://rightsstatements.org</a>",,pdf,eng,"Text; Scrapbook|Still Image; Photograph ",,,,,,,,,,,,,,,,,,,,,,,,,,,,,,,,,,,,,,,,,"Oldies_but_goodies_The _JohnBotts_Era_001",,,,,,,,,,,,,,,,,,,,,,,,,,,,,,,,,,,,"Bickert Farm,Bob Judge,Contour Plowing,Denzil Patton Farm,Ed Navin Pond,George Conway,Grass Waterway,H. Anderson,Henry Conway,Homer Berry,John Botts,John Goode,L. Larson,M.D. Conway,Monroe Soil and Water Conservation District,Pat Carbin Farm,Paul Wignall,Ray Coulter,Ricky Botts,Roy Rarry,S.T. Runkel,Scrapbook,Soil Erosion,State Fair - 1950,Terrace,Terracing,Tom Dougherty,Walter Abbas,Warren Rouse",https://www.iowaheritage.org/files/original/61959e153f0b792d33d9d503fc6c377a.pdf,Document,"Monroe County Soil and Water Conservation District Historical Collection",1,0
97845,https://www.iowaheritage.org/items/show/97845," Monroe County Soil and Water Conservation District scrapbook, 1964-1966","Monroe County Soil and Water Conservation District |Lake Miami|Conservation Awards|Conservation Queen","District created scrapbook of local newspaper articles regarding soil and water conservation and related activities in Monroe County from 1964 to 1966.","Monroe County Soil and Water Conservation District",,"State Library of Iowa",1964-1966,"Monroe County Soil and Water Conservation District. For questions about copyright, contact the State Library of Iowa at  <a href=""http://www.statelibraryofiowa.org"">http://www.statelibraryofiowa.org</a>.","This item is protected by copyright and/or related rights. Your are free to use this Item in any way that is permitted by the copyright and related rights legislation that applies to your use. For other uses you need to obtain permission from the rights-holder(s). <a href=""http://rightsstatements.org/"">http://rightsstatements.org</a>",,pdf,eng,"Text; Document",,,,,,,,,,,,,,,,,,,,,,,,,,,,,,,,,,,,,,,,,Monroe_Co_Scrapbook_1964-1966_OCR,,,,,,,,,,,,,,,,,,,,,,,,,,,,,,,,,,,,"Albert Etcher,Bob Gray,Bullhead Stocking,Charlotte Kline,Clifford Davis,Conservation Awards,Conservation Queen,Dale Barker,Dale Maddison,Dale Uehling,Earl Albertson,FFA,Fishing,Floyd Ransom,James Foster,Jerold Gillaspie,Jerold Luse,Joe Phillips,Judy Stuchel,Lake Miami,Lennart Larson,Monroe Soil and Water Conservation District,Ollie Kaldenberg,Pasture Improvement,Pat Carbin,Pond,Robert McGinnis,Shirley Calhoun,Soil Stewardship Week,Terrace,Tobe Reed,Trefoil,Watershed",https://www.iowaheritage.org/files/original/46b806b64d9bcb01f6ec4455d8143838.pdf,Document,"Monroe County Soil and Water Conservation District Historical Collection",1,0
92769,https://www.iowaheritage.org/items/show/92769,"1954 Poweshiek County Soil and Water Conservation District Annual Report ","Poweshiek County Soil and Water Conservation District Annual Report ","Annual report includes various conservation programs, conservation practices, events, financial details, and outlook for upcoming year. ","Poweshiek County Soil and Water Conservation District",,"State Library of Iowa",,"Poweshiek County Soil and Water Conservation District of Iowa. For questions about copyright, contact the State Library of Iowa at  <a href=""http://www.statelibraryofiowa.org"">http://www.statelibraryofiowa.org</a>.","This item is protected by copyright and/or related rights. Your are free to use this Item in any way that is permitted by the copyright and related rights legislation that applies to your use. For other uses you need to obtain permission from the rights-holder(s). <a href=""http://rightsstatements.org/"">http://rightsstatements.org</a>",,pdf,eng,"Text; Document ",,,,,,,,,,,,,,,,,,,,,,,,,,,,,,,,,,,,,,,,,1954_Annual_Report_002,,,,,,,,,,,,,,,,,,,,,,,,,,,,,,,,,,,,"Annual Report,Archie Casebolt,Beverly Johnston,Birdsfoot Trefoil,Bruce Livingston,Bruce Willemsen,Carroll Estcott,Gerret Bandstra,Glen Vogt,Gully,Harlon Backhaus,Harry Edelen,Henry Willemsen,Howard Sears,J. Basil Brush,John Clevenger,Lauren W. Wright,Morton James,Paul DeJong,Paul Vogt,Poweshiek County - Iowa,Ray Anthony,Raymond DePauw,Raymond Vogt,Strip Cropping,Terrace,Walter Hill,Wayne Reams Farm,Wayne Willemsen",https://www.iowaheritage.org/files/original/d32c5a7cbc01c2a5a79d79c20218a5cc.pdf,Document,"Poweshiek County Soil and Water Conservation District Historical Collection ",1,0
92771,https://www.iowaheritage.org/items/show/92771,"1956 Poweshiek County Soil and Water Conservation District Annual Report ","Poweshiek County Soil and Water Conservation District Annual Report ","Annual report includes various conservation programs, conservation practices, events, financial details, and outlook for upcoming year. ","Poweshiek County Soil and Water Conservation District",,"State Library of Iowa",,"Poweshiek County Soil and Water Conservation District of Iowa. For questions about copyright, contact the State Library of Iowa at  <a href=""http://www.statelibraryofiowa.org"">http://www.statelibraryofiowa.org</a>.","This item is protected by copyright and/or related rights. Your are free to use this Item in any way that is permitted by the copyright and related rights legislation that applies to your use. For other uses you need to obtain permission from the rights-holder(s). <a href=""http://rightsstatements.org/"">http://rightsstatements.org</a>",,pdf,eng,"Text; Document ",,,,,,,,,,,,,,,,,,,,,,,,,,,,,,,,,,,,,,,,,1956_Annual_Report_001,,,,,,,,,,,,,,,,,,,,,,,,,,,,,,,,,,,,"Annual Report,Archie Casebolt,Arthur Read,Buck Branch Watersheds,Carroll Elscott,Chester Freshour,David Anthony,Don Lender,Fariview Watersheds,Financial Report,Gully,Irrigation,J. Basil Brush,Lauren W. Wright,Leslie Ormiston,Louis Newkirk,Montezuma Watershed,Morton James,Mr. and Mrs. Gerret Septer,Mr. and Mrs. Miles Clayton,Mr. and Mrs. Raymond Vogt,Phil Smith,Poweshiek County - Iowa,Terrace,Warren James,William Henkle",https://www.iowaheritage.org/files/original/2d6b25c2a051752ccbbfdf4a457e0e17.pdf,Document,"Poweshiek County Soil and Water Conservation District Historical Collection ",1,0
92774,https://www.iowaheritage.org/items/show/92774,"1959 Poweshiek County Soil and Water Conservation District Annual Report ","Poweshiek County Soil and Water Conservation District Annual Report ","Annual report includes various conservation programs, conservation practices, events, financial details, and outlook for upcoming year. ","Poweshiek County Soil and Water Conservation District",,"State Library of Iowa",,"Poweshiek County Soil and Water Conservation District of Iowa. For questions about copyright, contact the State Library of Iowa at  <a href=""http://www.statelibraryofiowa.org"">http://www.statelibraryofiowa.org</a>.","This item is protected by copyright and/or related rights. Your are free to use this Item in any way that is permitted by the copyright and related rights legislation that applies to your use. For other uses you need to obtain permission from the rights-holder(s). <a href=""http://rightsstatements.org/"">http://rightsstatements.org</a>",,pdf,eng,"Text; Document ",,,,,,,,,,,,,,,,,,,,,,,,,,,,,,,,,,,,,,,,,1959_Annual_Report_001,,,,,,,,,,,,,,,,,,,,,,,,,,,,,,,,,,,,"Alvin Schuldt,Annual Report,Archie Casebolt,Bandstra Watershed,Bevan Wilcox,Bruce Livingston,Cecil Phelps,Charles Arnaman,Contour Cropland,David Anthony,Diamond Lake Watershed,Don Schuldt,Financial Report,Frank Fowler,Gully Control,Henry Willemsen,Jimmy Wilcox,John Hill,Julia Vogt,Kenneth Dieterich,L. V. Willison,L. W. Brock,LaVonne Byers,Livestock,Morton James,Multiflora Rose,Paul DeJong,Paul Hudnut,Poweshiek County - Iowa,Raymond Pilgrim,Sheet Erosion,Steven Wright,Terrace,Tree Planting,Walter Hill,Wayne Watts,Wesley Meyer,William Fouts,William Nagel Jr",https://www.iowaheritage.org/files/original/ac0a825740482e370b56fb14f54b16d2.pdf,Document,"Poweshiek County Soil and Water Conservation District Historical Collection ",1,0
98142,https://www.iowaheritage.org/items/show/98142,"Annual Report, 1968","Annual Report- Fayette County Soil and Water Conservation District ","Fayette County Soil and Water Conservation District annual report. Report features district activities, conservation award winners, fiscal report, cost-share report, and district related photographs of staff and commissioners. ","Fayette County Soil and Water Conservation District",,"State Library of Iowa",1968,"Fayette County Soil and Water Conservation District. For questions about copyright, contact the State Library of Iowa at  <a href=""http://www.statelibraryofiowa.org"">http://www.statelibraryofiowa.org</a>.","This item is protected by copyright and/or related rights. Your are free to use this Item in any way that is permitted by the copyright and related rights legislation that applies to your use. For other uses you need to obtain permission from the rights-holder(s). <a href=""http://rightsstatements.org/"">http://rightsstatements.org</a>",,pdf,eng,"Text; Newspaper",,,,,,,,,,,,,,,,,,,,,,,,,,,,,,,,,,,,,,,,,FSWCD_AR_1968_,,,,,,,,,,,,,,,,,,,,,,,,,,,,,,,,,,,,"Albert Lois Heick,Alfred Stewart,Annual Report - Fayette County Soil and Water Conservation District,Cleve Bennett,Dr.Amemiya,Financial Report,Frank Thyer,Howard Boyle,LaVerne Swensen,Leslie Anderson,Leslie Lauer,Lyle Jackson,National Flood Insurance Program,Paul Schuchmann Jr,Sod Waterway,Terrace,Tillage",https://www.iowaheritage.org/files/original/38ee6e40efe4d78864f73a553230cf0a.pdf,Document,"Fayette County Soil and Water Conservation District Historic Collection",1,0
97528,https://www.iowaheritage.org/items/show/97528,"Annual Report, 1973","Annual Report - Cedar County Soil and Water Conservation District ","District published annual report includes Cedar SWCD district activities, financial report, photographs, and names of commissioners and staff.","Cedar County Soil and Water Conservation District ",,"State Library of Iowa",1973,"Cedar County Soil and Water Conservation District of Iowa. For questions about copyright, contact the State Library of Iowa at  <a href=""http://www.statelibraryofiowa.org"">http://www.statelibraryofiowa.org</a>.","This item is protected by copyright and/or related rights. Your are free to use this Item in any way that is permitted by the copyright and related rights legislation that applies to your use. For other uses you need to obtain permission from the rights-holder(s). <a href=""http://rightsstatements.org/"">http://rightsstatements.org</a>",,pdf,eng,"Text; Document ",,,,,,,,,,,,,,,,,,,,,,,,,,,,,,,,,,,,,,,,,Cedar_Co_Annual_Report_1973_20191202_001,,,,,,,,,,,,,,,,,,,,,,,,,,,,,,,,,,,,"Annual Report,Baldwin Creek,Carl Mitzner,Cedar County Soil and Water Conservation District,Clarence Beyer,Conservation Resource Planning,Darrell Brown,Donald Pfeiffer,Financial Report,Flood Damage,Flooding,Hilda Carey,Howard Bright,Jeff Anliker,Ken Muller,Richard Mitzner,Soil Survey,Terrace,Wayne Ralfs,Windbreaks",https://www.iowaheritage.org/files/original/b92d5fab32d11dffa43a11432e78d9f4.pdf,Document,"Cedar County Soil and Water Conservation District Historic Collection ",1,0
97540,https://www.iowaheritage.org/items/show/97540,"Annual Report, 1974","Annual Report - Cedar County Soil and Water Conservation District ","District published annual report includes Cedar SWCD district activities, financial report, photographs, and names of commissioners and staff.","Cedar County Soil and Water Conservation District ",,"State Library of Iowa",1974,"Cedar County Soil and Water Conservation District of Iowa. For questions about copyright, contact the State Library of Iowa at  <a href=""http://www.statelibraryofiowa.org"">http://www.statelibraryofiowa.org</a>.","This item is protected by copyright and/or related rights. Your are free to use this Item in any way that is permitted by the copyright and related rights legislation that applies to your use. For other uses you need to obtain permission from the rights-holder(s). <a href=""http://rightsstatements.org/"">http://rightsstatements.org</a>",,pdf,eng,"Text; Document ",,,,,,,,,,,,,,,,,,,,,,,,,,,,,,,,,,,,,,,,,Cedar_Co_Annual_Report_1974_20191202_001,,,,,,,,,,,,,,,,,,,,,,,,,,,,,,,,,,,,"Annual Report,Cedar County Soil and Water Conservation District,Clarence Beyer,Conservation Poster Contest,Don Barnhart,Donald Pfeiffer,Ed Daufeldt,Ed Schermerhorn,Financial Report,Hilda Carey,Jeff Anliker,Lowden,Terrace,William Davidson II,Wilson Moon",https://www.iowaheritage.org/files/original/1c51ef2681dedeabc9674da738b9738f.pdf,Document,"Cedar County Soil and Water Conservation District Historic Collection ",1,0
98043,https://www.iowaheritage.org/items/show/98043,"Car parked on slope of terrace on Dwight Glick's farm.","Appanoose County Soil and Water Conservation District","Car parked on slope of terrace on Dwight Glick's farm, West of Movaria.","Appanoose County Soil and Water Conservation District",,"State Library of Iowa|Appanoose County Soil and Water Conservation District","Octrober, 1960.","Appanoose County Soil and Water Conservation District. For questions about copyright, contact the State Library of Iowa at  <a href=""http://www.statelibraryofiowa.org"">http://www.statelibraryofiowa.org</a>.","This item is protected by copyright and/or related rights. Your are free to use this Item in any way that is permitted by the copyright and related rights legislation that applies to your use. For other uses you need to obtain permission from the rights-holder(s). <a href=""http://rightsstatements.org/"">http://rightsstatements.org</a>",,jpg,eng,"Still Image; Photograph ",,,,,,,,,,,,,,,,,,,,,,,,,,,,,,,,,,,,,,,,,,,,,,,,,,,,,,,,,,,,,,,,,,,,,,,,,,,,,"Appanoose County,Dwight Glick,Soil and Water Conservation,Terrace","https://www.iowaheritage.org/files/original/e9d7ad3748c5b198b308f63db1620cde.jpg,https://www.iowaheritage.org/files/original/ba27241ed4a95c44bf331b46a79f24b7.jpg","Still Image","Appanoose County Soil and Water Conservation District Historic Collection",1,0
