 




﻿"Item Id","Item URI","Dublin Core:Title","Dublin Core:Subject","Dublin Core:Description","Dublin Core:Creator","Dublin Core:Source","Dublin Core:Publisher","Dublin Core:Date","Dublin Core:Contributor","Dublin Core:Rights","Dublin Core:Relation","Dublin Core:Format","Dublin Core:Language","Dublin Core:Type","Dublin Core:Identifier","Dublin Core:Coverage","Item Type Metadata:Text","Item Type Metadata:Interviewer","Item Type Metadata:Interviewee","Item Type Metadata:Location","Item Type Metadata:Transcription","Item Type Metadata:Local URL","Item Type Metadata:Original Format","Item Type Metadata:Physical Dimensions","Item Type Metadata:Duration","Item Type Metadata:Compression","Item Type Metadata:Producer","Item Type Metadata:Director","Item Type Metadata:Bit Rate/Frequency","Item Type Metadata:Time Summary","Item Type Metadata:Email Body","Item Type Metadata:Subject Line","Item Type Metadata:From","Item Type Metadata:To","Item Type Metadata:CC","Item Type Metadata:BCC","Item Type Metadata:Number of Attachments","Item Type Metadata:Standards","Item Type Metadata:Objectives","Item Type Metadata:Materials","Item Type Metadata:Lesson Plan Text","Item Type Metadata:URL","Item Type Metadata:Event Type","Item Type Metadata:Participants","Item Type Metadata:Birth Date","Item Type Metadata:Birthplace","Item Type Metadata:Death Date","Item Type Metadata:Occupation","Item Type Metadata:Biographical Text","Item Type Metadata:Bibliography","Item Type Metadata:Digital Reproduction Information","Item Type Metadata:Repository","Item Type Metadata:Repository Collection","Item Type Metadata:Contact information.","Item Type Metadata:File Name","Item Type Metadata:Notes","Item Type Metadata:Digital item created","Item Type Metadata:Digital item modified","Item Type Metadata:Executive Orders","Item Type Metadata:Record Created","Item Type Metadata:Record Modified","Item Type Metadata:Transcription2","Item Type Metadata:Source URL","Omeka Legacy File:Additional Creator","Omeka Legacy File:Transcriber","Omeka Legacy File:Producer","Omeka Legacy File:Render Device","Omeka Legacy File:Render Details","Omeka Legacy File:Capture Date","Omeka Legacy File:Capture Device","Omeka Legacy File:Capture Details","Omeka Legacy File:Change History","Omeka Legacy File:Watermark","Omeka Legacy File:Encryption","Omeka Legacy File:Compression","Omeka Legacy File:Post Processing","Omeka Image File:Width","Omeka Image File:Height","Omeka Image File:Bit Depth","Omeka Image File:Channels","Omeka Image File:Exif String","Omeka Image File:Exif Array","Omeka Image File:IPTC String","Omeka Image File:IPTC Array","Omeka Video File:Bitrate","Omeka Video File:Duration","Omeka Video File:Sample Rate","Omeka Video File:Codec","Omeka Video File:Width","Omeka Video File:Height",tags,file,itemType,collection,public,featured
99593,https://www.iowaheritage.org/items/show/99593,"Personnel, 1960","Henry County Soil and Water Conservation District|Personnel","B&W images of unidentified personnel from Soil Conservation Service, Extension Service, and FHA. ","Henry County Soil and Water Conservation District ",,"State Library of Iowa",1960,"Henry County Soil and Water Conservation District of Iowa. For questions about copyright, contact the State Library of Iowa at  <a href=""http://www.statelibraryofiowa.org"">http://www.statelibraryofiowa.org</a>.","This item is protected by copyright and/or related rights. Your are free to use this Item in any way that is permitted by the copyright and related rights legislation that applies to your use. For other uses you need to obtain permission from the rights-holder(s). <a href=""http://rightsstatements.org/"">http://rightsstatements.org</a>",,pdf,,"Still Image; Photograph",,,,,,,,,,,,,,,,,,,,,,,,,,,,,,,,,,,,,,,,,1960_various_conservation_depts_,,,,,,,,,,,,,,,,,,,,,,,,,,,,,,,,,,,,"Extension Service,FHA,Henry County Soil and Water Conservation District,Personnel,Soil Conservation Service",https://www.iowaheritage.org/files/original/91197e69a5b575e678098d95edb26303.pdf,"Still Image","Henry County Soil and Water Conservation District Historical Collection ",1,0
99543,https://www.iowaheritage.org/items/show/99543,"Waterway development project on Ralph Gilmore farm, 1966","Jackson County Soil and Water Conservation District |Waterway|Ralph Gilmore","B&W images of waterway development on Ralph Gilmore farm. First photograph features Ralph Gilmore and the completed project. Second photograph features SCS technician, Ralph Oestein. ","U.S. Soil Conservation Service",,"State Library of Iowa","1966-11 to 1966-12","Jackson County Soil and Water Conservation District of Iowa. For questions about copyright, contact the State Library of Iowa <a href=""%5C"">http://www.statelibraryofiowa.org</a>.","This item is protected by copyright and/or related rights. Your are free to use this Item in any way that is permitted by the copyright and related rights legislation that applies to your use. For other uses you need to obtain permission from the rights-holder(s). <a href=""http://rightsstatements.org/"">http://rightsstatements.org</a>",,jpg,eng,"Still Image: Photograph",,,,,,,,,,,,,,,,,,,,,,,,,,,,,,,,,,,,,,,,,Jackson_Nov_1966_Ralph_Gilmore_After_View_Of_Waterway_20191216_001|Jackson_Nov_1966_Ralph_Gilmore_After_View_Of_Waterway_20191216_002|Jackson_Nov_1966_Ralph_Gilmore_SCS_Tech_Grass_Waterway_Progress_20191216_001|Jackson_Nov_1966_Ralph_Gilmore_SCS_Tech_Grass_Waterway_Progress_20191216_002,,,,,,,,,,,,,,,,,,,,,,,,,,,,,,,,,,,,"Jackson County Soil and Water Conservation District,Ralph Gilmore,Ralph Oestern,Soil Conservation Service,Waterway","https://www.iowaheritage.org/files/original/3b7a3f4297bca916832ae7311190506f.jpg,https://www.iowaheritage.org/files/original/8cf3f74891c1fac6eb7a5d931643d9ab.jpg,https://www.iowaheritage.org/files/original/a593c34500a077ec6253fbde94795131.jpg,https://www.iowaheritage.org/files/original/261705c6a968fc3893a0bb4389454d63.jpg","Still Image","Jackson County Soil and Water Conservation District Historic Collection",1,0
99027,https://www.iowaheritage.org/items/show/99027,"B-9, 1965","Appanoose County Soil and Water Conservation District|Watershed|Moulton","B&W photographs of SCS and County representatives inspecting a recently completed B-9 road and floodwater prevention structure.","Appanoose County Soil and Water Conservation District ",,"State Library of Iowa",1963-10-03,"Appanoose County Soil and Water Conservation District of Iowa. For questions about copyright, contact the State Library of Iowa at  <a href=""http://www.statelibraryofiowa.org"">http://www.statelibraryofiowa.org</a>.","This item is protected by copyright and/or related rights. Your are free to use this Item in any way that is permitted by the copyright and related rights legislation that applies to your use. For other uses you need to obtain permission from the rights-holder(s). <a href=""http://rightsstatements.org/"">http://rightsstatements.org</a>",,jpg,,"Still Image; Photograph",,,,,,,,,,,,,,,,,,,,,,,,,,,,,,,,,,,,,,,,,Appanoose_B9_farm_to_market_road_003|Appanoose_B9_farm_to_market_road_004|Appanoose_B9_road_flood_structure_001|Appanoose_B9_road_flood_structure_002,,,,,,,,,,,,,,,,,,,,,,,,,,,,,,,,,,,,"Appanoose County Soil and Water Conservation District,Flood Prevention,Moulton,Soil Conservation Service,Watershed","https://www.iowaheritage.org/files/original/7238e5e2db71b220677b245de193dc23.jpg,https://www.iowaheritage.org/files/original/a1cc91776d3eab1ae2822722d133fd74.jpg,https://www.iowaheritage.org/files/original/ee7c2b1972a08c37f7e9f2c7daa9b085.jpg,https://www.iowaheritage.org/files/original/848cdb7b0dfa244b66d3ad8ded62d3ba.jpg,https://www.iowaheritage.org/files/original/f67e55392d53661e66fce5687d76f9d4.jpg,https://www.iowaheritage.org/files/original/fb636c20cbba1e8c054d49b9615bb72d.jpg","Still Image","Appanoose County Soil and Water Conservation District Historic Collection",1,0
98456,https://www.iowaheritage.org/items/show/98456,"Soil Conservation Service staff","Jackson County Soil and Water Conservation District|Soil Conservation Service","B&W photograph of eight men posing for a photograph. Unidentified men are SCS staff.","Jackson County Soil and Water Conservation District ",,"State Library of Iowa",Unknown,"Jackson County Soil and Water Conservation District. For questions about copyright, contact the State Library of Iowa at  <a href=""http://www.statelibraryofiowa.org"">http://www.statelibraryofiowa.org</a>.","This item is protected by copyright and/or related rights. Your are free to use this Item in any way that is permitted by the copyright and related rights legislation that applies to your use. For other uses you need to obtain permission from the rights-holder(s). <a href=""http://rightsstatements.org/"">http://rightsstatements.org</a>",,pdf,eng,"Still Image; Photograph",,,,,,,,,,,,,,,,,,,,,,,,,,,,,,,,,,,,,,,,,Jackson_SCS_Area_4_Personnel_20191213_001.jpg,,,,,,,,,,,,,,,,,,,,,,,,,,,,,,,,,,,,"Jackson County Soil and Water Conservation District,Soil Conservation Service",https://www.iowaheritage.org/files/original/53843f546bc04278bf3665cc6198db69.pdf,"Still Image","Jackson County Soil and Water Conservation District Historic Collection",1,0
98313,https://www.iowaheritage.org/items/show/98313,"Aerial photos of the Moulton Watershed area.","Appanoose County Soil and Water Conservation District","Aerial photos of the Moulton Watershed area.","Leo Duree",,"State Library of Iowa|U.S. Soil Conservation Service",05-03-1962,"Appanoose County Soil and Water Conservation District. For questions about copyright, contact the State Library of Iowa at  <a href=""http://www.statelibraryofiowa.org"">http://www.statelibraryofiowa.org</a>.","This item is protected by copyright and/or related rights. Your are free to use this Item in any way that is permitted by the copyright and related rights legislation that applies to your use. For other uses you need to obtain permission from the rights-holder(s). <a href=""http://rightsstatements.org/"">http://rightsstatements.org</a>",,pdf,eng,"Still Image; Photograph ",,,,,,,,,,,,,,,,,,,,,,,,,,,,,,,,,,,,,,,,,,,,,,,,,,,,,,,,,,,,,,,,,,,,,,,,,,,,,"Appanoose County,Bobby Spurgeon,Glen Jacobs,Harold Winans,J. Lloyd Black,Leo Duree,Lowell Young,Moulton Watershed,Soil Conservation Service",https://www.iowaheritage.org/files/original/af58e765bd7bb87ac8d71eacc4f8b3c4.pdf,"Still Image","Appanoose County Soil and Water Conservation District Historic Collection",1,0
98309,https://www.iowaheritage.org/items/show/98309,"Soil conservation service logo.","Appanoose County Soil and Water Conservation District","Soil conservation service logo.","Soil Conservation Service",,"State Library of Iowa|Appanoose County Soil and Water Conservation District","Unknown ","Appanoose County Soil and Water Conservation District. For questions about copyright, contact the State Library of Iowa at  <a href=""http://www.statelibraryofiowa.org"">http://www.statelibraryofiowa.org</a>.","This item is protected by copyright and/or related rights. Your are free to use this Item in any way that is permitted by the copyright and related rights legislation that applies to your use. For other uses you need to obtain permission from the rights-holder(s). <a href=""http://rightsstatements.org/"">http://rightsstatements.org</a>",,jpg,eng,"Still Image; Photograph ",,,,,,,,,,,,,,,,,,,,,,,,,,,,,,,,,,,,,,,,,,,,,,,,,,,,,,,,,,,,,,,,,,,,,,,,,,,,,"Soil Conservation Service,USDA Soil Conservation Service",https://www.iowaheritage.org/files/original/fa678ca7af85e7f97ba50a03add8e01a.jpg,"Still Image","Appanoose County Soil and Water Conservation District Historic Collection",1,0
97871,https://www.iowaheritage.org/items/show/97871,"News articles from the 1980's.","Delaware County Soil and Water Conservation District ","Various news articles dating from the 1980-1989.","Delaware County Soil and Water Conservation District ",,"State Library of Iowa|Delaware County Soil and Water Conservation District ",1980-1989,"Delaware County Soil and Water Conservation District . For questions about copyright, contact the State Library of Iowa at  <a href=""http://www.statelibraryofiowa.org"">http://www.statelibraryofiowa.org</a>.","This item is protected by copyright and/or related rights. Your are free to use this Item in any way that is permitted by the copyright and related rights legislation that applies to your use. For other uses you need to obtain permission from the rights-holder(s). <a href=""http://rightsstatements.org/"">http://rightsstatements.org</a>",,pdf,eng,"Text; Document",,,,,,,,,,,,,,,,,,,,,,,,,,,,,,,,,,,,,,,,,DelawareSWCD_NewsArticles_1980s.pdf,,,,,,,,,,,,,,,,,,,,,,,,,,,,,,,,,,,,"Ag Expo,Aster Corporation,Chisel Plow,Chris Funke,Colesburg Iowa,Connie Reichenauer,Conservation Reserve Program,Conservation Tillage,CRP,Dave Eibey,Delaware County Iowa,Elizabeth Beswich-Todd,Erosion,Free Seed for Hunting Habitats,Glenn Burrows,Gully,Joe McGrane,John Kruse Farm,John Preussner,Keith Krause,Ken Klein,Kevin Lamphier,Larry Beeler,Larry Knipper,Loan Program,Marilyn Beaudine,Mark Biggs,Marv Collander,Marvin Calonder,Mike McGrane,National Wildlife Week,Native Grass Cover,No Till Incentives,No Till Planter,Norman Brus,Pasture Cost-Sharing,Pheasants Forever,Pollution,Ray Wycoff,Richard Belden,Richard Sutton,Rodney Baumgartner,Shelley Zumbach,Soil and Water Conservation,Soil Conservation Service,Steve DeShaw,Switchgrass,Terrace Building,Tile Intake Terrace,Tillage,Topsoil,Vegetative Cover,Wildlife,Windbreak Cost-Sharing Program",https://www.iowaheritage.org/files/original/3cd012e3faea445eb1f13767c39fca7a.pdf,Document,"Delaware County Soil and Water Conservation District Historical Collection",1,0
97863,https://www.iowaheritage.org/items/show/97863," Fayette County Soil and Water Conservation District scrapbook, 1963-1967","Fayette County Soil and Water Conservation District |Soil and Water Conservation ","District created scrapbook filled with news clippings relevant to Fayette County Soil and Water Conservation District activities from 1963-1967.","Fayette County Soil and Water Conservation District",,"State Library of Iowa",1963-1967,"Fayette County Soil and Water Conservation District. For questions about copyright, contact the State Library of Iowa at  <a href=""http://www.statelibraryofiowa.org"">http://www.statelibraryofiowa.org</a>.","This item is protected by copyright and/or related rights. Your are free to use this Item in any way that is permitted by the copyright and related rights legislation that applies to your use. For other uses you need to obtain permission from the rights-holder(s). <a href=""http://rightsstatements.org/"">http://rightsstatements.org</a>",,pdf,eng,"Text; Scrapbook",,,,,,,,,,,,,,,,,,,,,,,,,,,,,,,,,,,,,,,,,Fayette_scrapbook_1963-1967_,,,,,,,,,,,,,,,,,,,,,,,,,,,,,,,,,,,,"Ann Marie Hartman,Carl Lueder,Don Bartels,Dwight Maurer,E.W. Maurer,Earl Kerker,Fayette County Soil and Water Conservation District,Fayette Lake,Gary Maurer,Gordon Lauer,Grassed Backslope Terrace,Hay Shortage,J.L. Cline,Jim Maurer,Kenneth Kittleson,Kula B. Karkey,Leland McCord,Leo Mork,Mary Metzger,Melvin Molokken,Melvin Wangsness,Michael Wiley,Mike Cunningham,Myron Shepperd,National Wildlife Week,News Clippings,Norman Kilburn,Otter Creek,Patricia Colvin,Paul Schuchmann,Queen of Conservation,Rev. Paul Meyer,Rivers,Sandra Knickerbocker,Scrapbook,Shelterbelt,Soil Conservation Service,Soil Erosion,Soil Stewardship Week,Speech Contest,Tree Planting,William Fouts",https://www.iowaheritage.org/files/original/dc57d22fd4a98891d6c6004700525994.pdf,Document,"Fayette County Soil and Water Conservation District Historic Collection",1,0
97859,https://www.iowaheritage.org/items/show/97859,"Portrait of R.M. Davis.","West Pottawattamie County Soil and Water Conservation District","Portrait of R.M. Davis, Administrator of the Soil Conservation Service, USDA.","West Pottawattamie County Soil and Water Conservation District",,"State Library of Iowa|West Pottawattamie County Soil and Water Conservation District","Unknown ","West Pottawattamie County Soil and Water Conservation District. For questions about copyright, contact the State Library of Iowa at  <a href=""http://www.statelibraryofiowa.org"">http://www.statelibraryofiowa.org</a>.","This item is protected by copyright and/or related rights. Your are free to use this Item in any way that is permitted by the copyright and related rights legislation that applies to your use. For other uses you need to obtain permission from the rights-holder(s). <a href=""http://rightsstatements.org/"">http://rightsstatements.org</a>",,jpeg,eng,"Text; Document",,,,,,,,,,,,,,,,,,,,,,,,,,,,,,,,,,,,,,,,,WestPottawattamieCountySWCD_DavisUSDA.jpg,,,,,,,,,,,,,,,,,,,,,,,,,,,,,,,,,,,,"R.M. Davis,Soil Conservation Service,United States Department of Agriculture,West Pottawattamie County Iowa",https://www.iowaheritage.org/files/original/60fc9ad489ddf143b0e4a20d0a574dfc.jpg,"Still Image","West Pottawattamie County Soil and Water Conservation District Historical Collection",1,0
97760,https://www.iowaheritage.org/items/show/97760," Iowa County Soil and Water Conservation District scrapbook, 1982-1988","Iowa County Soil and Water Conservation District |Annual Reports - 1982 to 1986|Soil and Water Conservation ","District created scrapbook with newspaper clippings from 1982 to 1988. Clippings include conservation articles, award notifications, newspaper published photographs, and annual reports for 1982, 1983, 1984, 1985, and 1986.","Iowa County Soil and Water Conservation District",,"State Library of Iowa",1982-1988,"Iowa County Soil and Water Conservation District. For questions about copyright, contact the State Library of Iowa at  <a href=""http://www.statelibraryofiowa.org"">http://www.statelibraryofiowa.org</a>.","This item is protected by copyright and/or related rights. Your are free to use this Item in any way that is permitted by the copyright and related rights legislation that applies to your use. For other uses you need to obtain permission from the rights-holder(s). <a href=""http://rightsstatements.org/"">http://rightsstatements.org</a>",,pdf,eng,"Text; Scrapbook ",,,,,,,,,,,,,,,,,,,,,,,,,,,,,,,,,,,,,,,,,1982_to_1988001ORC,,,,,,,,,,,,,,,,,,,,,,,,,,,,,,,,,,,,"""The Stone Jar"",Andy Rowe,Ann Wetjen,Ann Zavis,Annual Report,Arnold Stutzmans,August Steffen,Brian Schnebbe,Clayton Dietrich,Dan Dietrich,Dave Fetzer,David McCartney,Dorris McCartney,Earl Schafbuch,Flood Control,Fred White,Gayle Goodman,Gene Goodman,Gwen Gingerich,Harold Yoder,Harry Bryant,Iowa County Soil and Water Conservation District,Izaak Walton League Windbreak Award,James Gulliford,Jamie Harney,John Cox,John Parson,John Yoder,Jon Kinzenbaw,Karen Grimm,Kenneth Davis,Kenneth Grimm,Kevin Koehn,Koehn Land Inc.,Larry Beyer,Larry Wetjen,Loretta White,Lyle Misbach,Mary Lacina,Millen Sanderfeld,Multiflora Rose,News Clipping,No-Till,Pat Hammes,Pond,Rand Broneman,Rhonda Glandorf,Rick Maas,Robert Faber,Ross Knipfer,Russell Collingwood,Scott Zavis,Scrapbook,Soil Conservation Service,Ted Oswald,Terrace Systems,Tillage,Tonya Madoerin,Water Quality",https://www.iowaheritage.org/files/original/0b7b59edc57a7ef1d87daac62e8865c2.pdf,Document,"Iowa County Soil and Water Conservation District Historic Collection",1,0
