 




﻿"Item Id","Item URI","Dublin Core:Title","Dublin Core:Subject","Dublin Core:Description","Dublin Core:Creator","Dublin Core:Source","Dublin Core:Publisher","Dublin Core:Date","Dublin Core:Contributor","Dublin Core:Rights","Dublin Core:Relation","Dublin Core:Format","Dublin Core:Language","Dublin Core:Type","Dublin Core:Identifier","Dublin Core:Coverage","Item Type Metadata:Text","Item Type Metadata:Interviewer","Item Type Metadata:Interviewee","Item Type Metadata:Location","Item Type Metadata:Transcription","Item Type Metadata:Local URL","Item Type Metadata:Original Format","Item Type Metadata:Physical Dimensions","Item Type Metadata:Duration","Item Type Metadata:Compression","Item Type Metadata:Producer","Item Type Metadata:Director","Item Type Metadata:Bit Rate/Frequency","Item Type Metadata:Time Summary","Item Type Metadata:Email Body","Item Type Metadata:Subject Line","Item Type Metadata:From","Item Type Metadata:To","Item Type Metadata:CC","Item Type Metadata:BCC","Item Type Metadata:Number of Attachments","Item Type Metadata:Standards","Item Type Metadata:Objectives","Item Type Metadata:Materials","Item Type Metadata:Lesson Plan Text","Item Type Metadata:URL","Item Type Metadata:Event Type","Item Type Metadata:Participants","Item Type Metadata:Birth Date","Item Type Metadata:Birthplace","Item Type Metadata:Death Date","Item Type Metadata:Occupation","Item Type Metadata:Biographical Text","Item Type Metadata:Bibliography","Item Type Metadata:Digital Reproduction Information","Item Type Metadata:Repository","Item Type Metadata:Repository Collection","Item Type Metadata:Contact information.","Item Type Metadata:File Name","Item Type Metadata:Notes","Item Type Metadata:Digital item created","Item Type Metadata:Digital item modified","Item Type Metadata:Executive Orders","Item Type Metadata:Record Created","Item Type Metadata:Record Modified","Item Type Metadata:Transcription2","Item Type Metadata:Source URL","Omeka Legacy File:Additional Creator","Omeka Legacy File:Transcriber","Omeka Legacy File:Producer","Omeka Legacy File:Render Device","Omeka Legacy File:Render Details","Omeka Legacy File:Capture Date","Omeka Legacy File:Capture Device","Omeka Legacy File:Capture Details","Omeka Legacy File:Change History","Omeka Legacy File:Watermark","Omeka Legacy File:Encryption","Omeka Legacy File:Compression","Omeka Legacy File:Post Processing","Omeka Image File:Width","Omeka Image File:Height","Omeka Image File:Bit Depth","Omeka Image File:Channels","Omeka Image File:Exif String","Omeka Image File:Exif Array","Omeka Image File:IPTC String","Omeka Image File:IPTC Array","Omeka Video File:Bitrate","Omeka Video File:Duration","Omeka Video File:Sample Rate","Omeka Video File:Codec","Omeka Video File:Width","Omeka Video File:Height",tags,file,itemType,collection,public,featured
92745,https://www.iowaheritage.org/items/show/92745,"City Spar Over Arbor Lake Project","Poweshiek County, Iowa |Arbor Lake Project ","A photocopy of an article taken from an unknown source regarding a conservation panels complaints on Arbor Lake development.  ","Unknown ",,"State Library of Iowa",1977-03,"Poweshiek County Soil and Water Conservation District of Iowa. For questions about copyright, contact the State Library of Iowa at  <a href=""http://www.statelibraryofiowa.org"">http://www.statelibraryofiowa.org</a>.","This item is protected by copyright and/or related rights. Your are free to use this Item in any way that is permitted by the copyright and related rights legislation that applies to your use. For other uses you need to obtain permission from the rights-holder(s). <a href=""http://rightsstatements.org/"">http://rightsstatements.org</a>",,pdf,eng,"Text; Document ",,,,,,,,,,,,,,,,,,,,,,,,,,,,,,,,,,,,,,,,,City_county_Spar_Over_Arbor_Lake_Project_,,,,,,,,,,,,,,,,,,,,,,,,,,,,,,,,,,,,"Arbor Lake,Poweshiek County - Iowa",https://www.iowaheritage.org/files/original/4ceb0dc5cafe55a4a709a7bb4d1c3742.pdf,Document,"Poweshiek County Soil and Water Conservation District Historical Collection ",1,0
92747,https://www.iowaheritage.org/items/show/92747,"Arbor Lake Construction Notes","Poweshiek County, Iowa |Arbor Lake ","Arbor Lake NW and NE tributary excavation progress with photos. ","Unknown ",,"State Library of Iowa","Unknown ","Poweshiek County Soil and Water Conservation District of Iowa. For questions about copyright, contact the State Library of Iowa at  <a href=""http://www.statelibraryofiowa.org"">http://www.statelibraryofiowa.org</a>.","This item is protected by copyright and/or related rights. Your are free to use this Item in any way that is permitted by the copyright and related rights legislation that applies to your use. For other uses you need to obtain permission from the rights-holder(s). <a href=""http://rightsstatements.org/"">http://rightsstatements.org</a>",,pdf,eng,"Text; Document ",,,,,,,,,,,,,,,,,,,,,,,,,,,,,,,,,,,,,,,,,Construction_Notes_,,,,,,,,,,,,,,,,,,,,,,,,,,,,,,,,,,,,"Arbor Lake,Poweshiek County - Iowa",https://www.iowaheritage.org/files/original/9150ee4ad47365c79ce4d6d31c16040e.pdf,Document,"Poweshiek County Soil and Water Conservation District Historical Collection ",1,0
92748,https://www.iowaheritage.org/items/show/92748,"County To Spend $5000 For Arbor Lake","Poweshiek County, Iowa |Arbor Lake ","Photocopy of article highlighting county expenditures on Arbor Lake.  ","Unknown ",,"State Library of Iowa",1975-10-16,"Poweshiek County Soil and Water Conservation District of Iowa. For questions about copyright, contact the State Library of Iowa at  <a href=""http://www.statelibraryofiowa.org"">http://www.statelibraryofiowa.org</a>.","This item is protected by copyright and/or related rights. Your are free to use this Item in any way that is permitted by the copyright and related rights legislation that applies to your use. For other uses you need to obtain permission from the rights-holder(s). <a href=""http://rightsstatements.org/"">http://rightsstatements.org</a>",,pdf,eng,"Text; Document ",,,,,,,,,,,,,,,,,,,,,,,,,,,,,,,,,,,,,,,,,"County_to_Spend_5,000_on_Arbor_Lake_",,,,,,,,,,,,,,,,,,,,,,,,,,,,,,,,,,,,"Arbor Lake,Poweshiek County - Iowa",https://www.iowaheritage.org/files/original/00d3a930ad766f545824713c44c28266.pdf,Document,"Poweshiek County Soil and Water Conservation District Historical Collection ",1,0
92756,https://www.iowaheritage.org/items/show/92756,"H-R Editorials ","Poweshiek County, Iowa |Arbor Lake ","Two editorial articles photocopied to one page regarding Arbor Lake development. ",Unknown,,"State Library of Iowa","Unknown ","Poweshiek County Soil and Water Conservation District of Iowa. For questions about copyright, contact the State Library of Iowa at  <a href=""http://www.statelibraryofiowa.org"">http://www.statelibraryofiowa.org</a>.","This item is protected by copyright and/or related rights. Your are free to use this Item in any way that is permitted by the copyright and related rights legislation that applies to your use. For other uses you need to obtain permission from the rights-holder(s). <a href=""http://rightsstatements.org/"">http://rightsstatements.org</a>",,pdf,eng,"Text; Photocopy ",,,,,,,,,,,,,,,,,,,,,,,,,,,,,,,,,,,,,,,,,HR_Editorials,,,,,,,,,,,,,,,,,,,,,,,,,,,,,,,,,,,,"Arbor Lake,Grinnell Iowa,Poweshiek County - Iowa",https://www.iowaheritage.org/files/original/4d3063da4237021e2bd695d14847c1a7.pdf,Document,"Poweshiek County Soil and Water Conservation District Historical Collection ",1,0
92817,https://www.iowaheritage.org/items/show/92817,"Arbor Lake Watershed Project Annual Review ","Poweshiek County, Iowa |Arbor Lake Watershed","Annual report on Arbor Lake Watershed project. Includes fertilizer demonstration, photographs, storm water runoff information, and map. ","Poweshiek County Soil and Water Conservation District",,"State Library of Iowa","2003-10-01 to 2004-09-30","Poweshiek County Soil and Water Conservation District of Iowa. For questions about copyright, contact the State Library of Iowa at  <a href=""http://www.statelibraryofiowa.org"">http://www.statelibraryofiowa.org</a>.","This item is protected by copyright and/or related rights. Your are free to use this Item in any way that is permitted by the copyright and related rights legislation that applies to your use. For other uses you need to obtain permission from the rights-holder(s). <a href=""http://rightsstatements.org/"">http://rightsstatements.org</a>",,pdf,eng,"Text; News Clipping",,,,,,,,,,,,,,,,,,,,,,,,,,,,,,,,,,,,,,,,,Arbor_Lake_Annual_Review_,,,,,,,,,,,,,,,,,,,,,,,,,,,,,,,,,,,,"Arbor Lake,Poweshiek Soil and Water Conservation District,Watershed",https://www.iowaheritage.org/files/original/afa8867f105a363eaf7910ae3ae2fb87.pdf,Document,"Poweshiek County Soil and Water Conservation District Historical Collection ",1,0
92821,https://www.iowaheritage.org/items/show/92821,"Arbor Lake To Live Again ","Poweshiek County, Iowa |Arbor Lake|Grinnell, Iowa ","News article discussing the fate of Arbor Lake. ","Poweshiek County Soil and Water Conservation District",,"State Library of Iowa",1974-05,"Poweshiek County Soil and Water Conservation District of Iowa. For questions about copyright, contact the State Library of Iowa at  <a href=""http://www.statelibraryofiowa.org"">http://www.statelibraryofiowa.org</a>.","This item is protected by copyright and/or related rights. Your are free to use this Item in any way that is permitted by the copyright and related rights legislation that applies to your use. For other uses you need to obtain permission from the rights-holder(s). <a href=""http://rightsstatements.org/"">http://rightsstatements.org</a>",,pdf,eng,"Text; News Clipping",,,,,,,,,,,,,,,,,,,,,,,,,,,,,,,,,,,,,,,,,Arbor_Lake_to_Live_Again_,,,,,,,,,,,,,,,,,,,,,,,,,,,,,,,,,,,,"Arbor Lake,Poweshiek County - Iowa",https://www.iowaheritage.org/files/original/05a854f028d9351ec562fd67b63942fd.pdf,Document,"Poweshiek County Soil and Water Conservation District Historical Collection ",1,0
96292,https://www.iowaheritage.org/items/show/96292,"1985 Basin 1 Relief Maps","Poweshiek County Soil and Water Conservation District|Grinnell, Iowa |Arbor Lake |Basin 1 Relief Sewer","A series of engineering maps regarding the plan and profile of Basin 1 Relief Sewer, Grinnell, Iowa. ","Shive - Hattery & Associates - Consulting Engineers",,"State Library of Iowa",1985,"Poweshiek County Soil and Water Conservation District of Iowa. For questions about copyright, contact the State Library of Iowa at  <a href=""http://www.statelibraryofiowa.org"">http://www.statelibraryofiowa.org</a>.","This item is protected by copyright and/or related rights. Your are free to use this Item in any way that is permitted by the copyright and related rights legislation that applies to your use. For other uses you need to obtain permission from the rights-holder(s). <a href=""http://rightsstatements.org/"">http://rightsstatements.org</a>",,pdf,eng,,,,,,,,,,,,,,,,,,,,,,,,,,,,,,,,,,,,,,,,,,"1985 Basin 1 Relief Sewer Maps",,,,,,,,,,,,,,,,,,,,,,,,,,,,,,,,,,,,"Arbor Lake,Basin Relief Sewer,Grinnell Iowa,Poweshiek County - Iowa",https://www.iowaheritage.org/files/original/6ff1eb0655d3a56afb03c7d2b5b6cfc6.pdf,"Still Image","Poweshiek County Soil and Water Conservation District Historical Collection ",1,0
96296,https://www.iowaheritage.org/items/show/96296,"Arbor Lake Map ","Poweshiek County Soil and Water Conservation District","Map of proposed timber challenge course for Arbor Lake. ","Poweshiek County Soil and Water Conservation District",,"State Library of Iowa",1981,"Poweshiek County Soil and Water Conservation District of Iowa. For questions about copyright, contact the State Library of Iowa at  <a href=""http://www.statelibraryofiowa.org"">http://www.statelibraryofiowa.org</a>.","This item is protected by copyright and/or related rights. Your are free to use this Item in any way that is permitted by the copyright and related rights legislation that applies to your use. For other uses you need to obtain permission from the rights-holder(s). <a href=""http://rightsstatements.org/"">http://rightsstatements.org</a>",,pdf,eng,"Still Image; Map ",,,,,,,,,,,,,,,,,,,,,,,,,,,,,,,,,,,,,,,,,Arbor_lake_,,,,,,,,,,,,,,,,,,,,,,,,,,,,,,,,,,,,"Arbor Lake,Poweshiek Soil and Water Conservation District,Timber Creek Challenge Course",https://www.iowaheritage.org/files/original/f22bcfe27e82df0b0720faefef2eaf59.pdf,"Still Image","Poweshiek County Soil and Water Conservation District Historical Collection ",1,0
