 




﻿"Item Id","Item URI","Dublin Core:Title","Dublin Core:Subject","Dublin Core:Description","Dublin Core:Creator","Dublin Core:Source","Dublin Core:Publisher","Dublin Core:Date","Dublin Core:Contributor","Dublin Core:Rights","Dublin Core:Relation","Dublin Core:Format","Dublin Core:Language","Dublin Core:Type","Dublin Core:Identifier","Dublin Core:Coverage","Item Type Metadata:Text","Item Type Metadata:Interviewer","Item Type Metadata:Interviewee","Item Type Metadata:Location","Item Type Metadata:Transcription","Item Type Metadata:Local URL","Item Type Metadata:Original Format","Item Type Metadata:Physical Dimensions","Item Type Metadata:Duration","Item Type Metadata:Compression","Item Type Metadata:Producer","Item Type Metadata:Director","Item Type Metadata:Bit Rate/Frequency","Item Type Metadata:Time Summary","Item Type Metadata:Email Body","Item Type Metadata:Subject Line","Item Type Metadata:From","Item Type Metadata:To","Item Type Metadata:CC","Item Type Metadata:BCC","Item Type Metadata:Number of Attachments","Item Type Metadata:Standards","Item Type Metadata:Objectives","Item Type Metadata:Materials","Item Type Metadata:Lesson Plan Text","Item Type Metadata:URL","Item Type Metadata:Event Type","Item Type Metadata:Participants","Item Type Metadata:Birth Date","Item Type Metadata:Birthplace","Item Type Metadata:Death Date","Item Type Metadata:Occupation","Item Type Metadata:Biographical Text","Item Type Metadata:Bibliography","Item Type Metadata:Digital Reproduction Information","Item Type Metadata:Repository","Item Type Metadata:Repository Collection","Item Type Metadata:Contact information.","Item Type Metadata:File Name","Item Type Metadata:Notes","Item Type Metadata:Digital item created","Item Type Metadata:Digital item modified","Item Type Metadata:Executive Orders","Item Type Metadata:Record Created","Item Type Metadata:Record Modified","Item Type Metadata:Transcription2","Item Type Metadata:Source URL","Omeka Legacy File:Additional Creator","Omeka Legacy File:Transcriber","Omeka Legacy File:Producer","Omeka Legacy File:Render Device","Omeka Legacy File:Render Details","Omeka Legacy File:Capture Date","Omeka Legacy File:Capture Device","Omeka Legacy File:Capture Details","Omeka Legacy File:Change History","Omeka Legacy File:Watermark","Omeka Legacy File:Encryption","Omeka Legacy File:Compression","Omeka Legacy File:Post Processing","Omeka Image File:Width","Omeka Image File:Height","Omeka Image File:Bit Depth","Omeka Image File:Channels","Omeka Image File:Exif String","Omeka Image File:Exif Array","Omeka Image File:IPTC String","Omeka Image File:IPTC Array","Omeka Video File:Bitrate","Omeka Video File:Duration","Omeka Video File:Sample Rate","Omeka Video File:Codec","Omeka Video File:Width","Omeka Video File:Height",tags,file,itemType,collection,public,featured
98768,https://www.iowaheritage.org/items/show/98768,"Tama County Soil and Water Conservation District luncheon, 1969","Tama County Soil and Water Conservation District","B&W photograph three men and four woman sitting at a table.","Tama County Soil and Water Conservation District ",,"State Library of Iowa",1969-01,"Tama County Soil and Water Conservation District of Iowa. For questions about copyright, contact the State Library of Iowa at  <a href=""http://www.statelibraryofiowa.org"">http://www.statelibraryofiowa.org</a>.","This item is protected by copyright and/or related rights. Your are free to use this Item in any way that is permitted by the copyright and related rights legislation that applies to your use. For other uses you need to obtain permission from the rights-holder(s). <a href=""http://rightsstatements.org/"">http://rightsstatements.org</a>",,pdf,eng,"Still Image; Photograph",,,,,,,,,,,,,,,,,,,,,,,,,,,,,,,,,,,,,,,,,Tama_County_Awards_Luncheon_January_1969_20191220_00120191226_001,,,,,,,,,,,,,,,,,,,,,,,,,,,,,,,,,,,,"Soil Conservation Awards,Tama County Soil and Water Conservation District",https://www.iowaheritage.org/files/original/cade243e3db17c4fadf3c2726976953f.jpg,"Still Image","Tama County Soil and Water Conservation District Historic Collection",1,0
97743,https://www.iowaheritage.org/items/show/97743,"Iowa County farmers recognized for conservation efforts","Iowa County Soil and Water Conservation District |Soil and Water Conservation ","News clipping featuring four different farmers for their conservation efforts in Iowa County. ","Iowa County Soil and Water Conservation District ",,"State Library of Iowa",2016,"Iowa County Soil and Water Conservation District. For questions about copyright, contact the State Library of Iowa at  <a href=""http://www.statelibraryofiowa.org"">http://www.statelibraryofiowa.org</a>.","This item is protected by copyright and/or related rights. Your are free to use this Item in any way that is permitted by the copyright and related rights legislation that applies to your use. For other uses you need to obtain permission from the rights-holder(s). <a href=""http://rightsstatements.org/"">http://rightsstatements.org</a>",,pdf,eng,"Text; Clipping ",,,,,,,,,,,,,,,,,,,,,,,,,,,,,,,,,,,,,,,,,Iowa_County_SWCD_Awards_Newspaper_2016_Cont_20191210_001,,,,,,,,,,,,,,,,,,,,,,,,,,,,,,,,,,,,"Iowa County Soil and Water Conservation District,Soil Conservation Awards",https://www.iowaheritage.org/files/original/203c1463e329130f004fc42b8759580a.pdf,Document,"Iowa County Soil and Water Conservation District Historic Collection",1,0
97741,https://www.iowaheritage.org/items/show/97741,"Ken Leichty owner-operator winner","Iowa County Soil and Water Conservation District |Leichty, Ken |Soil Conservation Awards ","Clipping recognizing Ken Leichty's win for owner-operator conservation award.  ","Iowa County Soil and Water Conservation District ",,"State Library of Iowa",1991,"Iowa County Soil and Water Conservation District. For questions about copyright, contact the State Library of Iowa at  <a href=""http://www.statelibraryofiowa.org"">http://www.statelibraryofiowa.org</a>.","This item is protected by copyright and/or related rights. Your are free to use this Item in any way that is permitted by the copyright and related rights legislation that applies to your use. For other uses you need to obtain permission from the rights-holder(s). <a href=""http://rightsstatements.org/"">http://rightsstatements.org</a>",,pdf,eng,"Text; Newspaper",,,,,,,,,,,,,,,,,,,,,,,,,,,,,,,,,,,,,,,,,Iowa_County_Soil_Water_Conservation_Winners__1991_20191210_001,,,,,,,,,,,,,,,,,,,,,,,,,,,,,,,,,,,,"Iowa County Soil and Water Conservation District,Ken Leichty,Soil Conservation Awards",https://www.iowaheritage.org/files/original/525c047f2234a11593be171a55e85abd.pdf,Document,"Iowa County Soil and Water Conservation District Historic Collection",1,0
97735,https://www.iowaheritage.org/items/show/97735,"Nine farms win sweepstakes awards ","Iowa County Soil and Water Conservation District |Conservation Awards ","Clipping announcing nine winners of sweepstakes awards, one being Dean Humphrey.","Iowa County Soil and Water Conservation District ",,"State Library of Iowa",Unknown,"Iowa County Soil and Water Conservation District. For questions about copyright, contact the State Library of Iowa at  <a href=""http://www.statelibraryofiowa.org"">http://www.statelibraryofiowa.org</a>.","This item is protected by copyright and/or related rights. Your are free to use this Item in any way that is permitted by the copyright and related rights legislation that applies to your use. For other uses you need to obtain permission from the rights-holder(s). <a href=""http://rightsstatements.org/"">http://rightsstatements.org</a>",,pdf,eng,"Text; ",,,,,,,,,,,,,,,,,,,,,,,,,,,,,,,,,,,,,,,,,Iowa_County_Farm_Sweepstakes_Awards_Newspaper_20191210_001,,,,,,,,,,,,,,,,,,,,,,,,,,,,,,,,,,,,"Iowa County Soil and Water Conservation District,Soil Conservation Awards","https://www.iowaheritage.org/files/original/c23b8d40796c5c0a7ff91b7866feeffd.pdf,https://www.iowaheritage.org/files/original/8d907dbec7452db103279f00060607cb.pdf",Document,"Iowa County Soil and Water Conservation District Historic Collection",1,0
97616,https://www.iowaheritage.org/items/show/97616,"Cedar County Soil and Water Conservation District Newsletter, 1987","Cedar County Soil and Water Conservation District ","Newsletter created by the district highlighting various programs, updates, and names of conservation award winners. ","Cedar County Soil and Water Conservation District",,"State Library of Iowa",1987,"Cedar County Soil and Water Conservation District of Iowa. For questions about copyright, contact the State Library of Iowa at  <a href=""http://www.statelibraryofiowa.org"">http://www.statelibraryofiowa.org</a>.","This item is protected by copyright and/or related rights. Your are free to use this Item in any way that is permitted by the copyright and related rights legislation that applies to your use. For other uses you need to obtain permission from the rights-holder(s). <a href=""http://rightsstatements.org/"">http://rightsstatements.org</a>",,pdf,eng,"Text; Newsletter",,,,,,,,,,,,,,,,,,,,,,,,,,,,,,,,,,,,,,,,,Cedar_County_Conservation_Newsletter_July_-_August_1987__20191204_001,,,,,,,,,,,,,,,,,,,,,,,,,,,,,,,,,,,,"Cedar County Soil and Water Conservation District,Newsletter,Soil Conservation Awards",https://www.iowaheritage.org/files/original/4b0b9a69ff1dbcd2af7cf249adcf6f7b.pdf,Document,"Cedar County Soil and Water Conservation District Historic Collection ",1,0
96854,https://www.iowaheritage.org/items/show/96854,"Monroe County Soil and Water Conservation Scrapbook, 1953 - 1957","Monroe County Soil and Water Conservation|Soil and Water Conservation Week|Soil and Water Conservation News|District Elections","A scrapbook created by the district documenting district news, conservation news articles, and county news printed in local newspapers","Monroe County Soil and Water Conservation District",,"State Library of Iowa","1953 to 1957","Monroe County Soil and Water Conservation District of Iowa. For questions about copyright, contact the State Library of Iowa at  <a href=""http://www.statelibraryofiowa.org"">http://www.statelibraryofiowa.org</a>.","This item is protected by copyright and/or related rights. Your are free to use this Item in any way that is permitted by the copyright and related rights legislation that applies to your use. For other uses you need to obtain permission from the rights-holder(s). <a href=""http://rightsstatements.org/"">http://rightsstatements.org</a>",,pdf,eng,"Text; Scrapbook",,,,,,,,,,,,,,,,,,,,,,,,,,,,,,,,,,,,,,,,,Monroe_County_Scrapbook_1953_1957_OCR,,,,,,,,,,,,,,,,,,,,,,,,,,,,,,,,,,,,"Monroe Soil and Water Conservation District,News Clipping,Soil and Water Conservation District Elections,Soil Conservation Awards",https://www.iowaheritage.org/files/original/cf44b130c9ffcc69fd0966b48faf4d6c.pdf,Document,"Monroe County Soil and Water Conservation District Historical Collection",1,0
96744,https://www.iowaheritage.org/items/show/96744,"  Clarke County Soil and Water Conservation District Scrapbook, 1968 - 1970","Clarke County Soil and Water Conservation District|Whitebreast Watershed Project|Annual Report, 1970|Soil and Water Conservation ","Scrapbook contains news clippings gathered by the district office from June 1968 to November 1970. Articles focus on Whitebreast Watershed Project, conservation projects, district progress, and other district specific news.","Clarke County Soil and Water Conservation District",,"State Library of Iowa","1968-06 to 1970-11","Clarke County Soil and Water Conservation District of Iowa. For questions about copyright, contact the State Library of Iowa at  <a href=""http://www.statelibraryofiowa.org"">http://www.statelibraryofiowa.org</a>.","This item is protected by copyright and/or related rights. Your are free to use this Item in any way that is permitted by the copyright and related rights legislation that applies to your use. For other uses you need to obtain permission from the rights-holder(s). <a href=""http://rightsstatements.org/"">http://rightsstatements.org</a>",,pdf,eng,"Text: Document ",,,,,,,,,,,,,,,,,,,,,,,,,,,,,,,,,,,,,,,,,OCRJune_1968_November_1970_,,,,,,,,,,,,,,,,,,,,,,,,,,,,,,,,,,,,"1968,Adrian Fuller,Annual Report - 1969,Annual Report - 1970,Annual Report - 1971,Brad Waller,Clarence Ford,Clarke County Soil and Water Conservation District,Dale Chidester,Dick Touet,Doyce Miller,Doyle Hendrickson,Dr. Fred Wood,Farm Pond,Glen Kent,Herbert Kayser,Howard Hughes,Jack Ames,John Maddy,Keith Ticknor,Kenneth Johnson,Leland Dolecheck,Lowell Moran,Native Grasses,News Clipping,Newton Watkins,Propst Farm,RC&D,Richard Gonseth,Roberta Stephenson,Soil and Water Conservation,Soil Conservation Awards,Soil Conservation Week,Stocking Ponds,Wendall McCartney,Whitebreast Watershed Project,William Greiner,William Touet,Winona Naylor",https://www.iowaheritage.org/files/original/c193c320b4e0c2307ad2e3276854433f.pdf,Document,"Clarke County Soil and Water Conservation District Historical Collection",1,0
96742,https://www.iowaheritage.org/items/show/96742,"  Clarke County Soil and Water Conservation District Scrapbook, 1963 - 1967","Clarke County Soil and Water Conservation District|Whitebreast Watershed Project|Soil and Water Conservation |Scrapbook ","Scrapbook contains news clippings gathered by the district office from June 1963 to August 1967. Articles focus on the application and start of the Whitebreast Watershed Project. Other articles focus on conservation projects, district progress, and other district specific news.","Clarke County Soil and Water Conservation District",,"State Library of Iowa","1963-06 to 1967-08","Clarke County Soil and Water Conservation District of Iowa. For questions about copyright, contact the State Library of Iowa at  <a href=""http://www.statelibraryofiowa.org"">http://www.statelibraryofiowa.org</a>.","This item is protected by copyright and/or related rights. Your are free to use this Item in any way that is permitted by the copyright and related rights legislation that applies to your use. For other uses you need to obtain permission from the rights-holder(s). <a href=""http://rightsstatements.org/"">http://rightsstatements.org</a>",,pdf,eng,"Text: Document ",,,,,,,,,,,,,,,,,,,,,,,,,,,,,,,,,,,,,,,,,OCRJuly_1963_August_1967_,,,,,,,,,,,,,,,,,,,,,,,,,,,,,,,,,,,,"Adrian Fuller,Barbara Snider,C.E. Cobble,Cheryl Davis,Clarence Ford,Clarke County Soil and Water Conservation District,Conservation Cartoons,Dale Chidester,Dick Overholtzer,Doyce Miller,Dr. E.P. Sylvester,Eileen Snider,Farm Pond,Farm-City Week,Gary Johnson,George ""Woody"" Griffin,Gerald Hendrickson,Harold Brim,Kayrene Bonnett,Lawrence Curnes,Mr. and Mrs. Harold Hubbard,Queen of Conservation,Ralph Dove,Rolland Sargent,Sally Nadolsky,Scrapbook,Sharon Asmus,Sharon Hoffman,Sheila Robins,Soil Conservation Awards,Soil Conservation Week,Soil Contest,Soil Plan,Speech Contest,Sue Querrey,Tana Miller,Watershed,Whitebreast Lake,Whitebreast Watershed Project,William Touet",https://www.iowaheritage.org/files/original/b495092bf3bb972f76d077ea76483005.pdf,Document,"Clarke County Soil and Water Conservation District Historical Collection",1,0
96741,https://www.iowaheritage.org/items/show/96741,"  Clarke County Soil and Water Conservation District Scrapbook,  1957 - 1960 ","Clarke County Soil and Water Conservation District|Soil Conservation|Agriculture |Scrapbook ","Scrapbook contains news clippings gathered by the district office from June 1957 to July 1960. Articles feature conservation projects, district progress, and other district specific news.","Clarke County Soil and Water Conservation District",,"State Library of Iowa",,"Clarke County Soil and Water Conservation District of Iowa. For questions about copyright, contact the State Library of Iowa at  <a href=""http://www.statelibraryofiowa.org"">http://www.statelibraryofiowa.org</a>.","This item is protected by copyright and/or related rights. Your are free to use this Item in any way that is permitted by the copyright and related rights legislation that applies to your use. For other uses you need to obtain permission from the rights-holder(s). <a href=""http://rightsstatements.org/"">http://rightsstatements.org</a>",,pdf,eng,"Text: Document ",,,,,,,,,,,,,,,,,,,,,,,,,,,,,,,,,,,,,,,,,OCRJune_1957_July_1960_,,,,,,,,,,,,,,,,,,,,,,,,,,,,,,,,,,,,"Alice Adams,Bryant-Mark Farm,Carl Luce Farm,Catfish,Charles Ballantyne,Chester H. Woods Farm,Clarke County Soil and Water Conservation District,Contour Farming,Donna James,Doyce Miller,Dr. John Herrick,Drennan Farm,Drop Inlet Pond,Erosion Dam,Farm Ponds,George Casey,Harold Bonnett,Harry Fungston,Honey Creek Watershed,Jacob Cozad,Janice Boor,John Bryant,Judy Blakely,Kenneth Fetters Farm,Larry Casey,Linda Gonseth,Marion Millsap Farm,News Clipping,Patricia Hendrickson,Patty Gray,Peggy Fenn,Queen of Conservation,Queen of the Furrow,R.M. Heston,Russell Brierly,Scrapbook,Soil Conservation Awards,Soil Conservation Week,Soil Stewardship Week,Stock Pond,Sue Powell,Terrace Building,Terracing,Watershed,Watershed Tour,William Zmolek",https://www.iowaheritage.org/files/original/40871843d477f09c4eb10faad4923dba.pdf,Document,"Clarke County Soil and Water Conservation District Historical Collection",1,0
96229,https://www.iowaheritage.org/items/show/96229,"Soil Conservation Issue","Benton County, Iowa |Soil and Water Conservation |Rathje, Jeff|Maple Grove, Iowa |Iowa Conservation Award|Hach, Benny |Norway, Iowa |Schulte, John","Newspaper issue dedicated to conservation efforts in Benton County. Issue features Iowa Conservation Award winners. ","The Cedar Valley Times",,"State Library of Iowa ",1995-09-19,"Benton County Soil and Water Conservation District, Iowa. For questions about copyright, contact the State Library of Iowa at <a>http://www.statelibraryofiowa.org.</a>","This item is protected by copyright and/or related rights. Your are free to use this Item in any way that is permitted by the copyright and related rights legislation that applies to your use. For other uses you need to obtain permission from the rights-holder(s). <a href=""http://rightsstatements.org/"">http://rightsstatements.org</a>",,pdf,eng,"Text; Newspaper",,,,,,,,,,,,,,,,,,,,,,,,,,,,,,,,,,,,,,,,,1995_newspaper_clippings_,,,,,,,,,,,,,,,,,,,,,,,,,,,,,,,,,,,,"Benton County Soil and Water Conservation District,Newspaper,Soil Conservation,Soil Conservation Awards",https://www.iowaheritage.org/files/original/db749277167bf9bc82e951e709f97547.pdf,Document,"Benton County Soil and Water Conservation District Historical Collection",1,0
