 




﻿"Item Id","Item URI","Dublin Core:Title","Dublin Core:Subject","Dublin Core:Description","Dublin Core:Creator","Dublin Core:Source","Dublin Core:Publisher","Dublin Core:Date","Dublin Core:Contributor","Dublin Core:Rights","Dublin Core:Relation","Dublin Core:Format","Dublin Core:Language","Dublin Core:Type","Dublin Core:Identifier","Dublin Core:Coverage","Item Type Metadata:Text","Item Type Metadata:Interviewer","Item Type Metadata:Interviewee","Item Type Metadata:Location","Item Type Metadata:Transcription","Item Type Metadata:Local URL","Item Type Metadata:Original Format","Item Type Metadata:Physical Dimensions","Item Type Metadata:Duration","Item Type Metadata:Compression","Item Type Metadata:Producer","Item Type Metadata:Director","Item Type Metadata:Bit Rate/Frequency","Item Type Metadata:Time Summary","Item Type Metadata:Email Body","Item Type Metadata:Subject Line","Item Type Metadata:From","Item Type Metadata:To","Item Type Metadata:CC","Item Type Metadata:BCC","Item Type Metadata:Number of Attachments","Item Type Metadata:Standards","Item Type Metadata:Objectives","Item Type Metadata:Materials","Item Type Metadata:Lesson Plan Text","Item Type Metadata:URL","Item Type Metadata:Event Type","Item Type Metadata:Participants","Item Type Metadata:Birth Date","Item Type Metadata:Birthplace","Item Type Metadata:Death Date","Item Type Metadata:Occupation","Item Type Metadata:Biographical Text","Item Type Metadata:Bibliography","Item Type Metadata:Digital Reproduction Information","Item Type Metadata:Repository","Item Type Metadata:Repository Collection","Item Type Metadata:Contact information.","Item Type Metadata:File Name","Item Type Metadata:Notes","Item Type Metadata:Digital item created","Item Type Metadata:Digital item modified","Item Type Metadata:Executive Orders","Item Type Metadata:Record Created","Item Type Metadata:Record Modified","Item Type Metadata:Transcription2","Item Type Metadata:Source URL","Omeka Legacy File:Additional Creator","Omeka Legacy File:Transcriber","Omeka Legacy File:Producer","Omeka Legacy File:Render Device","Omeka Legacy File:Render Details","Omeka Legacy File:Capture Date","Omeka Legacy File:Capture Device","Omeka Legacy File:Capture Details","Omeka Legacy File:Change History","Omeka Legacy File:Watermark","Omeka Legacy File:Encryption","Omeka Legacy File:Compression","Omeka Legacy File:Post Processing","Omeka Image File:Width","Omeka Image File:Height","Omeka Image File:Bit Depth","Omeka Image File:Channels","Omeka Image File:Exif String","Omeka Image File:Exif Array","Omeka Image File:IPTC String","Omeka Image File:IPTC Array","Omeka Video File:Bitrate","Omeka Video File:Duration","Omeka Video File:Sample Rate","Omeka Video File:Codec","Omeka Video File:Width","Omeka Video File:Height",tags,file,itemType,collection,public,featured
8882,https://www.iowaheritage.org/items/show/8882,"A horse, a horse, a kingdom for a horse.","War|Napoleon I, 1769-1821.|World War, 1939-1945|Germany|Tanks|aggression|invasion|weather|winter|Russia|snow.",,"Darling, Jay N. (Jay Norwood), 1876-1962","The Editorial cartoons of J.N. ""Ding"" Darling [electronic resource] : The Cowles Collection, Drake University, 1912-1962",,1941/12/17|1941,,"Copyright is owned by the ""Ding"" Darling Wildlife Society; it is administered on behalf of the Society by The University of Iowa. While use within the classroom is encouraged without specific authorization, publishing this cartoon in any format requires written permission. See policy and permissions procedure at: http://www.lib.uiowa.edu/spec-coll/services/dingdarling_fees.html","Cowles Library, Drake University, 2507 University Ave., Des Moines, IA 50311-4505.",,,,"411217.jpg|http://ddr.lib.drake.edu/u?/ddarling,5812",,,,,,,,,,,,,,,,,,,,,,,,,,,,,,,,,,,,,,,,,,,,,,,,"<a href=""http://ddr.lib.drake.edu/u?/ddarling,5812"" target=""_blank"">View this item in its source respository</a>",,,,,,,,,,,,,,,,,,,,,,,,,,,,,https://www.iowaheritage.org/files/original/4fc62ccd1d751ff6f2dbb2dfce22a584.jpg,"Remote Item","Editorial Cartoons of J.N. ""Ding"" Darling, Drake University",1,0
64381,https://www.iowaheritage.org/items/show/64381,"Afghan President Najib","War|Najib, 1947-1996|Afghanistan|Men|1980-1990|Government|Presidents|Communism|Communism -- Soviet Union|Foreign relations|Soviet Union -- Foreign relations|Soviet Union|Presidents|Tanks|Flags|Soldiers|Bullets|Suitcases|Canyons|Mountains|Missiles","Zing; Zip","Duffy, Brian, 1955-",,"University of Iowa. Libraries. Special Collections Dept.",1988-05-20|2011-04,,"Educational use only, no other permissions given. Copyright to this digital object is owned by The Des Moines Register; it may not be downloaded, reproduced, or distributed without written permission. For more information, contact the Special Collections Department.","Editorial Cartoons of Brian Duffy; Des Moines Register Cartoonists|Papers of Brian Duffy|Des Moines Register",,English,"Still image|Editorial cartoons",MSC916|duffy-880520|http://digital.lib.uiowa.edu/cdm/ref/collection/duffy/id/219,,,,,,,,,,,,,,,,,,,,,,,,,,,,,,,,,,,,,,,,,,,,,,,,"<a href=""http://digital.lib.uiowa.edu/cdm/ref/collection/duffy/id/219"" target=""_blank"">View this item in its source respository</a>",,,,,,,,,,,,,,,,,,,,,,,,,,,,,https://www.iowaheritage.org/files/original/28e585c344a98897f361040bdf456470.jpg,"Remote Item","Editorial Cartoons of Brian Duffy",1,0
64358,https://www.iowaheritage.org/items/show/64358,"He huffed, and puffed, and blew the imperialist Zionists off the face of the Earth!","Dictators|Qaddafi, Muammar|Libya|Dictators|1980-1990|Dictatorships|Terrorism|Violence|Hatred|Hate|Antisemitism|Men|Terrorists|Tanks|Grenades|Boys|Baseball gloves|Uniforms|Turbans|Tents|Camels|Antennas (Electronics)","I brake for terrorists; a drive in the country; reading bedtime stories; Family life with Moammar; playing catch","Duffy, Brian, 1955-",,"University of Iowa. Libraries. Special Collections Dept.",1986-01-14|2011-04,,"Educational use only, no other permissions given. Copyright to this digital object is owned by The Des Moines Register; it may not be downloaded, reproduced, or distributed without written permission. For more information, contact the Special Collections Department.","Editorial Cartoons of Brian Duffy; Des Moines Register Cartoonists|Papers of Brian Duffy|Des Moines Register",,English,"Still image|Editorial cartoons",MSC916|duffy-860114(2)|http://digital.lib.uiowa.edu/cdm/ref/collection/duffy/id/196,,,,,,,,,,,,,,,,,,,,,,,,,,,,,,,,,,,,,,,,,,,,,,,,"<a href=""http://digital.lib.uiowa.edu/cdm/ref/collection/duffy/id/196"" target=""_blank"">View this item in its source respository</a>",,,,,,,,,,,,,,,,,,,,,,,,,,,,,https://www.iowaheritage.org/files/original/71009efda30b646b092cce116da177d8.jpg,"Remote Item","Editorial Cartoons of Brian Duffy",1,0
9754,https://www.iowaheritage.org/items/show/9754,"Hooking a ride.","War|Wallace, Henry Agard, 1888-1965|Elections 1940|Tanks|government|politics|elections|New Deal|Roosevelt, Franklin D. (Franklin Delano), 1882-1945|Hitler, Adolf, 1889-1945|Tojo, Hideki, 1884-1948|Mussolini, Benito, 1883-1945|bandwagons|ordinary citizen.",,"Darling, Jay N. (Jay Norwood), 1876-1962","The Editorial cartoons of J.N. ""Ding"" Darling [electronic resource] : The Cowles Collection, Drake University, 1912-1962",,1940/10/11|1940,,"Copyright is owned by the ""Ding"" Darling Wildlife Society; it is administered on behalf of the Society by The University of Iowa. While use within the classroom is encouraged without specific authorization, publishing this cartoon in any format requires written permission. See policy and permissions procedure at: http://www.lib.uiowa.edu/spec-coll/services/dingdarling_fees.html","Cowles Library, Drake University, 2507 University Ave., Des Moines, IA 50311-4505.",,,,"401011|http://ddr.lib.drake.edu/u?/ddarling,6684",,,,,,,,,,,,,,,,,,,,,,,,,,,,,,,,,,,,,,,,,,,,,,,,"<a href=""http://ddr.lib.drake.edu/u?/ddarling,6684"" target=""_blank"">View this item in its source respository</a>",,,,,,,,,,,,,,,,,,,,,,,,,,,,,https://www.iowaheritage.org/files/original/2912368cba3382ec50ef2626fcc48199.jpg,"Remote Item","Editorial Cartoons of J.N. ""Ding"" Darling, Drake University",1,0
9635,https://www.iowaheritage.org/items/show/9635,"Oh we'll never miss the water 'til the well runs dry.","War|United States|Gladiator|peace|resources|energy|oil|petroleum|gasoline|foreign aid|self-sufficiency|Europe|Russia|Asia|South America|Africa|Arabia|World|Uncle Sam|world|tanks|airplanes|gas pumps.",,"Darling, Jay N. (Jay Norwood), 1876-1962","The Editorial cartoons of J.N. ""Ding"" Darling [electronic resource] : The Cowles Collection, Drake University, 1912-1962",,1948/04/01|1948,,"Copyright is owned by the ""Ding"" Darling Wildlife Society; it is administered on behalf of the Society by The University of Iowa. While use within the classroom is encouraged without specific authorization, publishing this cartoon in any format requires written permission. See policy and permissions procedure at: http://www.lib.uiowa.edu/spec-coll/services/dingdarling_fees.html","Cowles Library, Drake University, 2507 University Ave., Des Moines, IA 50311-4505.",,,,"480401.jpg|http://ddr.lib.drake.edu/u?/ddarling,6565",,,,,,,,,,,,,,,,,,,,,,,,,,,,,,,,,,,,,,,,,,,,,,,,"<a href=""http://ddr.lib.drake.edu/u?/ddarling,6565"" target=""_blank"">View this item in its source respository</a>",,,,,,,,,,,,,,,,,,,,,,,,,,,,,https://www.iowaheritage.org/files/original/6729407acc02131ff97cf0219822cda8.jpg,"Remote Item","Editorial Cartoons of J.N. ""Ding"" Darling, Drake University",1,0
64353,https://www.iowaheritage.org/items/show/64353,"South Africa","Apartheid|South Africa|Tanks|1980-1990|Government|Government, Resistance to|Racism|Racial discrimination|Race relations|Race riots|Prejudice|Economic & political systems|Segregation|Violence|Men|Soldiers|Guns|Trucks|Mines (Weapons)",Apartheid,"Duffy, Brian, 1955-",,"University of Iowa. Libraries. Special Collections Dept.",1986-01-08|2011-04,,"Educational use only, no other permissions given. Copyright to this digital object is owned by The Des Moines Register; it may not be downloaded, reproduced, or distributed without written permission. For more information, contact the Special Collections Department.","Editorial Cartoons of Brian Duffy; Des Moines Register Cartoonists|Papers of Brian Duffy|Des Moines Register",,English,"Still image|Editorial cartoons",MSC916|duffy-860108|http://digital.lib.uiowa.edu/cdm/ref/collection/duffy/id/191,,,,,,,,,,,,,,,,,,,,,,,,,,,,,,,,,,,,,,,,,,,,,,,,"<a href=""http://digital.lib.uiowa.edu/cdm/ref/collection/duffy/id/191"" target=""_blank"">View this item in its source respository</a>",,,,,,,,,,,,,,,,,,,,,,,,,,,,,https://www.iowaheritage.org/files/original/aaa8f30b78ecfe7aa83837a0f9d64c42.jpg,"Remote Item","Editorial Cartoons of Brian Duffy",1,0
64506,https://www.iowaheritage.org/items/show/64506,"These Russian tractors certainly are different!","Farmers|United States|Farms|1980-1990|Farming|Farms|Cold War|Soviet Union -- Foreign relations|Foreign trade|Foreign relations|Imports|Farmland|Farmers|Tanks|Pigs|Barns|Smoke|Arrows","John Bear; SS-20 plow attachment","Duffy, Brian, 1955-",,"University of Iowa. Libraries. Special Collections Dept.",1984-08-02|2011-04,,"Educational use only, no other permissions given. Copyright to this digital object is owned by The Des Moines Register; it may not be downloaded, reproduced, or distributed without written permission. For more information, contact the Special Collections Department.","Editorial Cartoons of Brian Duffy; Des Moines Register Cartoonists|Papers of Brian Duffy|Des Moines Register",,English,"Still image|Editorial cartoons",MSC916|duffy-840802|http://digital.lib.uiowa.edu/cdm/ref/collection/duffy/id/344,,,,,,,,,,,,,,,,,,,,,,,,,,,,,,,,,,,,,,,,,,,,,,,,"<a href=""http://digital.lib.uiowa.edu/cdm/ref/collection/duffy/id/344"" target=""_blank"">View this item in its source respository</a>",,,,,,,,,,,,,,,,,,,,,,,,,,,,,https://www.iowaheritage.org/files/original/adfdca008eb2671543bb893e0f862d68.jpg,"Remote Item","Editorial Cartoons of Brian Duffy",1,0
64417,https://www.iowaheritage.org/items/show/64417,"What's it going to be, forward or reverse?","War|Hussein, Saddam, 1937-2006|Iraq|Iraq-Kuwait Crisis, 1990-1991|Dictators|1990-2000|Wars|Dictators|Dictatorships|Strategy|Presidents|Operation Desert Shield, 1990-1991|Presidents|Tanks|Cliffs",War,"Duffy, Brian, 1955-",,"University of Iowa. Libraries. Special Collections Dept.",1991-01-10|2011-04,,"Educational use only, no other permissions given. Copyright to this digital object is owned by The Des Moines Register; it may not be downloaded, reproduced, or distributed without written permission. For more information, contact the Special Collections Department.","Editorial Cartoons of Brian Duffy; Des Moines Register Cartoonists|Papers of Brian Duffy|Des Moines Register",,English,"Still image|Editorial cartoons",MSC916|duffy-910110|http://digital.lib.uiowa.edu/cdm/ref/collection/duffy/id/255,,,,,,,,,,,,,,,,,,,,,,,,,,,,,,,,,,,,,,,,,,,,,,,,"<a href=""http://digital.lib.uiowa.edu/cdm/ref/collection/duffy/id/255"" target=""_blank"">View this item in its source respository</a>",,,,,,,,,,,,,,,,,,,,,,,,,,,,,https://www.iowaheritage.org/files/original/60bb1217b22dd033b7ab9f4ffb428a6b.jpg,"Remote Item","Editorial Cartoons of Brian Duffy",1,0
64253,https://www.iowaheritage.org/items/show/64253,"Why do I get the feeling that we've stepped onto the set of a Mad Max movie","War|Iraq|Iraq War, 2003-|Tanks|2000-2010|Warfare|Military force|Weapons|Weapons|Guns|Gunfights|Chasing|Hooks|Roads","Plink; Iraqi militia","Duffy, Brian, 1955-",,"University of Iowa. Libraries. Special Collections Dept.",2003-03-27|2011-04,,"Educational use only, no other permissions given. Copyright to this digital object is owned by The Des Moines Register; it may not be downloaded, reproduced, or distributed without written permission. For more information, contact the Special Collections Department.","Editorial Cartoons of Brian Duffy; Des Moines Register Cartoonists|Papers of Brian Duffy|Des Moines Register",,English,"Still image|Editorial cartoons",MSC916|duffy-030327|http://digital.lib.uiowa.edu/cdm/ref/collection/duffy/id/91,,,,,,,,,,,,,,,,,,,,,,,,,,,,,,,,,,,,,,,,,,,,,,,,"<a href=""http://digital.lib.uiowa.edu/cdm/ref/collection/duffy/id/91"" target=""_blank"">View this item in its source respository</a>",,,,,,,,,,,,,,,,,,,,,,,,,,,,,https://www.iowaheritage.org/files/original/8a5c92b1cf443d41cbc3312ad5fa37c3.jpg,"Remote Item","Editorial Cartoons of Brian Duffy",1,0
