 




﻿"Item Id","Item URI","Dublin Core:Title","Dublin Core:Subject","Dublin Core:Description","Dublin Core:Creator","Dublin Core:Source","Dublin Core:Publisher","Dublin Core:Date","Dublin Core:Contributor","Dublin Core:Rights","Dublin Core:Relation","Dublin Core:Format","Dublin Core:Language","Dublin Core:Type","Dublin Core:Identifier","Dublin Core:Coverage","Item Type Metadata:Text","Item Type Metadata:Interviewer","Item Type Metadata:Interviewee","Item Type Metadata:Location","Item Type Metadata:Transcription","Item Type Metadata:Local URL","Item Type Metadata:Original Format","Item Type Metadata:Physical Dimensions","Item Type Metadata:Duration","Item Type Metadata:Compression","Item Type Metadata:Producer","Item Type Metadata:Director","Item Type Metadata:Bit Rate/Frequency","Item Type Metadata:Time Summary","Item Type Metadata:Email Body","Item Type Metadata:Subject Line","Item Type Metadata:From","Item Type Metadata:To","Item Type Metadata:CC","Item Type Metadata:BCC","Item Type Metadata:Number of Attachments","Item Type Metadata:Standards","Item Type Metadata:Objectives","Item Type Metadata:Materials","Item Type Metadata:Lesson Plan Text","Item Type Metadata:URL","Item Type Metadata:Event Type","Item Type Metadata:Participants","Item Type Metadata:Birth Date","Item Type Metadata:Birthplace","Item Type Metadata:Death Date","Item Type Metadata:Occupation","Item Type Metadata:Biographical Text","Item Type Metadata:Bibliography","Item Type Metadata:Digital Reproduction Information","Item Type Metadata:Repository","Item Type Metadata:Repository Collection","Item Type Metadata:Contact information.","Item Type Metadata:File Name","Item Type Metadata:Notes","Item Type Metadata:Digital item created","Item Type Metadata:Digital item modified","Item Type Metadata:Executive Orders","Item Type Metadata:Record Created","Item Type Metadata:Record Modified","Item Type Metadata:Transcription2","Item Type Metadata:Source URL","Omeka Legacy File:Additional Creator","Omeka Legacy File:Transcriber","Omeka Legacy File:Producer","Omeka Legacy File:Render Device","Omeka Legacy File:Render Details","Omeka Legacy File:Capture Date","Omeka Legacy File:Capture Device","Omeka Legacy File:Capture Details","Omeka Legacy File:Change History","Omeka Legacy File:Watermark","Omeka Legacy File:Encryption","Omeka Legacy File:Compression","Omeka Legacy File:Post Processing","Omeka Image File:Width","Omeka Image File:Height","Omeka Image File:Bit Depth","Omeka Image File:Channels","Omeka Image File:Exif String","Omeka Image File:Exif Array","Omeka Image File:IPTC String","Omeka Image File:IPTC Array","Omeka Video File:Bitrate","Omeka Video File:Duration","Omeka Video File:Sample Rate","Omeka Video File:Codec","Omeka Video File:Width","Omeka Video File:Height",tags,file,itemType,collection,public,featured
64567,https://www.iowaheritage.org/items/show/64567,Yawn,"Governors|Branstad, Terry E.|Iowa|Rabbits|1980-1990|Politics|Politicians|Elections|Candidates|Campaigns|Races|Governors|Turtles",,"Duffy, Brian, 1955-",,"University of Iowa. Libraries. Special Collections Dept.",1985-07|2011-04,,"Educational use only, no other permissions given. Copyright to this digital object is owned by The Des Moines Register; it may not be downloaded, reproduced, or distributed without written permission. For more information, contact the Special Collections Department.","Editorial Cartoons of Brian Duffy; Des Moines Register Cartoonists|Papers of Brian Duffy|Des Moines Register",,English,"Still image|Editorial cartoons",MSC916|duffy-8507xx|http://digital.lib.uiowa.edu/cdm/ref/collection/duffy/id/405,,,,,,,,,,,,,,,,,,,,,,,,,,,,,,,,,,,,,,,,,,,,,,,,"<a href=""http://digital.lib.uiowa.edu/cdm/ref/collection/duffy/id/405"" target=""_blank"">View this item in its source respository</a>",,,,,,,,,,,,,,,,,,,,,,,,,,,,,https://www.iowaheritage.org/files/original/9de4396ac22003041f20851d1e762953.jpg,"Remote Item","Editorial Cartoons of Brian Duffy",1,0
9190,https://www.iowaheritage.org/items/show/9190,"Wasting a lot of good ammunition.","War|World War, 1939-1945|Hunting|finance|bonds|economics|investment|rabbits|squirrels.",,"Darling, Jay N. (Jay Norwood), 1876-1962","The Editorial cartoons of J.N. ""Ding"" Darling [electronic resource] : The Cowles Collection, Drake University, 1912-1962",,1944/07/03|1944,,"Copyright is owned by the ""Ding"" Darling Wildlife Society; it is administered on behalf of the Society by The University of Iowa. While use within the classroom is encouraged without specific authorization, publishing this cartoon in any format requires written permission. See policy and permissions procedure at: http://www.lib.uiowa.edu/spec-coll/services/dingdarling_fees.html","Cowles Library, Drake University, 2507 University Ave., Des Moines, IA 50311-4505.",,,,"440703.jpg|http://ddr.lib.drake.edu/u?/ddarling,6120",,,,,,,,,,,,,,,,,,,,,,,,,,,,,,,,,,,,,,,,,,,,,,,,"<a href=""http://ddr.lib.drake.edu/u?/ddarling,6120"" target=""_blank"">View this item in its source respository</a>",,,,,,,,,,,,,,,,,,,,,,,,,,,,,https://www.iowaheritage.org/files/original/63722bff0a9fb53802496b3095b3fa3c.jpg,"Remote Item","Editorial Cartoons of J.N. ""Ding"" Darling, Drake University",1,0
64351,https://www.iowaheritage.org/items/show/64351,"Wanted Gov. Branstad alias ""Safari Terry""","Governors|Branstad, Terry E.|Iowa|Forests|1980-1990|Hunting|Animals|Regulation|Trees|Animals|Antlers|Fish|Rabbits|Turkeys|Deer|Posters|Birds|Nails|Governors","Crime: Murder of an unarmed antelope; Wanted","Duffy, Brian, 1955-",,"University of Iowa. Libraries. Special Collections Dept.",1983-09-25|2011-04,,"Educational use only, no other permissions given. Copyright to this digital object is owned by The Des Moines Register; it may not be downloaded, reproduced, or distributed without written permission. For more information, contact the Special Collections Department.","Editorial Cartoons of Brian Duffy; Des Moines Register Cartoonists|Papers of Brian Duffy|Des Moines Register",,English,"Still image|Editorial cartoons",MSC916|duffy-830925|http://digital.lib.uiowa.edu/cdm/ref/collection/duffy/id/189,,,,,,,,,,,,,,,,,,,,,,,,,,,,,,,,,,,,,,,,,,,,,,,,"<a href=""http://digital.lib.uiowa.edu/cdm/ref/collection/duffy/id/189"" target=""_blank"">View this item in its source respository</a>",,,,,,,,,,,,,,,,,,,,,,,,,,,,,https://www.iowaheritage.org/files/original/0fcfd44d2ce45b4f0d869bcf52207993.jpg,"Remote Item","Editorial Cartoons of Brian Duffy",1,0
8387,https://www.iowaheritage.org/items/show/8387,"The unexpected offspring.","Government|Roosevelt, Franklin D. (Franklin Delano), 1882-1945|California|Rabbits|politics|New Deal|Townsend, Francis Everett, 1867-1960|hats.",,"Darling, Jay N. (Jay Norwood), 1876-1962","The Editorial cartoons of J.N. ""Ding"" Darling [electronic resource] : The Cowles Collection, Drake University, 1912-1962",,1938/09/13|1938,,"Copyright is owned by the ""Ding"" Darling Wildlife Society; it is administered on behalf of the Society by The University of Iowa. While use within the classroom is encouraged without specific authorization, publishing this cartoon in any format requires written permission. See policy and permissions procedure at: http://www.lib.uiowa.edu/spec-coll/services/dingdarling_fees.html","Cowles Library, Drake University, 2507 University Ave., Des Moines, IA 50311-4505.",,,,"380913.jpg|http://ddr.lib.drake.edu/u?/ddarling,5317",,,,,,,,,,,,,,,,,,,,,,,,,,,,,,,,,,,,,,,,,,,,,,,,"<a href=""http://ddr.lib.drake.edu/u?/ddarling,5317"" target=""_blank"">View this item in its source respository</a>",,,,,,,,,,,,,,,,,,,,,,,,,,,,,https://www.iowaheritage.org/files/original/a5b7d963e42fadcdc4bfa6d8525f7df4.jpg,"Remote Item","Editorial Cartoons of J.N. ""Ding"" Darling, Drake University",1,0
7299,https://www.iowaheritage.org/items/show/7299,"The sportsman's (?) alibi.","War|Kellogg, Frank Billings, 1856-1937|Sino-Japanese Conflict|China|Rabbits|peace|international relations|treaties|Kellogg peace treaty.|Japan|World|hunters|world.",,"Darling, Jay N. (Jay Norwood), 1876-1962","The Editorial cartoons of J.N. ""Ding"" Darling [electronic resource] : The Cowles Collection, Drake University, 1912-1962",,1931/10/18|1931,,"Copyright is owned by the ""Ding"" Darling Wildlife Society; it is administered on behalf of the Society by The University of Iowa. While use within the classroom is encouraged without specific authorization, publishing this cartoon in any format requires written permission. See policy and permissions procedure at: http://www.lib.uiowa.edu/spec-coll/services/dingdarling_fees.html","Cowles Library, Drake University, 2507 University Ave., Des Moines, IA 50311-4505.",,,,"311018.jpg|http://ddr.lib.drake.edu/u?/ddarling,4228",,,,,,,,,,,,,,,,,,,,,,,,,,,,,,,,,,,,,,,,,,,,,,,,"<a href=""http://ddr.lib.drake.edu/u?/ddarling,4228"" target=""_blank"">View this item in its source respository</a>",,,,,,,,,,,,,,,,,,,,,,,,,,,,,https://www.iowaheritage.org/files/original/89fbba0f5de7974ef2d64a735add037d.jpg,"Remote Item","Editorial Cartoons of J.N. ""Ding"" Darling, Drake University",1,0
10957,https://www.iowaheritage.org/items/show/10957,"Our favorite literature","Rabbits|United States -- Ohio -- Toledo|2000-2010|Women|Men","Flip book created from altered catalog cards.","Northwest Ohio Altered Artists",,"University of Iowa. Libraries. Special Collections Dept.",2005|2006-12-19|https://digital.lib.uiowa.edu/,,"Educational use only, no other permissions given. Copyright to this resource is held by the University of Iowa Libraries' Special Collections Department, and is provided here for educational purposes only. It may not be reproduced or distributed in any format without written permission of the Special Collections Department.","cARTalog|cARTalog Collection|http://www.lib.uiowa.edu/collguides/?MSC0859",jpeg|7.4|12.4,eng,"Artists' books; Flip books|Still image|Collages (Visual works); Bookworks",173618284,,,,,,,,,,,,,,,,,,,,,,,,,,,,,,,,,,,,,,,,,,,,,,,,,,,,,,,,,,,,,,,,,,,,,,,,,,,,,,"Remote Item","African American Women in Iowa Collection",1,0
3225,https://www.iowaheritage.org/items/show/3225,"Nothing doing.","Government|Wilson, Woodrow, 1856-1924|Rabbits|economics|incentives|military|national guard|cabbage|hunters|Uncle Sam.",,"Darling, Jay N. (Jay Norwood), 1876-1962","The Editorial cartoons of J.N. ""Ding"" Darling [electronic resource] : The Cowles Collection, Drake University, 1912-1962",,1916/11/26|1916,,"Copyright is owned by the ""Ding"" Darling Wildlife Society; it is administered on behalf of the Society by The University of Iowa. While use within the classroom is encouraged without specific authorization, publishing this cartoon in any format requires written permission. See policy and permissions procedure at: http://www.lib.uiowa.edu/spec-coll/services/dingdarling_fees.html","Cowles Library, Drake University, 2507 University Ave., Des Moines, IA 50311-4505.",,,,"161126.jpg|http://ddr.lib.drake.edu/u?/ddarling,354",,,,,,,,,,,,,,,,,,,,,,,,,,,,,,,,,,,,,,,,,,,,,,,,"<a href=""http://ddr.lib.drake.edu/u?/ddarling,354"" target=""_blank"">View this item in its source respository</a>",,,,,,,,,,,,,,,,,,,,,,,,,,,,,https://www.iowaheritage.org/files/original/d02ffab11f459a98501490beee00d839.jpg,"Remote Item","Editorial Cartoons of J.N. ""Ding"" Darling, Drake University",1,0
64495,https://www.iowaheritage.org/items/show/64495,"I think the heat has gotten to Dad","Christmas|United States|Christmas trees|1990-2000|Holidays|Winter|Weather|Men|Costumes|Fathers|Children|Thermometers|Sun|Eggs|Rabbits",,"Duffy, Brian, 1955-",,"University of Iowa. Libraries. Special Collections Dept.",1998-12-03|2011-04,,"Educational use only, no other permissions given. Copyright to this digital object is owned by The Des Moines Register; it may not be downloaded, reproduced, or distributed without written permission. For more information, contact the Special Collections Department.","Editorial Cartoons of Brian Duffy; Des Moines Register Cartoonists|Papers of Brian Duffy|Des Moines Register",,English,"Still image|Editorial cartoons",MSC916|duffy-981203|http://digital.lib.uiowa.edu/cdm/ref/collection/duffy/id/333,,,,,,,,,,,,,,,,,,,,,,,,,,,,,,,,,,,,,,,,,,,,,,,,"<a href=""http://digital.lib.uiowa.edu/cdm/ref/collection/duffy/id/333"" target=""_blank"">View this item in its source respository</a>",,,,,,,,,,,,,,,,,,,,,,,,,,,,,https://www.iowaheritage.org/files/original/e00d190a4c53b722250a1f9c0b7aac9a.jpg,"Remote Item","Editorial Cartoons of Brian Duffy",1,0
10905,https://www.iowaheritage.org/items/show/10905,"Girl in winter","Squirrels|United States -- Iowa -- Iowa City|2000-2010|Rabbits|Birds","Altered catalog cards containing cutouts and Xerox (TM) transfers.","White, Jessica",,"University of Iowa. Libraries. Special Collections Dept.",2005|2006-10-05|https://digital.lib.uiowa.edu/,,"Educational use only, no other permissions given. Copyright to this resource is held by the University of Iowa Libraries' Special Collections Department, and is provided here for educational purposes only. It may not be reproduced or distributed in any format without written permission of the Special Collections Department.","cARTalog|cARTalog Collection|http://www.lib.uiowa.edu/collguides/?MSC0859",jpeg,eng,"Still image|Collages (Visual works)",173618284,,,,,,,,,,,,,,,,,,,,,,,,,,,,,,,,,,,,,,,,,,,,,,,,,,,,,,,,,,,,,,,,,,,,,,,,,,,,,,"Remote Item","African American Women in Iowa Collection",1,0
9116,https://www.iowaheritage.org/items/show/9116,"Flirting with suicide.","Government|Rabbits|politics|labor|unions|strikes and lockouts|economics|inflation|hunters.",,"Darling, Jay N. (Jay Norwood), 1876-1962","The Editorial cartoons of J.N. ""Ding"" Darling [electronic resource] : The Cowles Collection, Drake University, 1912-1962",,1943/10/29|1943,,"Copyright is owned by the ""Ding"" Darling Wildlife Society; it is administered on behalf of the Society by The University of Iowa. While use within the classroom is encouraged without specific authorization, publishing this cartoon in any format requires written permission. See policy and permissions procedure at: http://www.lib.uiowa.edu/spec-coll/services/dingdarling_fees.html","Cowles Library, Drake University, 2507 University Ave., Des Moines, IA 50311-4505.",,,,"431029.jpg|http://ddr.lib.drake.edu/u?/ddarling,6046",,,,,,,,,,,,,,,,,,,,,,,,,,,,,,,,,,,,,,,,,,,,,,,,"<a href=""http://ddr.lib.drake.edu/u?/ddarling,6046"" target=""_blank"">View this item in its source respository</a>",,,,,,,,,,,,,,,,,,,,,,,,,,,,,https://www.iowaheritage.org/files/original/f10f850580800f12e1ff78de9b1431e3.jpg,"Remote Item","Editorial Cartoons of J.N. ""Ding"" Darling, Drake University",1,0
