 




﻿"Item Id","Item URI","Dublin Core:Title","Dublin Core:Subject","Dublin Core:Description","Dublin Core:Creator","Dublin Core:Source","Dublin Core:Publisher","Dublin Core:Date","Dublin Core:Contributor","Dublin Core:Rights","Dublin Core:Relation","Dublin Core:Format","Dublin Core:Language","Dublin Core:Type","Dublin Core:Identifier","Dublin Core:Coverage","Item Type Metadata:Text","Item Type Metadata:Interviewer","Item Type Metadata:Interviewee","Item Type Metadata:Location","Item Type Metadata:Transcription","Item Type Metadata:Local URL","Item Type Metadata:Original Format","Item Type Metadata:Physical Dimensions","Item Type Metadata:Duration","Item Type Metadata:Compression","Item Type Metadata:Producer","Item Type Metadata:Director","Item Type Metadata:Bit Rate/Frequency","Item Type Metadata:Time Summary","Item Type Metadata:Email Body","Item Type Metadata:Subject Line","Item Type Metadata:From","Item Type Metadata:To","Item Type Metadata:CC","Item Type Metadata:BCC","Item Type Metadata:Number of Attachments","Item Type Metadata:Standards","Item Type Metadata:Objectives","Item Type Metadata:Materials","Item Type Metadata:Lesson Plan Text","Item Type Metadata:URL","Item Type Metadata:Event Type","Item Type Metadata:Participants","Item Type Metadata:Birth Date","Item Type Metadata:Birthplace","Item Type Metadata:Death Date","Item Type Metadata:Occupation","Item Type Metadata:Biographical Text","Item Type Metadata:Bibliography","Item Type Metadata:Digital Reproduction Information","Item Type Metadata:Repository","Item Type Metadata:Repository Collection","Item Type Metadata:Contact information.","Item Type Metadata:File Name","Item Type Metadata:Notes","Item Type Metadata:Digital item created","Item Type Metadata:Digital item modified","Item Type Metadata:Executive Orders","Item Type Metadata:Record Created","Item Type Metadata:Record Modified","Item Type Metadata:Transcription2","Item Type Metadata:Source URL","Omeka Legacy File:Additional Creator","Omeka Legacy File:Transcriber","Omeka Legacy File:Producer","Omeka Legacy File:Render Device","Omeka Legacy File:Render Details","Omeka Legacy File:Capture Date","Omeka Legacy File:Capture Device","Omeka Legacy File:Capture Details","Omeka Legacy File:Change History","Omeka Legacy File:Watermark","Omeka Legacy File:Encryption","Omeka Legacy File:Compression","Omeka Legacy File:Post Processing","Omeka Image File:Width","Omeka Image File:Height","Omeka Image File:Bit Depth","Omeka Image File:Channels","Omeka Image File:Exif String","Omeka Image File:Exif Array","Omeka Image File:IPTC String","Omeka Image File:IPTC Array","Omeka Video File:Bitrate","Omeka Video File:Duration","Omeka Video File:Sample Rate","Omeka Video File:Codec","Omeka Video File:Width","Omeka Video File:Height",tags,file,itemType,collection,public,featured
68621,https://www.iowaheritage.org/items/show/68621,"Adah Frances Johnson funeral program, February 3, 1988","Women's suffrage|Johnson, Adah Frances|Young Women's Christian Association|United States -- Iowa -- Des Moines|1980-1990|Mothers|Families|Churches|Organizations",,unidentified,,"Iowa Women's Archives",1988-02-03|2011-02-28,,"Educational use only, no other permissions given. U.S. and International copyright laws may protect this item. Commercial use or distribution of this digital object is not permitted without written permission of the Iowa Women's Archives.","Iowa Women's Suffrage|Fowler, Gwendolyn Wilson|Obituaries and funeral programs, J",jpeg|14|11,,"Text; Still image|Programs (documents)",IWA0365|suf0365-07-15|http://digital.lib.uiowa.edu/cdm/ref/collection/suffrage/id/2860,,,,,,,,,,,,,,,,,,,,,,,,,,,,,,,,,,,,,,,,,,,,,,,,"<a href=""http://digital.lib.uiowa.edu/cdm/ref/collection/suffrage/id/2860"" target=""_blank"">View this item in its source respository</a>",,,,,,,,,,,,,,,,,,,,,,,,,,,,,https://www.iowaheritage.org/files/original/1b878e4f079e8920c9935ef35a15f66b.jpg,"Remote Item",,1,0
68588,https://www.iowaheritage.org/items/show/68588,"An account of the Iowa Federation of Women's Clubs, 1893-1927","Women's suffrage|Iowa Federation of Women's Clubs|United States -- Iowa|1920-1930|Organizations|Clubs|Clubwomen|Meetings",,"Howe, Anna B.",,"Iowa Women's Archives",1927|2011-01-24,,"Educational use only, no other permissions given. U.S. and International copyright laws may protect this item. Commercial use or distribution of this digital object is not permitted without written permission of the Iowa Women's Archives.","Iowa Women's Suffrage|Iowa Federation of Women's Clubs|http://www.lib.uiowa.edu/findingaids/IWATitleDetail.aspx?CollectionIdentifier=IWA0565|History, 1853-1988",jpeg|20|14,,"Text|Histories; Accounts",IWA0565|suf0565-01-01-01|http://digital.lib.uiowa.edu/cdm/ref/collection/suffrage/id/1928,,,,,,,,,,,,,,,,,,,,,,,,,,,,,,,,,,,,,,,,,,,,,,,,"<a href=""http://digital.lib.uiowa.edu/cdm/ref/collection/suffrage/id/1928"" target=""_blank"">View this item in its source respository</a>",,,,,,,,,,,,,,,,,,,,,,,,,,,,,https://www.iowaheritage.org/files/original/874bb75e4b006adf799b435de12bfc83.jpg,"Remote Item",,1,0
19854,https://www.iowaheritage.org/items/show/19854,"Archery club, The University of Iowa, 1940s","Women|University of Iowa. Dept. of Physical Education for Women|United States -- Iowa -- Iowa City|1940-1950|Students|Universities & colleges|Organizations|Men|Bows (Archery)|University of Iowa. Dept. of Health and Sport Studies|Women's Recreation Association (University of Iowa)",,unknown,,"University of Iowa. Libraries. Iowa Women's Archives",1940/1949|2008-06-11,,"Educational use only, no other permissions given. U.S. and international copyright laws may protect this item. Commercial use or distribution of this digital object is not permitted without written permission of the Iowa Women's Archives.","University of Iowa Physical Education for Women|The University of Iowa Department of Physical Education for Women Records, 1900-2006|http://www.lib.uiowa.edu/collguides/?IWA0106|WRA",jpeg|7|6,,"Still image|Photographs; Group portraits",IWA0106|uipe0869.jpg|https://digital.lib.uiowa.edu/,,,,,,,,,,,,,,,,,,,,,,,,,,,,,,,,,,,,,,,,,,,,,,,,"<a href=""https://digital.lib.uiowa.edu/"" target=""_blank"">View this item in its source respository</a>",,,,,,,,,,,,,,,,,,,,,,,,,,,,,https://www.iowaheritage.org/files/original/d09aa86183c7bc3526ee4fa9e6ab346c.jpg,"Remote Item","University of Iowa Physical Education for Women",1,0
68611,https://www.iowaheritage.org/items/show/68611,"Articles about women's suffrage movement, 1894-1895","Women's suffrage|Adams, Mary Newbury|Dubuque Ladies' Literary Association|United States -- Iowa|1890-1900|United States -- Georgia -- Atlanta|United States -- Iowa -- Dubuque|Organizations|Meetings|Women",,unidentified,,"Iowa Women's Archives",189-|2011-01-27,,"Educational use only, no other permissions given. U.S. and International copyright laws may protect this item. Commercial use or distribution of this digital object is not permitted without written permission of the Iowa Women's Archives.","Iowa Women's Suffrage|Robinson-Lacy Family papers|http://lib.uiowa.edu/collguides/?IWA0424|Unattached newspaper clippings, 1890s and undated",jpeg|36|22,,"Text|Clippings (information artifacts)",IWA0424|suf0424-02-07|http://digital.lib.uiowa.edu/cdm/ref/collection/suffrage/id/2789,,,,,,,,,,,,,,,,,,,,,,,,,,,,,,,,,,,,,,,,,,,,,,,,"<a href=""http://digital.lib.uiowa.edu/cdm/ref/collection/suffrage/id/2789"" target=""_blank"">View this item in its source respository</a>",,,,,,,,,,,,,,,,,,,,,,,,,,,,,https://www.iowaheritage.org/files/original/190e1aa72e0f225508f0067156df1510.jpg,"Remote Item",,1,0
68618,https://www.iowaheritage.org/items/show/68618,"Audra Alexander obituary, June 3, 1973","Women's suffrage|Alexander, Audra|Iowa Association of Colored Women|United States -- Iowa -- Des Moines|1970-1980|Women|Organizations|Spouses|National Association for the Advancement of Colored People",,unidentified,,"Des Moines Register (Des Moines, Iowa)|Iowa Women's Archives",1973-06-03|2011-02-28,,"Educational use only, no other permissions given. U.S. and International copyright laws may protect this item. Commercial use or distribution of this digital object is not permitted without written permission of the Iowa Women's Archives.","Iowa Women's Suffrage|Fowler, Gwendolyn Wilson|Obituaries and funeral programs, A",jpeg|16|10,,"Text; Still image|Clippings (information artifacts)",IWA0365|suf0365-07-08|http://digital.lib.uiowa.edu/cdm/ref/collection/suffrage/id/2839,,,,,,,,,,,,,,,,,,,,,,,,,,,,,,,,,,,,,,,,,,,,,,,,"<a href=""http://digital.lib.uiowa.edu/cdm/ref/collection/suffrage/id/2839"" target=""_blank"">View this item in its source respository</a>",,,,,,,,,,,,,,,,,,,,,,,,,,,,,https://www.iowaheritage.org/files/original/5eed2214b1bd13e46c5a263973500acd.jpg,"Remote Item",,1,0
68622,https://www.iowaheritage.org/items/show/68622,"Birdie B. Lewis funeral program, November 4, 1988","Women's suffrage|Lewis, Birdie B.|United States -- Iowa -- Des Moines|1980-1990|Mothers|Families|Churches|Organizations",,unidentified,,"Iowa Women's Archives",1988-11-04|2011-02-28,,"Educational use only, no other permissions given. U.S. and International copyright laws may protect this item. Commercial use or distribution of this digital object is not permitted without written permission of the Iowa Women's Archives.","Iowa Women's Suffrage|Fowler, Gwendolyn Wilson|Obituaries and funeral programs, L",jpeg|22|14,,"Text; Still image|Programs (documents)",IWA0365|suf0365-07-16|http://digital.lib.uiowa.edu/cdm/ref/collection/suffrage/id/2865,,,,,,,,,,,,,,,,,,,,,,,,,,,,,,,,,,,,,,,,,,,,,,,,"<a href=""http://digital.lib.uiowa.edu/cdm/ref/collection/suffrage/id/2865"" target=""_blank"">View this item in its source respository</a>",,,,,,,,,,,,,,,,,,,,,,,,,,,,,https://www.iowaheritage.org/files/original/8815d3848d69c0fb31ff8df8699a7d2d.jpg,"Remote Item",,1,0
16324,https://www.iowaheritage.org/items/show/16324,"Boulder Artists Guild exhibitions, notes and letters, 1976-1989","Art|Drewelowe, Eve, 1899-1988|Boulder Artists' Guild|United States -- Colorado -- Boulder|1970-1980|Artists|Exhibitions|Organizations|Boulder Center for the Visual Arts|1980-1990",,unidentified,,"University of Iowa. Libraries. Iowa Women's Archives",1976|2009-08-11,,"Educational use only, no other permissions given. U.S. and international copyright laws may protect this item. Commercial use or distribution of this digital object is not permitted without written permission of the Iowa Women's Archives and the School of Art and Art History, University of Iowa.","Eve Drewelowe Digital Collection|Eve Drewelowe papers, 1924-1995|http://lib.uiowa.edu/collguides/?IWA0135|Art career|Boulder Artists Guild",jpeg,,"Text; Still image|Exhibition catalogs; Correspondence",IWA035|05|drewe05-05|https://digital.lib.uiowa.edu/,,,,,,,,,,,,,,,,,,,,,,,,,,,,,,,,,,,,,,,,,,,,,,,,"<a href=""https://digital.lib.uiowa.edu/"" target=""_blank"">View this item in its source respository</a>",,,,,,,,,,,,,,,,,,,,,,,,,,,,,https://www.iowaheritage.org/files/original/e5c8073020ebd8da63c5bfbc6e0ed692.jpg,"Remote Item","Eve Drewelowe Digital Collection",1,0
16321,https://www.iowaheritage.org/items/show/16321,"Boulder Artists Guild newsletters, 1958-1989","Art|Drewelowe, Eve, 1899-1988|Boulder Artists' Guild|United States -- Colorado -- Boulder|Artists|Exhibitions|Organizations",,unidentified,,"University of Iowa. Libraries. Iowa Women's Archives",1958|2009-08-11,,"Educational use only, no other permissions given. U.S. and international copyright laws may protect this item. Commercial use or distribution of this digital object is not permitted without written permission of the Iowa Women's Archives and the School of Art and Art History, University of Iowa.","Eve Drewelowe Digital Collection|Eve Drewelowe papers, 1924-1995|http://lib.uiowa.edu/collguides/?IWA0135|Art career|Boulder Artists Guild",jpeg,,"Text; Still image|Newsletters",IWA035|05|drewe05-04|https://digital.lib.uiowa.edu/,,,,,,,,,,,,,,,,,,,,,,,,,,,,,,,,,,,,,,,,,,,,,,,,"<a href=""https://digital.lib.uiowa.edu/"" target=""_blank"">View this item in its source respository</a>",,,,,,,,,,,,,,,,,,,,,,,,,,,,,https://www.iowaheritage.org/files/original/1e3e7d4dc0fe958ef21c544f2a635edc.jpg,"Remote Item","Eve Drewelowe Digital Collection",1,0
68453,https://www.iowaheritage.org/items/show/68453,"Bulletin of the Johnson County League of Women Voters, October 1922","Women's suffrage|League of Women Voters (U.S.)|United States -- Iowa|1920-1930|Voting|Women|Political participation|Organizations|United States -- Iowa -- Iowa City",,unidentified,,"Iowa Printing Company|Iowa Women's Archives",1922-10|2010-10-20,,"Educational use only, no other permissions given. U.S. and International copyright laws may protect this item. Commercial use or distribution of this digital object is not permitted without written permission of the Iowa Women's Archives.","Iowa Women's Suffrage|League of Women Voters of Johnson County|http://www.lib.uiowa.edu/collguides/?IWA0021|Bulletin, Oct. 1922",jpeg|27|19,,Text|Bulletins,IWA0021|index.cpd|http://digital.lib.uiowa.edu/cdm/ref/collection/suffrage/id/309,,,,,,,,,,,,,,,,,,,,,,,,,,,,,,,,,,,,,,,,,,,,,,,,"<a href=""http://digital.lib.uiowa.edu/cdm/ref/collection/suffrage/id/309"" target=""_blank"">View this item in its source respository</a>",,,,,,,,,,,,,,,,,,,,,,,,,,,,,https://www.iowaheritage.org/files/original/f084c92278336e94dcd98ba7e152ebef.jpg,"Remote Item",,1,0
68514,https://www.iowaheritage.org/items/show/68514,"Cary Club minutes, 1913-1916","Women's suffrage|Cary, Phoebe, 1824-1871|United States -- Iowa -- Marion|1910-1920|Women|Organizations|Books|History|Public speaking|Meetings|Cary, Alice, 1820-1871","Women's study club founded in 1878 in Marion, Iowa.",unidentified,,"Iowa Women's Archives",191-|2010-10-20,,"Educational use only, no other permissions given. U.S. and International copyright laws may protect this item. Commercial use or distribution of this digital object is not permitted without written permission of the Iowa Women's Archives.","Iowa Women's Suffrage|Cary Club of Marion, Iowa|http://lib.uiowa.edu/collguides/?IWA0258|Minutes 1899-1918",jpeg|33|21,,"Text|Minutes; Clippings (information artifacts)",IWA0258|index.cpd|http://digital.lib.uiowa.edu/cdm/ref/collection/suffrage/id/1149,,,,,,,,,,,,,,,,,,,,,,,,,,,,,,,,,,,,,,,,,,,,,,,,"<a href=""http://digital.lib.uiowa.edu/cdm/ref/collection/suffrage/id/1149"" target=""_blank"">View this item in its source respository</a>",,,,,,,,,,,,,,,,,,,,,,,,,,,,,https://www.iowaheritage.org/files/original/1e7d19ab6253fea0bb37f3ea8e7c5050.jpg,"Remote Item",,1,0
