 




﻿"Item Id","Item URI","Dublin Core:Title","Dublin Core:Subject","Dublin Core:Description","Dublin Core:Creator","Dublin Core:Source","Dublin Core:Publisher","Dublin Core:Date","Dublin Core:Contributor","Dublin Core:Rights","Dublin Core:Relation","Dublin Core:Format","Dublin Core:Language","Dublin Core:Type","Dublin Core:Identifier","Dublin Core:Coverage","Item Type Metadata:Text","Item Type Metadata:Interviewer","Item Type Metadata:Interviewee","Item Type Metadata:Location","Item Type Metadata:Transcription","Item Type Metadata:Local URL","Item Type Metadata:Original Format","Item Type Metadata:Physical Dimensions","Item Type Metadata:Duration","Item Type Metadata:Compression","Item Type Metadata:Producer","Item Type Metadata:Director","Item Type Metadata:Bit Rate/Frequency","Item Type Metadata:Time Summary","Item Type Metadata:Email Body","Item Type Metadata:Subject Line","Item Type Metadata:From","Item Type Metadata:To","Item Type Metadata:CC","Item Type Metadata:BCC","Item Type Metadata:Number of Attachments","Item Type Metadata:Standards","Item Type Metadata:Objectives","Item Type Metadata:Materials","Item Type Metadata:Lesson Plan Text","Item Type Metadata:URL","Item Type Metadata:Event Type","Item Type Metadata:Participants","Item Type Metadata:Birth Date","Item Type Metadata:Birthplace","Item Type Metadata:Death Date","Item Type Metadata:Occupation","Item Type Metadata:Biographical Text","Item Type Metadata:Bibliography","Item Type Metadata:Digital Reproduction Information","Item Type Metadata:Repository","Item Type Metadata:Repository Collection","Item Type Metadata:Contact information.","Item Type Metadata:File Name","Item Type Metadata:Notes","Item Type Metadata:Digital item created","Item Type Metadata:Digital item modified","Item Type Metadata:Executive Orders","Item Type Metadata:Record Created","Item Type Metadata:Record Modified","Item Type Metadata:Transcription2","Item Type Metadata:Source URL","Omeka Legacy File:Additional Creator","Omeka Legacy File:Transcriber","Omeka Legacy File:Producer","Omeka Legacy File:Render Device","Omeka Legacy File:Render Details","Omeka Legacy File:Capture Date","Omeka Legacy File:Capture Device","Omeka Legacy File:Capture Details","Omeka Legacy File:Change History","Omeka Legacy File:Watermark","Omeka Legacy File:Encryption","Omeka Legacy File:Compression","Omeka Legacy File:Post Processing","Omeka Image File:Width","Omeka Image File:Height","Omeka Image File:Bit Depth","Omeka Image File:Channels","Omeka Image File:Exif String","Omeka Image File:Exif Array","Omeka Image File:IPTC String","Omeka Image File:IPTC Array","Omeka Video File:Bitrate","Omeka Video File:Duration","Omeka Video File:Sample Rate","Omeka Video File:Codec","Omeka Video File:Width","Omeka Video File:Height",tags,file,itemType,collection,public,featured
72268,https://www.iowaheritage.org/items/show/72268,"Worburg Aparatus, 1955","Chemistry|Laboratory|Equipment|Iowa State University|","A female student in a white lab coat using a Worburg apparatus. The Worburg apparatus was widely used in biochemical and biological research for measuring rates of reaction in which gases are involved. The student is noting readings in a lab record book.|The Iowa Agricultural College and Model Farm offered chemistry classes to its first classes in 1869.  The department was formally established in 1871, and served students in Agriculture, Engineering, Science, Home Economics and Veterinary Medicine.  The Chemical and Physical Laboratory was constructed in 1870-1871, and after it burned in 1913, a new building, Chemistry Hall, was built to replace it.  Department Chair, Winfred Coover (1914-1944) expanded the teaching system and emphasized independent research throughout World War I and the post-war period.  With the advent of the Ames Laboratory and World War II, the Chemistry Department further developed its cutting edge and interdisciplinary research programs in addition to its teaching. In 1973, Chemistry Hall was renamed Gilman Hall, in honor of Distinguished Professor of Chemistry, Henry Gilman.  The Department also has laboratories, classrooms and offices in Hach Hall.  The Chemistry Department is now part of the College of Liberal Arts and Sciences at Iowa State University, and also frequently partners with the Ames Laboratory.","Iowa State University",13-6-F.Chemistry.1052-4-1,"Iowa State University Library Special Collections; http://www.add.lib.iastate.edu/spcl/index.html",1955|2005-10-07,,"U.S. and international copyright laws protect this digital image. Commercial use or distribution of the image is not permitted without prior permission of the copyright holder. For permission to use the digital image, please contact Iowa State University Library, Special Collections archives@iastate.edu  For reproductions see:  http://www.add.lib.iastate.edu/spcl/services/photfees.html","University Photographs; http://www.add.lib.iastate.edu/spcl/collections/images.html","Photograph| 11.8 x 9.2 cm",,"Still Image (grayscale)|Image",13-6-F.Chemistry.1052-4-1|https://digitalcollections.lib.iastate.edu/,,,,,,,,,,,,,,,,,,,,,,,,,,,,,,,,,,,,,,,,,,,,,,,,"<a href=""https://digitalcollections.lib.iastate.edu/"" target=""_blank"">View this item in its source respository</a>",,,,,,,,,,,,,,,,,,,,,,,,,,,,,https://www.iowaheritage.org/files/original/679a15eb5d62133fc35652be01543ff4.jpg,"Remote Item",,1,0
67125,https://www.iowaheritage.org/items/show/67125,"Worburg Aparatus, 1955","Chemistry|Laboratory|Equipment|Iowa State University|","A female student in a white lab coat using a Worburg apparatus. The Worburg apparatus was widely used in biochemical and biological research for measuring rates of reaction in which gases are involved. The student is noting readings in a lab record book.|The Iowa Agricultural College and Model Farm offered chemistry classes to its first classes in 1869.  The department was formally established in 1871, and served students in Agriculture, Engineering, Science, Home Economics and Veterinary Medicine.  The Chemical and Physical Laboratory was constructed in 1870-1871, and after it burned in 1913, a new building, Chemistry Hall, was built to replace it.  Department Chair, Winfred Coover (1914-1944) expanded the teaching system and emphasized independent research throughout World War I and the post-war period.  With the advent of the Ames Laboratory and World War II, the Chemistry Department further developed its cutting edge and interdisciplinary research programs in addition to its teaching. In 1973, Chemistry Hall was renamed Gilman Hall, in honor of Distinguished Professor of Chemistry, Henry Gilman.  The Department also has laboratories, classrooms and offices in Hach Hall.  The Chemistry Department is now part of the College of Liberal Arts and Sciences at Iowa State University, and also frequently partners with the Ames Laboratory.","Iowa State University",13-6-F.Chemistry.1052-4-1,"Iowa State University Library Special Collections; http://www.add.lib.iastate.edu/spcl/index.html",1955|2005-10-07,,"U.S. and international copyright laws protect this digital image. Commercial use or distribution of the image is not permitted without prior permission of the copyright holder. For permission to use the digital image, please contact Iowa State University Library, Special Collections archives@iastate.edu  For reproductions see:  http://www.add.lib.iastate.edu/spcl/services/photfees.html","University Photographs; http://www.add.lib.iastate.edu/spcl/collections/images.html","Photograph| 11.8 x 9.2 cm",,"Still Image (grayscale)|Image",13-6-F.Chemistry.1052-4-1|https://digitalcollections.lib.iastate.edu/,,,,,,,,,,,,,,,,,,,,,,,,,,,,,,,,,,,,,,,,,,,,,,,,"<a href=""https://digitalcollections.lib.iastate.edu/"" target=""_blank"">View this item in its source respository</a>",,,,,,,,,,,,,,,,,,,,,,,,,,,,,https://www.iowaheritage.org/files/original/a8b5342cc8e95e36a7a9eef65ee44bd2.jpg,"Remote Item","Iowa State University Library Photograph Collection",1,0
2934,https://www.iowaheritage.org/items/show/2934,"Wanted: a child welfare bureau.                                                             (Top): What the state does for the family pig.                                       (Bottom): And what the state does for the human family.","Human nature|Laboratory|science|health|medicine|agriculture|crib.",,"Darling, Jay N. (Jay Norwood), 1876-1962","The Editorial cartoons of J.N. ""Ding"" Darling [electronic resource] : The Cowles Collection, Drake University, 1912-1962",,1915/04/02|1915,,"Copyright is owned by the ""Ding"" Darling Wildlife Society; it is administered on behalf of the Society by The University of Iowa. While use within the classroom is encouraged without specific authorization, publishing this cartoon in any format requires written permission. See policy and permissions procedure at: http://www.lib.uiowa.edu/spec-coll/services/dingdarling_fees.html","Cowles Library, Drake University, 2507 University Ave., Des Moines, IA 50311-4505.",,,,"150402.jpg|http://ddr.lib.drake.edu/u?/ddarling,63",,,,,,,,,,,,,,,,,,,,,,,,,,,,,,,,,,,,,,,,,,,,,,,,"<a href=""http://ddr.lib.drake.edu/u?/ddarling,63"" target=""_blank"">View this item in its source respository</a>",,,,,,,,,,,,,,,,,,,,,,,,,,,,,https://www.iowaheritage.org/files/original/b321888a7ea805e1b01e2beb885c6b67.jpg,"Remote Item","Editorial Cartoons of J.N. ""Ding"" Darling, Drake University",1,0
72277,https://www.iowaheritage.org/items/show/72277,"Students in chemistry laboratory, 1959","Chemistry|Laboratory|Iowa State University|","The balance room used for quantitative analysis. Contiquous fumehoods line both walls of a long narrow room, down the center aisle of which are arranged chairs at each fume hood work station. Sitting back to back in two rows, students are occupied in their individual experiments.|The Iowa Agricultural College and Model Farm offered chemistry classes to its first classes in 1869.  The department was formally established in 1871, and served students in Agriculture, Engineering, Science, Home Economics and Veterinary Medicine.  The Chemical and Physical Laboratory was constructed in 1870-1871, and after it burned in 1913, a new building, Chemistry Hall, was built to replace it.  Department Chair, Winfred Coover (1914-1944) expanded the teaching system and emphasized independent research throughout World War I and the post-war period.  With the advent of the Ames Laboratory and World War II, the Chemistry Department further developed its cutting edge and interdisciplinary research programs in addition to its teaching. In 1973, Chemistry Hall was renamed Gilman Hall, in honor of Distinguished Professor of Chemistry, Henry Gilman.  The Department also has laboratories, classrooms and offices in Hach Hall.  The Chemistry Department is now part of the College of Liberal Arts and Sciences at Iowa State University, and also frequently partners with the Ames Laboratory.","Iowa State University",13-6-F.Chemistry.1052-6-4,"Iowa State University Library Special Collections; http://www.add.lib.iastate.edu/spcl/index.html",1959|2005-10-07,,"U.S. and international copyright laws protect this digital image. Commercial use or distribution of the image is not permitted without prior permission of the copyright holder. For permission to use the digital image, please contact Iowa State University Library, Special Collections archives@iastate.edu  For reproductions see:  http://www.add.lib.iastate.edu/spcl/services/photfees.html","University Photographs; http://www.add.lib.iastate.edu/spcl/collections/images.html","Photograph| 12.1 x 9.5 cm",,"Still Image (grayscale)|Image",13-6-F.Chemistry.1052-6-4|https://digitalcollections.lib.iastate.edu/,,,,,,,,,,,,,,,,,,,,,,,,,,,,,,,,,,,,,,,,,,,,,,,,"<a href=""https://digitalcollections.lib.iastate.edu/"" target=""_blank"">View this item in its source respository</a>",,,,,,,,,,,,,,,,,,,,,,,,,,,,,https://www.iowaheritage.org/files/original/cf66b0944fb60b7214df18f52414c362.jpg,"Remote Item",,1,0
67134,https://www.iowaheritage.org/items/show/67134,"Students in chemistry laboratory, 1959","Chemistry|Laboratory|Iowa State University|","The balance room used for quantitative analysis. Contiquous fumehoods line both walls of a long narrow room, down the center aisle of which are arranged chairs at each fume hood work station. Sitting back to back in two rows, students are occupied in their individual experiments.|The Iowa Agricultural College and Model Farm offered chemistry classes to its first classes in 1869.  The department was formally established in 1871, and served students in Agriculture, Engineering, Science, Home Economics and Veterinary Medicine.  The Chemical and Physical Laboratory was constructed in 1870-1871, and after it burned in 1913, a new building, Chemistry Hall, was built to replace it.  Department Chair, Winfred Coover (1914-1944) expanded the teaching system and emphasized independent research throughout World War I and the post-war period.  With the advent of the Ames Laboratory and World War II, the Chemistry Department further developed its cutting edge and interdisciplinary research programs in addition to its teaching. In 1973, Chemistry Hall was renamed Gilman Hall, in honor of Distinguished Professor of Chemistry, Henry Gilman.  The Department also has laboratories, classrooms and offices in Hach Hall.  The Chemistry Department is now part of the College of Liberal Arts and Sciences at Iowa State University, and also frequently partners with the Ames Laboratory.","Iowa State University",13-6-F.Chemistry.1052-6-4,"Iowa State University Library Special Collections; http://www.add.lib.iastate.edu/spcl/index.html",1959|2005-10-07,,"U.S. and international copyright laws protect this digital image. Commercial use or distribution of the image is not permitted without prior permission of the copyright holder. For permission to use the digital image, please contact Iowa State University Library, Special Collections archives@iastate.edu  For reproductions see:  http://www.add.lib.iastate.edu/spcl/services/photfees.html","University Photographs; http://www.add.lib.iastate.edu/spcl/collections/images.html","Photograph| 12.1 x 9.5 cm",,"Still Image (grayscale)|Image",13-6-F.Chemistry.1052-6-4|https://digitalcollections.lib.iastate.edu/,,,,,,,,,,,,,,,,,,,,,,,,,,,,,,,,,,,,,,,,,,,,,,,,"<a href=""https://digitalcollections.lib.iastate.edu/"" target=""_blank"">View this item in its source respository</a>",,,,,,,,,,,,,,,,,,,,,,,,,,,,,https://www.iowaheritage.org/files/original/0d0264133c5a12cbe3a9a6b9edd8f6b4.jpg,"Remote Item","Iowa State University Library Photograph Collection",1,0
72251,https://www.iowaheritage.org/items/show/72251,"Students in chemistry laboratory, 1900","Chemistry|Laboratory|Iowa State University|","Men and women in a college chemistry laboratory. An adjoining laboratory, full of students, can be seen through a double arched doorway. A female student in the foreground appears to be wearing one of the men's hats.|The Iowa Agricultural College and Model Farm offered chemistry classes to its first classes in 1869.  The department was formally established in 1871, and served students in Agriculture, Engineering, Science, Home Economics and Veterinary Medicine.  The Chemical and Physical Laboratory was constructed in 1870-1871, and after it burned in 1913, a new building, Chemistry Hall, was built to replace it.  Department Chair, Winfred Coover (1914-1944) expanded the teaching system and emphasized independent research throughout World War I and the post-war period.  With the advent of the Ames Laboratory and World War II, the Chemistry Department further developed its cutting edge and interdisciplinary research programs in addition to its teaching. In 1973, Chemistry Hall was renamed Gilman Hall, in honor of Distinguished Professor of Chemistry, Henry Gilman.  The Department also has laboratories, classrooms and offices in Hach Hall.  The Chemistry Department is now part of the College of Liberal Arts and Sciences at Iowa State University, and also frequently partners with the Ames Laboratory.","Iowa State University",13-6-F.Chemistry.1052-1-4,"Iowa State University Library Special Collections; http://www.add.lib.iastate.edu/spcl/index.html",1900|2005-10-07,,"U.S. and international copyright laws protect this digital image. Commercial use or distribution of the image is not permitted without prior permission of the copyright holder. For permission to use the digital image, please contact Iowa State University Library, Special Collections archives@iastate.edu  For reproductions see:  http://www.add.lib.iastate.edu/spcl/services/photfees.html","University Photographs; http://www.add.lib.iastate.edu/spcl/collections/images.html","Photograph| 24.1 x 19.5 cm",,"Still Image (grayscale)|Image",13-6-F.Chemistry.1052-1-4|https://digitalcollections.lib.iastate.edu/,,,,,,,,,,,,,,,,,,,,,,,,,,,,,,,,,,,,,,,,,,,,,,,,"<a href=""https://digitalcollections.lib.iastate.edu/"" target=""_blank"">View this item in its source respository</a>",,,,,,,,,,,,,,,,,,,,,,,,,,,,,https://www.iowaheritage.org/files/original/4328c6a60205ba7c7573a0868508a899.jpg,"Remote Item",,1,0
67108,https://www.iowaheritage.org/items/show/67108,"Students in chemistry laboratory, 1900","Chemistry|Laboratory|Iowa State University|","Men and women in a college chemistry laboratory. An adjoining laboratory, full of students, can be seen through a double arched doorway. A female student in the foreground appears to be wearing one of the men's hats.|The Iowa Agricultural College and Model Farm offered chemistry classes to its first classes in 1869.  The department was formally established in 1871, and served students in Agriculture, Engineering, Science, Home Economics and Veterinary Medicine.  The Chemical and Physical Laboratory was constructed in 1870-1871, and after it burned in 1913, a new building, Chemistry Hall, was built to replace it.  Department Chair, Winfred Coover (1914-1944) expanded the teaching system and emphasized independent research throughout World War I and the post-war period.  With the advent of the Ames Laboratory and World War II, the Chemistry Department further developed its cutting edge and interdisciplinary research programs in addition to its teaching. In 1973, Chemistry Hall was renamed Gilman Hall, in honor of Distinguished Professor of Chemistry, Henry Gilman.  The Department also has laboratories, classrooms and offices in Hach Hall.  The Chemistry Department is now part of the College of Liberal Arts and Sciences at Iowa State University, and also frequently partners with the Ames Laboratory.","Iowa State University",13-6-F.Chemistry.1052-1-4,"Iowa State University Library Special Collections; http://www.add.lib.iastate.edu/spcl/index.html",1900|2005-10-07,,"U.S. and international copyright laws protect this digital image. Commercial use or distribution of the image is not permitted without prior permission of the copyright holder. For permission to use the digital image, please contact Iowa State University Library, Special Collections archives@iastate.edu  For reproductions see:  http://www.add.lib.iastate.edu/spcl/services/photfees.html","University Photographs; http://www.add.lib.iastate.edu/spcl/collections/images.html","Photograph| 24.1 x 19.5 cm",,"Still Image (grayscale)|Image",13-6-F.Chemistry.1052-1-4|https://digitalcollections.lib.iastate.edu/,,,,,,,,,,,,,,,,,,,,,,,,,,,,,,,,,,,,,,,,,,,,,,,,"<a href=""https://digitalcollections.lib.iastate.edu/"" target=""_blank"">View this item in its source respository</a>",,,,,,,,,,,,,,,,,,,,,,,,,,,,,https://www.iowaheritage.org/files/original/d76d25d2c9b6858f9a096c17159bf314.jpg,"Remote Item","Iowa State University Library Photograph Collection",1,0
72274,https://www.iowaheritage.org/items/show/72274,"Students in chemistry laboratory , 1959","Chemistry|Laboratory|Iowa State University|","Four female students in white lab coats conducting an experiment in a chemistry laboratory. Two of the students are at the counter and two are to the rear watching while taking notes.|The Iowa Agricultural College and Model Farm offered chemistry classes to its first classes in 1869.  The department was formally established in 1871, and served students in Agriculture, Engineering, Science, Home Economics and Veterinary Medicine.  The Chemical and Physical Laboratory was constructed in 1870-1871, and after it burned in 1913, a new building, Chemistry Hall, was built to replace it.  Department Chair, Winfred Coover (1914-1944) expanded the teaching system and emphasized independent research throughout World War I and the post-war period.  With the advent of the Ames Laboratory and World War II, the Chemistry Department further developed its cutting edge and interdisciplinary research programs in addition to its teaching. In 1973, Chemistry Hall was renamed Gilman Hall, in honor of Distinguished Professor of Chemistry, Henry Gilman.  The Department also has laboratories, classrooms and offices in Hach Hall.  The Chemistry Department is now part of the College of Liberal Arts and Sciences at Iowa State University, and also frequently partners with the Ames Laboratory.","Iowa State University",13-6-F.Chemistry.1052-6-1,"Iowa State University Library Special Collections; http://www.add.lib.iastate.edu/spcl/index.html",1959|2005-10-07,,"U.S. and international copyright laws protect this digital image. Commercial use or distribution of the image is not permitted without prior permission of the copyright holder. For permission to use the digital image, please contact Iowa State University Library, Special Collections archives@iastate.edu  For reproductions see:  http://www.add.lib.iastate.edu/spcl/services/photfees.html","University Photographs; http://www.add.lib.iastate.edu/spcl/collections/images.html","Photograph| 11.9 x 8.5 cm",,"Still Image (grayscale)|Image",13-6-F.Chemistry.1052-6-1|https://digitalcollections.lib.iastate.edu/,,,,,,,,,,,,,,,,,,,,,,,,,,,,,,,,,,,,,,,,,,,,,,,,"<a href=""https://digitalcollections.lib.iastate.edu/"" target=""_blank"">View this item in its source respository</a>",,,,,,,,,,,,,,,,,,,,,,,,,,,,,https://www.iowaheritage.org/files/original/0eae5153bea69e8a06af5b4f35d06710.jpg,"Remote Item",,1,0