 




﻿"Item Id","Item URI","Dublin Core:Title","Dublin Core:Subject","Dublin Core:Description","Dublin Core:Creator","Dublin Core:Source","Dublin Core:Publisher","Dublin Core:Date","Dublin Core:Contributor","Dublin Core:Rights","Dublin Core:Relation","Dublin Core:Format","Dublin Core:Language","Dublin Core:Type","Dublin Core:Identifier","Dublin Core:Coverage","Item Type Metadata:Text","Item Type Metadata:Interviewer","Item Type Metadata:Interviewee","Item Type Metadata:Location","Item Type Metadata:Transcription","Item Type Metadata:Local URL","Item Type Metadata:Original Format","Item Type Metadata:Physical Dimensions","Item Type Metadata:Duration","Item Type Metadata:Compression","Item Type Metadata:Producer","Item Type Metadata:Director","Item Type Metadata:Bit Rate/Frequency","Item Type Metadata:Time Summary","Item Type Metadata:Email Body","Item Type Metadata:Subject Line","Item Type Metadata:From","Item Type Metadata:To","Item Type Metadata:CC","Item Type Metadata:BCC","Item Type Metadata:Number of Attachments","Item Type Metadata:Standards","Item Type Metadata:Objectives","Item Type Metadata:Materials","Item Type Metadata:Lesson Plan Text","Item Type Metadata:URL","Item Type Metadata:Event Type","Item Type Metadata:Participants","Item Type Metadata:Birth Date","Item Type Metadata:Birthplace","Item Type Metadata:Death Date","Item Type Metadata:Occupation","Item Type Metadata:Biographical Text","Item Type Metadata:Bibliography","Item Type Metadata:Digital Reproduction Information","Item Type Metadata:Repository","Item Type Metadata:Repository Collection","Item Type Metadata:Contact information.","Item Type Metadata:File Name","Item Type Metadata:Notes","Item Type Metadata:Digital item created","Item Type Metadata:Digital item modified","Item Type Metadata:Executive Orders","Item Type Metadata:Record Created","Item Type Metadata:Record Modified","Item Type Metadata:Transcription2","Item Type Metadata:Source URL","Omeka Legacy File:Additional Creator","Omeka Legacy File:Transcriber","Omeka Legacy File:Producer","Omeka Legacy File:Render Device","Omeka Legacy File:Render Details","Omeka Legacy File:Capture Date","Omeka Legacy File:Capture Device","Omeka Legacy File:Capture Details","Omeka Legacy File:Change History","Omeka Legacy File:Watermark","Omeka Legacy File:Encryption","Omeka Legacy File:Compression","Omeka Legacy File:Post Processing","Omeka Image File:Width","Omeka Image File:Height","Omeka Image File:Bit Depth","Omeka Image File:Channels","Omeka Image File:Exif String","Omeka Image File:Exif Array","Omeka Image File:IPTC String","Omeka Image File:IPTC Array","Omeka Video File:Bitrate","Omeka Video File:Duration","Omeka Video File:Sample Rate","Omeka Video File:Codec","Omeka Video File:Width","Omeka Video File:Height",tags,file,itemType,collection,public,featured
67531,https://www.iowaheritage.org/items/show/67531,"Homecoming Central Committee, 1966","Iowa State University|Homecoming|Homecoming Central Committee","The 1966 Central Homecoming Committee is shown in a formal portrait.  Five members are seated on a sofa while the other committee members stand in a row behind them.|Alumni first began returning to Iowa State for an official Homecoming in 1912. Since then, the celebration continues to entertain both young and old Iowa Staters, with traditional events, including tailgate parties, fireworks, lawn displays, """"Yell Like Hell"""" cheering competition, and mass campaniling. Currently, the Student Alumni Association Leadership Council coordinates the efforts of hundreds of students, who volunteer their time to help Story County Habitat for Humanity build a house.","Iowa State University",22-07-G.Homecoming.1651-13-3,"Iowa State University Library Special Collections: http://www.add.lib.iastate.edu/spcl/index.html",1966|2007-09,,"U.S. and international copyright laws protect this digital image. Commercial use or distribution of the image is not permitted without prior permission of the copyright holder. For permission to use the digital image, please contact Iowa State University Library, Special Collections archives@iastate.edu  For reproductions see:  http://www.add.lib.iastate.edu/spcl/services/photfees.html","University Photographs; http://www.add.lib.iastate.edu/spcl/collections/images.html","Photograph| 12.1 x 9.5 cm",,Image|Image,22-07-G.Homecoming.1651-13-3|https://digitalcollections.lib.iastate.edu/,,,,,,,,,,,,,,,,,,,,,,,,,,,,,,,,,,,,,,,,,,,,,,,,"<a href=""https://digitalcollections.lib.iastate.edu/"" target=""_blank"">View this item in its source respository</a>",,,,,,,,,,,,,,,,,,,,,,,,,,,,,https://www.iowaheritage.org/files/original/b4736715fde09d888fbb01b687d2b00e.jpg,"Remote Item","Iowa State University Library Photograph Collection",1,0
67659,https://www.iowaheritage.org/items/show/67659,"Homecoming Central Committee, 1966","Iowa State University|Homecoming|Homecoming Central Committee","The seven women and ten men of the Homecoming Central Committee sit on or stand behind a sofa, 1966.|Alumni first began returning to Iowa State for an official Homecoming in 1912. Since then, the celebration continues to entertain both young and old Iowa Staters, with traditional events, including tailgate parties, fireworks, lawn displays, """"Yell Like Hell"""" cheering competition, and mass campaniling. Currently, the Student Alumni Association Leadership Council coordinates the efforts of hundreds of students, who volunteer their time to help Story County Habitat for Humanity build a house.","Elder; Iowa State University",22-07-G.Homecoming.1666-03-01,"Iowa State University Library Special Collections: http://www.add.lib.iastate.edu/spcl/index.html",1966|2012-05,,"U.S. and international copyright laws protect this digital image. Commercial use or distribution of the image is not permitted without prior permission of the copyright holder. For permission to use the digital image, please contact Iowa State University Library, Special Collections archives@iastate.edu  For reproductions see:  http://www.add.lib.iastate.edu/spcl/services/photfees.html","University Photographs; http://www.add.lib.iastate.edu/spcl/collections/images.html","Photograph| 12.1 x 9.7 cm",,Image|Image,22-07-G.Homecoming.1666-03-01|https://digitalcollections.lib.iastate.edu/,,,,,,,,,,,,,,,,,,,,,,,,,,,,,,,,,,,,,,,,,,,,,,,,"<a href=""https://digitalcollections.lib.iastate.edu/"" target=""_blank"">View this item in its source respository</a>",,,,,,,,,,,,,,,,,,,,,,,,,,,,,https://www.iowaheritage.org/files/original/36427e3c070f82e81fa6bc107d431c9b.jpg,"Remote Item","Iowa State University Library Photograph Collection",1,0
72674,https://www.iowaheritage.org/items/show/72674,"Homecoming Central Committee, 1966","Iowa State University|Homecoming|Homecoming Central Committee","The 1966 Central Homecoming Committee is shown in a formal portrait.  Five members are seated on a sofa while the other committee members stand in a row behind them.|Alumni first began returning to Iowa State for an official Homecoming in 1912. Since then, the celebration continues to entertain both young and old Iowa Staters, with traditional events, including tailgate parties, fireworks, lawn displays, """"Yell Like Hell"""" cheering competition, and mass campaniling. Currently, the Student Alumni Association Leadership Council coordinates the efforts of hundreds of students, who volunteer their time to help Story County Habitat for Humanity build a house.","Iowa State University",22-07-G.Homecoming.1651-13-3,"Iowa State University Library Special Collections: http://www.add.lib.iastate.edu/spcl/index.html",1966|2007-09,,"U.S. and international copyright laws protect this digital image. Commercial use or distribution of the image is not permitted without prior permission of the copyright holder. For permission to use the digital image, please contact Iowa State University Library, Special Collections archives@iastate.edu  For reproductions see:  http://www.add.lib.iastate.edu/spcl/services/photfees.html","University Photographs; http://www.add.lib.iastate.edu/spcl/collections/images.html","Photograph| 12.1 x 9.5 cm",,Image|Image,22-07-G.Homecoming.1651-13-3|https://digitalcollections.lib.iastate.edu/,,,,,,,,,,,,,,,,,,,,,,,,,,,,,,,,,,,,,,,,,,,,,,,,"<a href=""https://digitalcollections.lib.iastate.edu/"" target=""_blank"">View this item in its source respository</a>",,,,,,,,,,,,,,,,,,,,,,,,,,,,,https://www.iowaheritage.org/files/original/3d70ef63d173daffcc45a80f16d8beff.jpg,"Remote Item",,1,0
72802,https://www.iowaheritage.org/items/show/72802,"Homecoming Central Committee, 1966","Iowa State University|Homecoming|Homecoming Central Committee","The seven women and ten men of the Homecoming Central Committee sit on or stand behind a sofa, 1966.|Alumni first began returning to Iowa State for an official Homecoming in 1912. Since then, the celebration continues to entertain both young and old Iowa Staters, with traditional events, including tailgate parties, fireworks, lawn displays, """"Yell Like Hell"""" cheering competition, and mass campaniling. Currently, the Student Alumni Association Leadership Council coordinates the efforts of hundreds of students, who volunteer their time to help Story County Habitat for Humanity build a house.","Elder; Iowa State University",22-07-G.Homecoming.1666-03-01,"Iowa State University Library Special Collections: http://www.add.lib.iastate.edu/spcl/index.html",1966|2012-05,,"U.S. and international copyright laws protect this digital image. Commercial use or distribution of the image is not permitted without prior permission of the copyright holder. For permission to use the digital image, please contact Iowa State University Library, Special Collections archives@iastate.edu  For reproductions see:  http://www.add.lib.iastate.edu/spcl/services/photfees.html","University Photographs; http://www.add.lib.iastate.edu/spcl/collections/images.html","Photograph| 12.1 x 9.7 cm",,Image|Image,22-07-G.Homecoming.1666-03-01|https://digitalcollections.lib.iastate.edu/,,,,,,,,,,,,,,,,,,,,,,,,,,,,,,,,,,,,,,,,,,,,,,,,"<a href=""https://digitalcollections.lib.iastate.edu/"" target=""_blank"">View this item in its source respository</a>",,,,,,,,,,,,,,,,,,,,,,,,,,,,,https://www.iowaheritage.org/files/original/a975f11af323a8e490e5829f2c1baf97.jpg,"Remote Item",,1,0
67721,https://www.iowaheritage.org/items/show/67721,"Homecoming Central Committee, 1982","Iowa State University|Homecoming|Homecoming Central Committee","The Homecoming Central Committee poses by the Memorial Union fountain with the Campanile in the background, 1982.|Alumni first began returning to Iowa State for an official Homecoming in 1912. Since then, the celebration continues to entertain both young and old Iowa Staters, with traditional events, including tailgate parties, fireworks, lawn displays, """"Yell Like Hell"""" cheering competition, and mass campaniling. Currently, the Student Alumni Association Leadership Council coordinates the efforts of hundreds of students, who volunteer their time to help Story County Habitat for Humanity build a house.","Iowa State University",22-07-G.Homecoming.1666-12-02,"Iowa State University Library Special Collections: http://www.add.lib.iastate.edu/spcl/index.html",1982|2012-05,,"U.S. and international copyright laws protect this digital image. Commercial use or distribution of the image is not permitted without prior permission of the copyright holder. For permission to use the digital image, please contact Iowa State University Library, Special Collections archives@iastate.edu  For reproductions see:  http://www.add.lib.iastate.edu/spcl/services/photfees.html","University Photographs; http://www.add.lib.iastate.edu/spcl/collections/images.html","Photograph| 23.7 x 17.4 cm",,Image|Image,22-07-G.Homecoming.1666-12-02|https://digitalcollections.lib.iastate.edu/,,,,,,,,,,,,,,,,,,,,,,,,,,,,,,,,,,,,,,,,,,,,,,,,"<a href=""https://digitalcollections.lib.iastate.edu/"" target=""_blank"">View this item in its source respository</a>",,,,,,,,,,,,,,,,,,,,,,,,,,,,,https://www.iowaheritage.org/files/original/4db16b451570e0947b3d5f58cffcaf89.jpg,"Remote Item","Iowa State University Library Photograph Collection",1,0
72864,https://www.iowaheritage.org/items/show/72864,"Homecoming Central Committee, 1982","Iowa State University|Homecoming|Homecoming Central Committee","The Homecoming Central Committee poses by the Memorial Union fountain with the Campanile in the background, 1982.|Alumni first began returning to Iowa State for an official Homecoming in 1912. Since then, the celebration continues to entertain both young and old Iowa Staters, with traditional events, including tailgate parties, fireworks, lawn displays, """"Yell Like Hell"""" cheering competition, and mass campaniling. Currently, the Student Alumni Association Leadership Council coordinates the efforts of hundreds of students, who volunteer their time to help Story County Habitat for Humanity build a house.","Iowa State University",22-07-G.Homecoming.1666-12-02,"Iowa State University Library Special Collections: http://www.add.lib.iastate.edu/spcl/index.html",1982|2012-05,,"U.S. and international copyright laws protect this digital image. Commercial use or distribution of the image is not permitted without prior permission of the copyright holder. For permission to use the digital image, please contact Iowa State University Library, Special Collections archives@iastate.edu  For reproductions see:  http://www.add.lib.iastate.edu/spcl/services/photfees.html","University Photographs; http://www.add.lib.iastate.edu/spcl/collections/images.html","Photograph| 23.7 x 17.4 cm",,Image|Image,22-07-G.Homecoming.1666-12-02|https://digitalcollections.lib.iastate.edu/,,,,,,,,,,,,,,,,,,,,,,,,,,,,,,,,,,,,,,,,,,,,,,,,"<a href=""https://digitalcollections.lib.iastate.edu/"" target=""_blank"">View this item in its source respository</a>",,,,,,,,,,,,,,,,,,,,,,,,,,,,,https://www.iowaheritage.org/files/original/d95ab8ff2d9db9423549f0519ac90451.jpg,"Remote Item",,1,0
67732,https://www.iowaheritage.org/items/show/67732,"Homecoming Central Committee, 1987","Iowa State University|Homecoming|Homecoming Central Committee|Marching Band|Football Field","The Homecoming Central Committee for 1987 poses pregame by the football field with the ISU Marching Band performing in the background.  They are left to right, 1st row: Julie Newman, Laura Butler, Jan Harnel, Heidi Hova, Tim Schumann; 2nd row: Mike Capp, Todd Appenzeller, Darren Hiov, Darrel Burt, Todd Allard; 3rd row: Marty Epy, Terry Helphrey, Dan Jones, Craig Jodan; 4th row: Mark Weikel, Jim Carter, John Bauerle, Steve Geadelmann.|Alumni first began returning to Iowa State for an official Homecoming in 1912. Since then, the celebration continues to entertain both young and old Iowa Staters, with traditional events, including tailgate parties, fireworks, lawn displays, """"Yell Like Hell"""" cheering competition, and mass campaniling. Currently, the Student Alumni Association Leadership Council coordinates the efforts of hundreds of students, who volunteer their time to help Story County Habitat for Humanity build a house.","Iowa State University",22-07-G.Homecoming.1666-13-03,"Iowa State University Library Special Collections: http://www.add.lib.iastate.edu/spcl/index.html",1987|2012-05,,"U.S. and international copyright laws protect this digital image. Commercial use or distribution of the image is not permitted without prior permission of the copyright holder. For permission to use the digital image, please contact Iowa State University Library, Special Collections archives@iastate.edu  For reproductions see:  http://www.add.lib.iastate.edu/spcl/services/photfees.html","University Photographs; http://www.add.lib.iastate.edu/spcl/collections/images.html","Photograph| 23.0 x 15.2 cm",,Image|Image,22-07-G.Homecoming.1666-13-03|https://digitalcollections.lib.iastate.edu/,,,,,,,,,,,,,,,,,,,,,,,,,,,,,,,,,,,,,,,,,,,,,,,,"<a href=""https://digitalcollections.lib.iastate.edu/"" target=""_blank"">View this item in its source respository</a>",,,,,,,,,,,,,,,,,,,,,,,,,,,,,https://www.iowaheritage.org/files/original/fdeda5ae5fef2907166b741397344191.jpg,"Remote Item","Iowa State University Library Photograph Collection",1,0
72875,https://www.iowaheritage.org/items/show/72875,"Homecoming Central Committee, 1987","Iowa State University|Homecoming|Homecoming Central Committee|Marching Band|Football Field","The Homecoming Central Committee for 1987 poses pregame by the football field with the ISU Marching Band performing in the background.  They are left to right, 1st row: Julie Newman, Laura Butler, Jan Harnel, Heidi Hova, Tim Schumann; 2nd row: Mike Capp, Todd Appenzeller, Darren Hiov, Darrel Burt, Todd Allard; 3rd row: Marty Epy, Terry Helphrey, Dan Jones, Craig Jodan; 4th row: Mark Weikel, Jim Carter, John Bauerle, Steve Geadelmann.|Alumni first began returning to Iowa State for an official Homecoming in 1912. Since then, the celebration continues to entertain both young and old Iowa Staters, with traditional events, including tailgate parties, fireworks, lawn displays, """"Yell Like Hell"""" cheering competition, and mass campaniling. Currently, the Student Alumni Association Leadership Council coordinates the efforts of hundreds of students, who volunteer their time to help Story County Habitat for Humanity build a house.","Iowa State University",22-07-G.Homecoming.1666-13-03,"Iowa State University Library Special Collections: http://www.add.lib.iastate.edu/spcl/index.html",1987|2012-05,,"U.S. and international copyright laws protect this digital image. Commercial use or distribution of the image is not permitted without prior permission of the copyright holder. For permission to use the digital image, please contact Iowa State University Library, Special Collections archives@iastate.edu  For reproductions see:  http://www.add.lib.iastate.edu/spcl/services/photfees.html","University Photographs; http://www.add.lib.iastate.edu/spcl/collections/images.html","Photograph| 23.0 x 15.2 cm",,Image|Image,22-07-G.Homecoming.1666-13-03|https://digitalcollections.lib.iastate.edu/,,,,,,,,,,,,,,,,,,,,,,,,,,,,,,,,,,,,,,,,,,,,,,,,"<a href=""https://digitalcollections.lib.iastate.edu/"" target=""_blank"">View this item in its source respository</a>",,,,,,,,,,,,,,,,,,,,,,,,,,,,,https://www.iowaheritage.org/files/original/78a1c488f463dce34c67af2a4f7678d8.jpg,"Remote Item",,1,0
67498,https://www.iowaheritage.org/items/show/67498,"President James A. Hilton receiving $1500 check from the Central Homecoming Committee, 1955","Iowa State University|Homecoming|Homecoming Central Committee","James A. Hilton is seated at a table surrounded by five young men.  They are: Front row (left to right): Unidentified committee member, James A. Holtin, unidentified committee member; Back row (left to right): Larry E. Barnes, Jan Rakow, Dr. Darrrel Metcafe.  The Committee is presenting Dr. Hilton with a check for $1500.00 for Hilton's Dream Center which later became the Iowa State Center.|Alumni first began returning to Iowa State for an official Homecoming in 1912. Since then, the celebration continues to entertain both young and old Iowa Staters, with traditional events, including tailgate parties, fireworks, lawn displays, """"Yell Like Hell"""" cheering competition, and mass campaniling. Currently, the Student Alumni Association Leadership Council coordinates the efforts of hundreds of students, who volunteer their time to help Story County Habitat for Humanity build a house.","Iowa State University",22-07-G.Homecoming.1651-9-1,"Iowa State University Library Special Collections: http://www.add.lib.iastate.edu/spcl/index.html",1955?|2007-09,,"U.S. and international copyright laws protect this digital image. Commercial use or distribution of the image is not permitted without prior permission of the copyright holder. For permission to use the digital image, please contact Iowa State University Library, Special Collections archives@iastate.edu  For reproductions see:  http://www.add.lib.iastate.edu/spcl/services/photfees.html","University Photographs; http://www.add.lib.iastate.edu/spcl/collections/images.html","Photograph| 16.5 x 12.1 cm",,Image|Image,22-07-G.Homecoming.1651-9-1|https://digitalcollections.lib.iastate.edu/,,,,,,,,,,,,,,,,,,,,,,,,,,,,,,,,,,,,,,,,,,,,,,,,"<a href=""https://digitalcollections.lib.iastate.edu/"" target=""_blank"">View this item in its source respository</a>",,,,,,,,,,,,,,,,,,,,,,,,,,,,,https://www.iowaheritage.org/files/original/da7adafa2b4f8d1c2804127478b283e8.jpg,"Remote Item","Iowa State University Library Photograph Collection",1,0
72641,https://www.iowaheritage.org/items/show/72641,"President James A. Hilton receiving $1500 check from the Central Homecoming Committee, 1955","Iowa State University|Homecoming|Homecoming Central Committee","James A. Hilton is seated at a table surrounded by five young men.  They are: Front row (left to right): Unidentified committee member, James A. Holtin, unidentified committee member; Back row (left to right): Larry E. Barnes, Jan Rakow, Dr. Darrrel Metcafe.  The Committee is presenting Dr. Hilton with a check for $1500.00 for Hilton's Dream Center which later became the Iowa State Center.|Alumni first began returning to Iowa State for an official Homecoming in 1912. Since then, the celebration continues to entertain both young and old Iowa Staters, with traditional events, including tailgate parties, fireworks, lawn displays, """"Yell Like Hell"""" cheering competition, and mass campaniling. Currently, the Student Alumni Association Leadership Council coordinates the efforts of hundreds of students, who volunteer their time to help Story County Habitat for Humanity build a house.","Iowa State University",22-07-G.Homecoming.1651-9-1,"Iowa State University Library Special Collections: http://www.add.lib.iastate.edu/spcl/index.html",1955?|2007-09,,"U.S. and international copyright laws protect this digital image. Commercial use or distribution of the image is not permitted without prior permission of the copyright holder. For permission to use the digital image, please contact Iowa State University Library, Special Collections archives@iastate.edu  For reproductions see:  http://www.add.lib.iastate.edu/spcl/services/photfees.html","University Photographs; http://www.add.lib.iastate.edu/spcl/collections/images.html","Photograph| 16.5 x 12.1 cm",,Image|Image,22-07-G.Homecoming.1651-9-1|https://digitalcollections.lib.iastate.edu/,,,,,,,,,,,,,,,,,,,,,,,,,,,,,,,,,,,,,,,,,,,,,,,,"<a href=""https://digitalcollections.lib.iastate.edu/"" target=""_blank"">View this item in its source respository</a>",,,,,,,,,,,,,,,,,,,,,,,,,,,,,https://www.iowaheritage.org/files/original/470691f54db92c6b15cc6782405c32e4.jpg,"Remote Item",,1,0
