 




﻿"Item Id","Item URI","Dublin Core:Title","Dublin Core:Subject","Dublin Core:Description","Dublin Core:Creator","Dublin Core:Source","Dublin Core:Publisher","Dublin Core:Date","Dublin Core:Contributor","Dublin Core:Rights","Dublin Core:Relation","Dublin Core:Format","Dublin Core:Language","Dublin Core:Type","Dublin Core:Identifier","Dublin Core:Coverage","Item Type Metadata:Text","Item Type Metadata:Interviewer","Item Type Metadata:Interviewee","Item Type Metadata:Location","Item Type Metadata:Transcription","Item Type Metadata:Local URL","Item Type Metadata:Original Format","Item Type Metadata:Physical Dimensions","Item Type Metadata:Duration","Item Type Metadata:Compression","Item Type Metadata:Producer","Item Type Metadata:Director","Item Type Metadata:Bit Rate/Frequency","Item Type Metadata:Time Summary","Item Type Metadata:Email Body","Item Type Metadata:Subject Line","Item Type Metadata:From","Item Type Metadata:To","Item Type Metadata:CC","Item Type Metadata:BCC","Item Type Metadata:Number of Attachments","Item Type Metadata:Standards","Item Type Metadata:Objectives","Item Type Metadata:Materials","Item Type Metadata:Lesson Plan Text","Item Type Metadata:URL","Item Type Metadata:Event Type","Item Type Metadata:Participants","Item Type Metadata:Birth Date","Item Type Metadata:Birthplace","Item Type Metadata:Death Date","Item Type Metadata:Occupation","Item Type Metadata:Biographical Text","Item Type Metadata:Bibliography","Item Type Metadata:Digital Reproduction Information","Item Type Metadata:Repository","Item Type Metadata:Repository Collection","Item Type Metadata:Contact information.","Item Type Metadata:File Name","Item Type Metadata:Notes","Item Type Metadata:Digital item created","Item Type Metadata:Digital item modified","Item Type Metadata:Executive Orders","Item Type Metadata:Record Created","Item Type Metadata:Record Modified","Item Type Metadata:Transcription2","Item Type Metadata:Source URL","Omeka Legacy File:Additional Creator","Omeka Legacy File:Transcriber","Omeka Legacy File:Producer","Omeka Legacy File:Render Device","Omeka Legacy File:Render Details","Omeka Legacy File:Capture Date","Omeka Legacy File:Capture Device","Omeka Legacy File:Capture Details","Omeka Legacy File:Change History","Omeka Legacy File:Watermark","Omeka Legacy File:Encryption","Omeka Legacy File:Compression","Omeka Legacy File:Post Processing","Omeka Image File:Width","Omeka Image File:Height","Omeka Image File:Bit Depth","Omeka Image File:Channels","Omeka Image File:Exif String","Omeka Image File:Exif Array","Omeka Image File:IPTC String","Omeka Image File:IPTC Array","Omeka Video File:Bitrate","Omeka Video File:Duration","Omeka Video File:Sample Rate","Omeka Video File:Codec","Omeka Video File:Width","Omeka Video File:Height",tags,file,itemType,collection,public,featured
79094,https://www.iowaheritage.org/items/show/79094,"Women's Fashion in the Early 1900's in Oskaloosa, Iowa","Women's|Fashion|Clothing|Dresses|Hats|Style|Early 20th Century|Oskaloosa|Iowa|Mahaska County","Fashion is an ever-evolving concept that makes others ponder over why people wore certain clothes or adopted a certain clothing style during a particular time era, especially in the United States.  This image depicts the style worn by women in the early 20th Century in downtown Oskaloosa, Iowa, the heart of America.","Chuck Russell","Chuck Russell","Chuck Russell","""2009-08-12""",,www.wmpenn.edu/library/about.html,,"still image/jpeg 2000",,image,"www.wmpenn.edu/library/about.html|http://cdm16125.contentdm.oclc.org/u?/p270701coll6,294",,,,,,,,,,,,,,,,,,,,,,,,,,,,,,,,,,,,,,,,,,,,,,,,"<a href=""http://cdm16125.contentdm.oclc.org/u?/p270701coll6,294"" target=""_blank"">View this item in its source respository</a>",,,,,,,,,,,,,,,,,,,,,,,,,,,,,https://www.iowaheritage.org/files/original/7b7a14ff149779e498d0b9e76b42bcc6.jpg,"Remote Item","Mahaska History",1,0
78973,https://www.iowaheritage.org/items/show/78973,"Women's Fashion in Oskaloosa, Iowa, Circa 1910","Women|Fashion|Early 20th Century|Clothing|Hats","As time moves on, everybody tries to keep up with the clothing trends of their time.  Pictured here is a young female standing outside a building in Oskaloosa, Iowa wearing the trendy clothing of her day around 1910.","Chuck Russell","Chuck Russell","Chuck Russell","""2009-06-12""",,www.wmpenn.edu/library/about.html,,"still image/jpeg 2000",,image,"www.wmpenn.edu/library/about.html|http://cdm16125.contentdm.oclc.org/u?/p270701coll6,232",,,,,,,,,,,,,,,,,,,,,,,,,,,,,,,,,,,,,,,,,,,,,,,,"<a href=""http://cdm16125.contentdm.oclc.org/u?/p270701coll6,232"" target=""_blank"">View this item in its source respository</a>",,,,,,,,,,,,,,,,,,,,,,,,,,,,,https://www.iowaheritage.org/files/original/6360928a8ba4ba2bedbd202492e61e7e.jpg,"Remote Item","Mahaska History",1,0
68561,https://www.iowaheritage.org/items/show/68561,"""A spring day at Bellevue IA,"" 1910s","Children|Fences|Hats|United States -- Iowa -- Bellevue|1910-1920",,unknown,,"University of Iowa. Libraries. Iowa Women's Archives",1910/1919|2007-07-10,,"No known copyright restrictions.","Noble Photographs|Noble Photograph collection|http://www.lib.uiowa.edu/collguides/?IWA0031",14|9,,"Still image; Text|Photographic postcards; Correspondence|jpeg",IWA0031|160192410|http://digital.lib.uiowa.edu/cdm/ref/collection/noble/id/1311,,,,,,,,,,,,,,,,,,,,,,,,,,,,,,,,,,,,,,,,,,,,,,,,"<a href=""http://digital.lib.uiowa.edu/cdm/ref/collection/noble/id/1311"" target=""_blank"">View this item in its source respository</a>",,,,,,,,,,,,,,,,,,,,,,,,,,,,,https://www.iowaheritage.org/files/original/f541f29fcb33c03d64fa7a21ae557b97.jpg,"Remote Item","Mary Noble Historical Photograph Collection",1,0
68553,https://www.iowaheritage.org/items/show/68553,"Boy and girl wearing hats and sitting, Iowa, 1900s","Boys|Girls|Hats|United States -- Iowa|1900-1910",,unknown,,"University of Iowa. Libraries. Iowa Women's Archives",1910/1919|2007-07-10,,"No known copyright restrictions.","Noble Photographs|Noble Photograph collection|http://www.lib.uiowa.edu/collguides/?IWA0031",14|9,,"Still image; Text|Studio portraits|jpeg",IWA0031|160192410|http://digital.lib.uiowa.edu/cdm/ref/collection/noble/id/1293,,,,,,,,,,,,,,,,,,,,,,,,,,,,,,,,,,,,,,,,,,,,,,,,"<a href=""http://digital.lib.uiowa.edu/cdm/ref/collection/noble/id/1293"" target=""_blank"">View this item in its source respository</a>",,,,,,,,,,,,,,,,,,,,,,,,,,,,,https://www.iowaheritage.org/files/original/f79f158acc0f6113cfa357f040b28233.jpg,"Remote Item","Mary Noble Historical Photograph Collection",1,0
68531,https://www.iowaheritage.org/items/show/68531,"""Yes,"" May 25, 1909","Men|Women|Hats|Marriage proposals|Gebhardt, Julia|United States -- Iowa -- Des Moines|1900-1910",,unknown,,"University of Iowa. Libraries. Iowa Women's Archives",1909-05-25|2007-07-10,,"Material in the public domain. No restrictions on use.","Noble Photographs|Noble Photograph collection|http://www.lib.uiowa.edu/collguides/?IWA0031",14|9,,"Still image; Text|Picture postcards; Correspondence|jpeg",IWA0031|160192410|http://digital.lib.uiowa.edu/cdm/ref/collection/noble/id/1251,,,,,,,,,,,,,,,,,,,,,,,,,,,,,,,,,,,,,,,,,,,,,,,,"<a href=""http://digital.lib.uiowa.edu/cdm/ref/collection/noble/id/1251"" target=""_blank"">View this item in its source respository</a>",,,,,,,,,,,,,,,,,,,,,,,,,,,,,https://www.iowaheritage.org/files/original/d176b55bcf60e42b7e3fab891cb528aa.jpg,"Remote Item","Mary Noble Historical Photograph Collection",1,0
68488,https://www.iowaheritage.org/items/show/68488,"""A happy Easter,"" April 6, 1912","Chickens|Pipes (smoking)|Hats|Jacobs, S.|United States -- Illinois -- Chicago|United States -- Iowa -- Des Moines|1910-1920",,unknown,,"University of Iowa. Libraries. Iowa Women's Archives",1912-04-06|2007-07-10,,"Material in the public domain. No restrictions on use.","Noble Photographs|Noble Photograph collection|http://www.lib.uiowa.edu/collguides/?IWA0031",,,"Still image; Text|Picture postcards; Correspondence; Easter cards|jpeg",IWA0031|160192410|http://digital.lib.uiowa.edu/cdm/ref/collection/noble/id/1149,,,,,,,,,,,,,,,,,,,,,,,,,,,,,,,,,,,,,,,,,,,,,,,,"<a href=""http://digital.lib.uiowa.edu/cdm/ref/collection/noble/id/1149"" target=""_blank"">View this item in its source respository</a>",,,,,,,,,,,,,,,,,,,,,,,,,,,,,https://www.iowaheritage.org/files/original/3fbc481365bc039e82ba8af664ebd466.jpg,"Remote Item","Mary Noble Historical Photograph Collection",1,0
68452,https://www.iowaheritage.org/items/show/68452,"Woman in blue with hat and scarf, July 14, 1908","Women|Hats|Scarves|Jacobs, Hattie|United States -- Iowa -- Des Moines|1900-1910",,unknown,,"University of Iowa. Libraries. Iowa Women's Archives",1908-07-14|2007-07-10,,"Material in the public domain. No restrictions on use.","Noble Photographs|Noble Photograph collection|http://www.lib.uiowa.edu/collguides/?IWA0031",14|9,,"Still image; Text|Picture postcards; Correspondence|jpeg",IWA0031|160192410|http://digital.lib.uiowa.edu/cdm/ref/collection/noble/id/1095,,,,,,,,,,,,,,,,,,,,,,,,,,,,,,,,,,,,,,,,,,,,,,,,"<a href=""http://digital.lib.uiowa.edu/cdm/ref/collection/noble/id/1095"" target=""_blank"">View this item in its source respository</a>",,,,,,,,,,,,,,,,,,,,,,,,,,,,,https://www.iowaheritage.org/files/original/4959092602c69876329fd13b874e19cd.jpg,"Remote Item","Mary Noble Historical Photograph Collection",1,0
68423,https://www.iowaheritage.org/items/show/68423,"""Miss Kangaroo,"" 1904","Women|Hats|Clothing & dress|Jacobs, Hattie|United States -- Iowa -- Des Moines|1900-1910",,"Jansson, A. L.",,"Jansson Cards|University of Iowa. Libraries. Iowa Women's Archives",1904|2007-07-10,,"Material in the public domain. No restrictions on use.","Noble Photographs|Noble Photograph collection|http://www.lib.uiowa.edu/collguides/?IWA0031",14|9,,"Still image; Text|Picture postcards; Correspondence|jpeg",IWA0031|160192410|http://digital.lib.uiowa.edu/cdm/ref/collection/noble/id/1020,,,,,,,,,,,,,,,,,,,,,,,,,,,,,,,,,,,,,,,,,,,,,,,,"<a href=""http://digital.lib.uiowa.edu/cdm/ref/collection/noble/id/1020"" target=""_blank"">View this item in its source respository</a>",,,,,,,,,,,,,,,,,,,,,,,,,,,,,https://www.iowaheritage.org/files/original/06ae5482d623b8f5d9ec03a251781ee7.jpg,"Remote Item","Mary Noble Historical Photograph Collection",1,0
68419,https://www.iowaheritage.org/items/show/68419,"Women wearing hats sitting at train depot, Donnellson, Iowa, 1910s","Women|Hats|Railroad stations|United States -- Iowa -- Donnellson|1910-1920",,unknown,,"University of Iowa. Libraries. Iowa Women's Archives",1910/1919|2007-06-28,,"No known copyright restrictions.","Noble Photographs|Noble Photograph collection|http://www.lib.uiowa.edu/collguides/?IWA0031",9|14,,"Still image; Text|Photographic postcards|jpeg",IWA0031|160192410|http://digital.lib.uiowa.edu/cdm/ref/collection/noble/id/1008,,,,,,,,,,,,,,,,,,,,,,,,,,,,,,,,,,,,,,,,,,,,,,,,"<a href=""http://digital.lib.uiowa.edu/cdm/ref/collection/noble/id/1008"" target=""_blank"">View this item in its source respository</a>",,,,,,,,,,,,,,,,,,,,,,,,,,,,,https://www.iowaheritage.org/files/original/0ea108ee2bf45cce37bbec7511fe8c85.jpg,"Remote Item","Mary Noble Historical Photograph Collection",1,0
68404,https://www.iowaheritage.org/items/show/68404,"Man and women posing in hayfield wearing large straw hats, Iowa, 1910s","Men|Women|Hats|Haystacks|United States -- Iowa|1910-1920",,unknown,,"University of Iowa. Libraries. Iowa Women's Archives",1910/1919|2007-06-28,,"No known copyright restrictions.","Noble Photographs|Noble Photograph collection|http://www.lib.uiowa.edu/collguides/?IWA0031",9|14,,"Still image|Photographic postcards|jpeg",IWA0031|160192410|http://digital.lib.uiowa.edu/cdm/ref/collection/noble/id/963,,,,,,,,,,,,,,,,,,,,,,,,,,,,,,,,,,,,,,,,,,,,,,,,"<a href=""http://digital.lib.uiowa.edu/cdm/ref/collection/noble/id/963"" target=""_blank"">View this item in its source respository</a>",,,,,,,,,,,,,,,,,,,,,,,,,,,,,https://www.iowaheritage.org/files/original/986dd9d00bd7083c21a0ea8347b754af.jpg,"Remote Item","Mary Noble Historical Photograph Collection",1,0
