 




﻿"Item Id","Item URI","Dublin Core:Title","Dublin Core:Subject","Dublin Core:Description","Dublin Core:Creator","Dublin Core:Source","Dublin Core:Publisher","Dublin Core:Date","Dublin Core:Contributor","Dublin Core:Rights","Dublin Core:Relation","Dublin Core:Format","Dublin Core:Language","Dublin Core:Type","Dublin Core:Identifier","Dublin Core:Coverage","Item Type Metadata:Text","Item Type Metadata:Interviewer","Item Type Metadata:Interviewee","Item Type Metadata:Location","Item Type Metadata:Transcription","Item Type Metadata:Local URL","Item Type Metadata:Original Format","Item Type Metadata:Physical Dimensions","Item Type Metadata:Duration","Item Type Metadata:Compression","Item Type Metadata:Producer","Item Type Metadata:Director","Item Type Metadata:Bit Rate/Frequency","Item Type Metadata:Time Summary","Item Type Metadata:Email Body","Item Type Metadata:Subject Line","Item Type Metadata:From","Item Type Metadata:To","Item Type Metadata:CC","Item Type Metadata:BCC","Item Type Metadata:Number of Attachments","Item Type Metadata:Standards","Item Type Metadata:Objectives","Item Type Metadata:Materials","Item Type Metadata:Lesson Plan Text","Item Type Metadata:URL","Item Type Metadata:Event Type","Item Type Metadata:Participants","Item Type Metadata:Birth Date","Item Type Metadata:Birthplace","Item Type Metadata:Death Date","Item Type Metadata:Occupation","Item Type Metadata:Biographical Text","Item Type Metadata:Bibliography","Item Type Metadata:Digital Reproduction Information","Item Type Metadata:Repository","Item Type Metadata:Repository Collection","Item Type Metadata:Contact information.","Item Type Metadata:File Name","Item Type Metadata:Notes","Item Type Metadata:Digital item created","Item Type Metadata:Digital item modified","Item Type Metadata:Executive Orders","Item Type Metadata:Record Created","Item Type Metadata:Record Modified","Item Type Metadata:Transcription2","Item Type Metadata:Source URL","Omeka Legacy File:Additional Creator","Omeka Legacy File:Transcriber","Omeka Legacy File:Producer","Omeka Legacy File:Render Device","Omeka Legacy File:Render Details","Omeka Legacy File:Capture Date","Omeka Legacy File:Capture Device","Omeka Legacy File:Capture Details","Omeka Legacy File:Change History","Omeka Legacy File:Watermark","Omeka Legacy File:Encryption","Omeka Legacy File:Compression","Omeka Legacy File:Post Processing","Omeka Image File:Width","Omeka Image File:Height","Omeka Image File:Bit Depth","Omeka Image File:Channels","Omeka Image File:Exif String","Omeka Image File:Exif Array","Omeka Image File:IPTC String","Omeka Image File:IPTC Array","Omeka Video File:Bitrate","Omeka Video File:Duration","Omeka Video File:Sample Rate","Omeka Video File:Codec","Omeka Video File:Width","Omeka Video File:Height",tags,file,itemType,collection,public,featured
64663,https://www.iowaheritage.org/items/show/64663,"You can't fire me, I quit!","Congress|United States|United States. Congress -- Elections, 1992|Arms|1990-2000|Voters|Votes|Voting|Retirement|Elections -- Congressional|Washington (D.C.)|Hands|Congressmen|Hats|Doors|Briefcases|Monuments","Voters; Congressmen; Retirement; Exit","Duffy, Brian, 1955-",,"University of Iowa. Libraries. Special Collections Dept.",1992-04-29|2011-04,,"Educational use only, no other permissions given. Copyright to this digital object is owned by The Des Moines Register; it may not be downloaded, reproduced, or distributed without written permission. For more information, contact the Special Collections Department.","Editorial Cartoons of Brian Duffy; Des Moines Register Cartoonists|Papers of Brian Duffy|Des Moines Register",,English,"Still image|Editorial cartoons",MSC916|duffy-920429|http://digital.lib.uiowa.edu/cdm/ref/collection/duffy/id/501,,,,,,,,,,,,,,,,,,,,,,,,,,,,,,,,,,,,,,,,,,,,,,,,"<a href=""http://digital.lib.uiowa.edu/cdm/ref/collection/duffy/id/501"" target=""_blank"">View this item in its source respository</a>",,,,,,,,,,,,,,,,,,,,,,,,,,,,,https://www.iowaheritage.org/files/original/9f611835a49ef393aed0d5dccfa43b47.jpg,"Remote Item","Editorial Cartoons of Brian Duffy",1,0
64699,https://www.iowaheritage.org/items/show/64699,"We're probably going to have to come back this way afterwards","Presidency|Clinton, Bill, 1946|United States|Cemeteries|1990-2000|Presidents -- United States|Presidents' spouses--United States|Scandal|Ethics|Elections|Elections -- United States|Clinton, Hillary Rodham|Graves|Graveyards|Trees|Presidents|Wives|Moon|Signs|Hands","Whitewater; FBI files; Campaign funds; Election","Duffy, Brian, 1955-",,"University of Iowa. Libraries. Special Collections Dept.",1996-10-31|2011-04,,"Educational use only, no other permissions given. Copyright to this digital object is owned by The Des Moines Register; it may not be downloaded, reproduced, or distributed without written permission. For more information, contact the Special Collections Department.","Editorial Cartoons of Brian Duffy; Des Moines Register Cartoonists|Papers of Brian Duffy|Des Moines Register",,English,"Still image|Editorial cartoons",MSC916|duffy-961031|http://digital.lib.uiowa.edu/cdm/ref/collection/duffy/id/537,,,,,,,,,,,,,,,,,,,,,,,,,,,,,,,,,,,,,,,,,,,,,,,,"<a href=""http://digital.lib.uiowa.edu/cdm/ref/collection/duffy/id/537"" target=""_blank"">View this item in its source respository</a>",,,,,,,,,,,,,,,,,,,,,,,,,,,,,https://www.iowaheritage.org/files/original/26fecd6d34ef80b5435f9f765a2f5571.jpg,"Remote Item","Editorial Cartoons of Brian Duffy",1,0
10920,https://www.iowaheritage.org/items/show/10920,Untitled,"Gas masks|United States -- Iowa -- Iowa City|2000-2010|Maps|Men|Flowers|Hands","Collaged and laminated catalog cards.","Taylor, Darrell",,"University of Iowa. Libraries. Special Collections Dept.",2005|2006-10-31|https://digital.lib.uiowa.edu/,,"Educational use only, no other permissions given. Copyright to this resource is held by the University of Iowa Libraries' Special Collections Department, and is provided here for educational purposes only. It may not be reproduced or distributed in any format without written permission of the Special Collections Department.","cARTalog|cARTalog Collection|http://www.lib.uiowa.edu/collguides/?MSC0859",jpeg|12.4|7.4,eng,"Still image|Collages (Visual works)",173618284,,,,,,,,,,,,,,,,,,,,,,,,,,,,,,,,,,,,,,,,,,,,,,,,,,,,,,,,,,,,,,,,,,,,,,,,,,,,,,"Remote Item","African American Women in Iowa Collection",1,0
8670,https://www.iowaheritage.org/items/show/8670,"The voice of Jacob but the hands of Esau.","Government|Roosevelt, Franklin D. (Franklin Delano), 1882-1945|Elections 1940|Birds|politics|campaigns|candidates|morality|ethics|profiteering|hands|ordinary citizen.",,"Darling, Jay N. (Jay Norwood), 1876-1962","The Editorial cartoons of J.N. ""Ding"" Darling [electronic resource] : The Cowles Collection, Drake University, 1912-1962",,1940/08/22|1940,,"Copyright is owned by the ""Ding"" Darling Wildlife Society; it is administered on behalf of the Society by The University of Iowa. While use within the classroom is encouraged without specific authorization, publishing this cartoon in any format requires written permission. See policy and permissions procedure at: http://www.lib.uiowa.edu/spec-coll/services/dingdarling_fees.html","Cowles Library, Drake University, 2507 University Ave., Des Moines, IA 50311-4505.",,,,"400822.jpg|http://ddr.lib.drake.edu/u?/ddarling,5600",,,,,,,,,,,,,,,,,,,,,,,,,,,,,,,,,,,,,,,,,,,,,,,,"<a href=""http://ddr.lib.drake.edu/u?/ddarling,5600"" target=""_blank"">View this item in its source respository</a>",,,,,,,,,,,,,,,,,,,,,,,,,,,,,https://www.iowaheritage.org/files/original/8e37d30814d17e8d79689573da5ebd68.jpg,"Remote Item","Editorial Cartoons of J.N. ""Ding"" Darling, Drake University",1,0
64496,https://www.iowaheritage.org/items/show/64496,Squeeze,"Business|United States|People|1990-2000|Corporations|Employment|Mergers|Hands|Shaking hands|Men|Women","Corporate mergers; Employees","Duffy, Brian, 1955-",,"University of Iowa. Libraries. Special Collections Dept.",1998-12-04|2011-04,,"Educational use only, no other permissions given. Copyright to this digital object is owned by The Des Moines Register; it may not be downloaded, reproduced, or distributed without written permission. For more information, contact the Special Collections Department.","Editorial Cartoons of Brian Duffy; Des Moines Register Cartoonists|Papers of Brian Duffy|Des Moines Register",,English,"Still image|Editorial cartoons",MSC916|duffy-981204|http://digital.lib.uiowa.edu/cdm/ref/collection/duffy/id/334,,,,,,,,,,,,,,,,,,,,,,,,,,,,,,,,,,,,,,,,,,,,,,,,"<a href=""http://digital.lib.uiowa.edu/cdm/ref/collection/duffy/id/334"" target=""_blank"">View this item in its source respository</a>",,,,,,,,,,,,,,,,,,,,,,,,,,,,,https://www.iowaheritage.org/files/original/a93c1cf06375c747beaba64c61720fa2.jpg,"Remote Item","Editorial Cartoons of Brian Duffy",1,0
64565,https://www.iowaheritage.org/items/show/64565,"South Africa","Apartheid|South Africa|Men|1980-1990|Economic & political systems|Race relations|Racism|Segregation|Power|Maps|Paintbrushes|Painters|Painting|Paints & varnishes|Pails|Hands",Apartheid,"Duffy, Brian, 1955-",,"University of Iowa. Libraries. Special Collections Dept.",1985-07-30|2011-04,,"Educational use only, no other permissions given. Copyright to this digital object is owned by The Des Moines Register; it may not be downloaded, reproduced, or distributed without written permission. For more information, contact the Special Collections Department.","Editorial Cartoons of Brian Duffy; Des Moines Register Cartoonists|Papers of Brian Duffy|Des Moines Register",,English,"Still image|Editorial cartoons",MSC916|duffy-850730|http://digital.lib.uiowa.edu/cdm/ref/collection/duffy/id/403,,,,,,,,,,,,,,,,,,,,,,,,,,,,,,,,,,,,,,,,,,,,,,,,"<a href=""http://digital.lib.uiowa.edu/cdm/ref/collection/duffy/id/403"" target=""_blank"">View this item in its source respository</a>",,,,,,,,,,,,,,,,,,,,,,,,,,,,,https://www.iowaheritage.org/files/original/99749a146f1320cf2928c51a9c9a0fe9.jpg,"Remote Item","Editorial Cartoons of Brian Duffy",1,0
10953,https://www.iowaheritage.org/items/show/10953,"Set of 24 collages","Hands|United States -- New Jersey -- Hoboken|2000-2010|Women|Skeletons|Fossils|Tea bags|Sound equipment & supplies|Maps|Animals|Windows|Playing cards|Transportation|Fish|Clocks & watches|Boats|Men|Spoons","Set of collages made from cutouts and catalog cards.","Galloway, Gregory",,"University of Iowa. Libraries. Special Collections Dept.",2005|2006-12-14|https://digital.lib.uiowa.edu/,,"Educational use only, no other permissions given. Copyright to this resource is held by the University of Iowa Libraries' Special Collections Department, and is provided here for educational purposes only. It may not be reproduced or distributed in any format without written permission of the Special Collections Department.","cARTalog|cARTalog Collection|http://www.lib.uiowa.edu/collguides/?MSC0859",jpeg|27.8|21.5,eng,"Still image|Collages (Visual works)",173618284,,,,,,,,,,,,,,,,,,,,,,,,,,,,,,,,,,,,,,,,,,,,,,,,,,,,,,,,,,,,,,,,,,,,,,,,,,,,,,"Remote Item","African American Women in Iowa Collection",1,0
64306,https://www.iowaheritage.org/items/show/64306,"Reach out","Floods|Iowa|Living rooms|2000-2010|Flood relief|Disasters, natural|Recovery|Reconstruction|Housing|Women|Boots|Hands|Water|Floods|Books|Televisions|Couches|Masks|Safety equipment","Embrace Iowa; Photo album","Duffy, Brian, 1955-",,"University of Iowa. Libraries. Special Collections Dept.",2008-06-29|2011-04,,"Educational use only, no other permissions given. Copyright to this digital object is owned by The Des Moines Register; it may not be downloaded, reproduced, or distributed without written permission. For more information, contact the Special Collections Department.","Editorial Cartoons of Brian Duffy; Des Moines Register Cartoonists|Papers of Brian Duffy|Des Moines Register",,English,"Still image|Editorial cartoons",MSC916|duffy-080629|http://digital.lib.uiowa.edu/cdm/ref/collection/duffy/id/144,,,,,,,,,,,,,,,,,,,,,,,,,,,,,,,,,,,,,,,,,,,,,,,,"<a href=""http://digital.lib.uiowa.edu/cdm/ref/collection/duffy/id/144"" target=""_blank"">View this item in its source respository</a>",,,,,,,,,,,,,,,,,,,,,,,,,,,,,https://www.iowaheritage.org/files/original/ad9269db23effbb77d0e018d6239d737.jpg,"Remote Item","Editorial Cartoons of Brian Duffy",1,0
64556,https://www.iowaheritage.org/items/show/64556,"Our motto: as solid as the ground it's built on","Farms|United States|Buildings|1980-1990|Farmland|Farm support|Farm aid|Banks|Banking|Eyes|Hands|Gargoyles|Ruins|Doors","Federal Land Bank; Farmland values","Duffy, Brian, 1955-",,"University of Iowa. Libraries. Special Collections Dept.",1985-07-31|2011-04,,"Educational use only, no other permissions given. Copyright to this digital object is owned by The Des Moines Register; it may not be downloaded, reproduced, or distributed without written permission. For more information, contact the Special Collections Department.","Editorial Cartoons of Brian Duffy; Des Moines Register Cartoonists|Papers of Brian Duffy|Des Moines Register",,English,"Still image|Editorial cartoons",MSC916|duffy-850731|http://digital.lib.uiowa.edu/cdm/ref/collection/duffy/id/394,,,,,,,,,,,,,,,,,,,,,,,,,,,,,,,,,,,,,,,,,,,,,,,,"<a href=""http://digital.lib.uiowa.edu/cdm/ref/collection/duffy/id/394"" target=""_blank"">View this item in its source respository</a>",,,,,,,,,,,,,,,,,,,,,,,,,,,,,https://www.iowaheritage.org/files/original/013eaedb6721e9cfbcb977015660b39a.jpg,"Remote Item","Editorial Cartoons of Brian Duffy",1,0
64510,https://www.iowaheritage.org/items/show/64510,"Nixon with hands holding tape above his head","Presidents|Nixon, Richard M. (Richard Milhous), 1913-1994|United States|Presidents|1980-1990|Political corruption|Political corruption -- United States|Political crimes and offenses|Politicians|Politics|Sound equipment & supplies|Hands|Fingers",,"Duffy, Brian, 1955-",,"University of Iowa. Libraries. Special Collections Dept.",1984-08-05|2011-04,,"Educational use only, no other permissions given. Copyright to this digital object is owned by The Des Moines Register; it may not be downloaded, reproduced, or distributed without written permission. For more information, contact the Special Collections Department.","Editorial Cartoons of Brian Duffy; Des Moines Register Cartoonists|Papers of Brian Duffy|Des Moines Register",,English,"Still image|Editorial cartoons",MSC916|duffy-840805|http://digital.lib.uiowa.edu/cdm/ref/collection/duffy/id/348,,,,,,,,,,,,,,,,,,,,,,,,,,,,,,,,,,,,,,,,,,,,,,,,"<a href=""http://digital.lib.uiowa.edu/cdm/ref/collection/duffy/id/348"" target=""_blank"">View this item in its source respository</a>",,,,,,,,,,,,,,,,,,,,,,,,,,,,,https://www.iowaheritage.org/files/original/abed4b89fd7c690acadb2df45ede1f56.jpg,"Remote Item","Editorial Cartoons of Brian Duffy",1,0
