 




﻿"Item Id","Item URI","Dublin Core:Title","Dublin Core:Subject","Dublin Core:Description","Dublin Core:Creator","Dublin Core:Source","Dublin Core:Publisher","Dublin Core:Date","Dublin Core:Contributor","Dublin Core:Rights","Dublin Core:Relation","Dublin Core:Format","Dublin Core:Language","Dublin Core:Type","Dublin Core:Identifier","Dublin Core:Coverage","Item Type Metadata:Text","Item Type Metadata:Interviewer","Item Type Metadata:Interviewee","Item Type Metadata:Location","Item Type Metadata:Transcription","Item Type Metadata:Local URL","Item Type Metadata:Original Format","Item Type Metadata:Physical Dimensions","Item Type Metadata:Duration","Item Type Metadata:Compression","Item Type Metadata:Producer","Item Type Metadata:Director","Item Type Metadata:Bit Rate/Frequency","Item Type Metadata:Time Summary","Item Type Metadata:Email Body","Item Type Metadata:Subject Line","Item Type Metadata:From","Item Type Metadata:To","Item Type Metadata:CC","Item Type Metadata:BCC","Item Type Metadata:Number of Attachments","Item Type Metadata:Standards","Item Type Metadata:Objectives","Item Type Metadata:Materials","Item Type Metadata:Lesson Plan Text","Item Type Metadata:URL","Item Type Metadata:Event Type","Item Type Metadata:Participants","Item Type Metadata:Birth Date","Item Type Metadata:Birthplace","Item Type Metadata:Death Date","Item Type Metadata:Occupation","Item Type Metadata:Biographical Text","Item Type Metadata:Bibliography","Item Type Metadata:Digital Reproduction Information","Item Type Metadata:Repository","Item Type Metadata:Repository Collection","Item Type Metadata:Contact information.","Item Type Metadata:File Name","Item Type Metadata:Notes","Item Type Metadata:Digital item created","Item Type Metadata:Digital item modified","Item Type Metadata:Executive Orders","Item Type Metadata:Record Created","Item Type Metadata:Record Modified","Item Type Metadata:Transcription2","Item Type Metadata:Source URL","Omeka Legacy File:Additional Creator","Omeka Legacy File:Transcriber","Omeka Legacy File:Producer","Omeka Legacy File:Render Device","Omeka Legacy File:Render Details","Omeka Legacy File:Capture Date","Omeka Legacy File:Capture Device","Omeka Legacy File:Capture Details","Omeka Legacy File:Change History","Omeka Legacy File:Watermark","Omeka Legacy File:Encryption","Omeka Legacy File:Compression","Omeka Legacy File:Post Processing","Omeka Image File:Width","Omeka Image File:Height","Omeka Image File:Bit Depth","Omeka Image File:Channels","Omeka Image File:Exif String","Omeka Image File:Exif Array","Omeka Image File:IPTC String","Omeka Image File:IPTC Array","Omeka Video File:Bitrate","Omeka Video File:Duration","Omeka Video File:Sample Rate","Omeka Video File:Codec","Omeka Video File:Width","Omeka Video File:Height",tags,file,itemType,collection,public,featured
64627,https://www.iowaheritage.org/items/show/64627,"I demand a recount!","Governors|Branstad, Terry E.|Iowa|Governors|1990-2000|States|Census|Emigration|Population|Census|Men|Footprints|Mailboxes","Exit; Iowa; Census","Duffy, Brian, 1955-",,"University of Iowa. Libraries. Special Collections Dept.",1990-08-23|2011-04,,"Educational use only, no other permissions given. Copyright to this digital object is owned by The Des Moines Register; it may not be downloaded, reproduced, or distributed without written permission. For more information, contact the Special Collections Department.","Editorial Cartoons of Brian Duffy; Des Moines Register Cartoonists|Papers of Brian Duffy|Des Moines Register",,English,"Still image|Editorial cartoons",MSC916|duffy-900823|http://digital.lib.uiowa.edu/cdm/ref/collection/duffy/id/465,,,,,,,,,,,,,,,,,,,,,,,,,,,,,,,,,,,,,,,,,,,,,,,,"<a href=""http://digital.lib.uiowa.edu/cdm/ref/collection/duffy/id/465"" target=""_blank"">View this item in its source respository</a>",,,,,,,,,,,,,,,,,,,,,,,,,,,,,https://www.iowaheritage.org/files/original/3660e67b6ee6526fc55e057def9fd5a6.jpg,"Remote Item","Editorial Cartoons of Brian Duffy",1,0
64480,https://www.iowaheritage.org/items/show/64480,"Anti-government extremists","Domestic violence|Oklahoma City (Okla.)|Oklahoma City Federal Building Bombing, Oklahoma City, Okla., 1995|Rocks|1990-2000|Terrorism|Violence|Bombing|Bombs|Federal government|Hatred|Government, Resistance to|Government|Eyes|Hiding|Buildings|Bomb craters|Footprints",,"Duffy, Brian, 1955-",,"University of Iowa. Libraries. Special Collections Dept.",1995-04-25|2011-04,,"Educational use only, no other permissions given. Copyright to this digital object is owned by The Des Moines Register; it may not be downloaded, reproduced, or distributed without written permission. For more information, contact the Special Collections Department.","Editorial Cartoons of Brian Duffy; Des Moines Register Cartoonists|Papers of Brian Duffy|Des Moines Register",,English,"Still image|Editorial cartoons",MSC916|duffy-950425|http://digital.lib.uiowa.edu/cdm/ref/collection/duffy/id/318,,,,,,,,,,,,,,,,,,,,,,,,,,,,,,,,,,,,,,,,,,,,,,,,"<a href=""http://digital.lib.uiowa.edu/cdm/ref/collection/duffy/id/318"" target=""_blank"">View this item in its source respository</a>",,,,,,,,,,,,,,,,,,,,,,,,,,,,,https://www.iowaheritage.org/files/original/44687a70e5eeabe238208ebe9e5594a6.jpg,"Remote Item","Editorial Cartoons of Brian Duffy",1,0
64436,https://www.iowaheritage.org/items/show/64436,"The first robin of the year ... a sign, that economic springtime is just around the corner!","Presidents|Bush, George, 1924-|United States|Birds|1990-2000|Economy|Economic cycles|Economic conditions|Propaganda|Tree limbs|Costumes|Men|Presidents|Cold|Snow|Coats|Hats|Footprints|White House","What are you supposed to be?","Duffy, Brian, 1955-",,"University of Iowa. Libraries. Special Collections Dept.",1991-02-14|2011-04,,"Educational use only, no other permissions given. Copyright to this digital object is owned by The Des Moines Register; it may not be downloaded, reproduced, or distributed without written permission. For more information, contact the Special Collections Department.","Editorial Cartoons of Brian Duffy; Des Moines Register Cartoonists|Papers of Brian Duffy|Des Moines Register",,English,"Still image|Editorial cartoons",MSC916|duffy-910214|http://digital.lib.uiowa.edu/cdm/ref/collection/duffy/id/274,,,,,,,,,,,,,,,,,,,,,,,,,,,,,,,,,,,,,,,,,,,,,,,,"<a href=""http://digital.lib.uiowa.edu/cdm/ref/collection/duffy/id/274"" target=""_blank"">View this item in its source respository</a>",,,,,,,,,,,,,,,,,,,,,,,,,,,,,https://www.iowaheritage.org/files/original/0393d578dc9abdc12da9837a7d8e5a1f.jpg,"Remote Item","Editorial Cartoons of Brian Duffy",1,0
64420,https://www.iowaheritage.org/items/show/64420,"Flu 1","Winter|Football players|1990-2000|Flu|Cold|Health|Footprints|Men|Snow|Stars","Winter 2","Duffy, Brian, 1955-",,"University of Iowa. Libraries. Special Collections Dept.",1991-01-27|2011-04,,"Educational use only, no other permissions given. Copyright to this digital object is owned by The Des Moines Register; it may not be downloaded, reproduced, or distributed without written permission. For more information, contact the Special Collections Department.","Editorial Cartoons of Brian Duffy; Des Moines Register Cartoonists|Papers of Brian Duffy|Des Moines Register",,English,"Still image|Editorial cartoons",MSC916|duffy-910127|http://digital.lib.uiowa.edu/cdm/ref/collection/duffy/id/258,,,,,,,,,,,,,,,,,,,,,,,,,,,,,,,,,,,,,,,,,,,,,,,,"<a href=""http://digital.lib.uiowa.edu/cdm/ref/collection/duffy/id/258"" target=""_blank"">View this item in its source respository</a>",,,,,,,,,,,,,,,,,,,,,,,,,,,,,https://www.iowaheritage.org/files/original/316deca56c450b05236ca11ea5ceba59.jpg,"Remote Item","Editorial Cartoons of Brian Duffy",1,0
64408,https://www.iowaheritage.org/items/show/64408,Winter,"Winter|Gorbachev, Mikhail Sergeevich, 1931-|Soviet Union|Presidents|1980-1990|Presidents|Leadership|Inflation|Ethnic origins|Emergency food supply|Labor|Strikes|Strikes and lockouts|Food|Food supply|Food prices|Economy|Leaders|Men|Winter|Snow|Snowballs|Coats|Clothes, Tattered|Footprints|Hammer & sickle","High prices; Food shortages; Ethnic unrest; Labor strikes","Duffy, Brian, 1955-",,"University of Iowa. Libraries. Special Collections Dept.",1989-11-30|2011-04,,"Educational use only, no other permissions given. Copyright to this digital object is owned by The Des Moines Register; it may not be downloaded, reproduced, or distributed without written permission. For more information, contact the Special Collections Department.","Editorial Cartoons of Brian Duffy; Des Moines Register Cartoonists|Papers of Brian Duffy|Des Moines Register",,English,"Still image|Editorial cartoons",MSC916|duffy-891130|http://digital.lib.uiowa.edu/cdm/ref/collection/duffy/id/246,,,,,,,,,,,,,,,,,,,,,,,,,,,,,,,,,,,,,,,,,,,,,,,,"<a href=""http://digital.lib.uiowa.edu/cdm/ref/collection/duffy/id/246"" target=""_blank"">View this item in its source respository</a>",,,,,,,,,,,,,,,,,,,,,,,,,,,,,https://www.iowaheritage.org/files/original/173e084d3bc06469e42c12b008ae0e59.jpg,"Remote Item","Editorial Cartoons of Brian Duffy",1,0
64342,https://www.iowaheritage.org/items/show/64342,"The U.S. made us do it!","Airplanes|Soviet Union|Korean Air Lines Incident, 1983|Caves|1980-1990|Terrorism|Violence|Aggression (International law)|Bears|Bears, Russian|Signs|Footprints|Smoke|Airplane crashes|Hammer & sickle|Rocks|Skulls|Bones","What plane; We didn't do it; We might have done it; We did it ... so what!","Duffy, Brian, 1955-",,"University of Iowa. Libraries. Special Collections Dept.",1983-09-12|2011-04,,"Educational use only, no other permissions given. Copyright to this digital object is owned by The Des Moines Register; it may not be downloaded, reproduced, or distributed without written permission. For more information, contact the Special Collections Department.","Editorial Cartoons of Brian Duffy; Des Moines Register Cartoonists|Papers of Brian Duffy|Des Moines Register",,English,"Still image|Editorial cartoons",MSC916|duffy-830912|http://digital.lib.uiowa.edu/cdm/ref/collection/duffy/id/180,,,,,,,,,,,,,,,,,,,,,,,,,,,,,,,,,,,,,,,,,,,,,,,,"<a href=""http://digital.lib.uiowa.edu/cdm/ref/collection/duffy/id/180"" target=""_blank"">View this item in its source respository</a>",,,,,,,,,,,,,,,,,,,,,,,,,,,,,https://www.iowaheritage.org/files/original/c6aecaffe3fd8f1893bcdf5aaaaa3395.jpg,"Remote Item","Editorial Cartoons of Brian Duffy",1,0
64321,https://www.iowaheritage.org/items/show/64321,"An appetizer","Russia -- Foreign relations|Russia|Bears|2000-2010|Russia -- Politics and government|War|Invasion|Georgia|Caves|Footprints",Georgia,"Duffy, Brian, 1955-",,"University of Iowa. Libraries. Special Collections Dept.",2008-08-13|2011-04,,"Educational use only, no other permissions given. Copyright to this digital object is owned by The Des Moines Register; it may not be downloaded, reproduced, or distributed without written permission. For more information, contact the Special Collections Department.","Editorial Cartoons of Brian Duffy; Des Moines Register Cartoonists|Papers of Brian Duffy|Des Moines Register",,English,"Still image|Editorial cartoons",MSC916|duffy-080813|http://digital.lib.uiowa.edu/cdm/ref/collection/duffy/id/159,,,,,,,,,,,,,,,,,,,,,,,,,,,,,,,,,,,,,,,,,,,,,,,,"<a href=""http://digital.lib.uiowa.edu/cdm/ref/collection/duffy/id/159"" target=""_blank"">View this item in its source respository</a>",,,,,,,,,,,,,,,,,,,,,,,,,,,,,https://www.iowaheritage.org/files/original/7847dfda085f2f2df5f2a776e29589da.jpg,"Remote Item","Editorial Cartoons of Brian Duffy",1,0
64287,https://www.iowaheritage.org/items/show/64287,"Arafat's footprints","Palestine|Arafat, Yasir, 1929-2004|Palestine|Footprints|2000-2010|Violence|Peace|Occupation|Foreign relations|Conflict|Israel|Signs|Arrows|Doves|Olive branches",Peace,"Duffy, Brian, 1955-",,"University of Iowa. Libraries. Special Collections Dept.",2004-11-12|2011-04,,"Educational use only, no other permissions given. Copyright to this digital object is owned by The Des Moines Register; it may not be downloaded, reproduced, or distributed without written permission. For more information, contact the Special Collections Department.","Editorial Cartoons of Brian Duffy; Des Moines Register Cartoonists|Papers of Brian Duffy|Des Moines Register",,English,"Still image|Editorial cartoons",MSC916|duffy-041112|http://digital.lib.uiowa.edu/cdm/ref/collection/duffy/id/125,,,,,,,,,,,,,,,,,,,,,,,,,,,,,,,,,,,,,,,,,,,,,,,,"<a href=""http://digital.lib.uiowa.edu/cdm/ref/collection/duffy/id/125"" target=""_blank"">View this item in its source respository</a>",,,,,,,,,,,,,,,,,,,,,,,,,,,,,https://www.iowaheritage.org/files/original/f1380c405a269abd162ab225c8caf2a6.jpg,"Remote Item","Editorial Cartoons of Brian Duffy",1,0
64285,https://www.iowaheritage.org/items/show/64285,"Still wandering in the wilderness","Elections|United States|Donkeys|2000-2010|Politics|Political parties|Politicians|Congress|Democrats|Losers|Deserts|Footprints|Lizards",,"Duffy, Brian, 1955-",,"University of Iowa. Libraries. Special Collections Dept.",2004-11-05|2011-04,,"Educational use only, no other permissions given. Copyright to this digital object is owned by The Des Moines Register; it may not be downloaded, reproduced, or distributed without written permission. For more information, contact the Special Collections Department.","Editorial Cartoons of Brian Duffy; Des Moines Register Cartoonists|Papers of Brian Duffy|Des Moines Register",,English,"Still image|Editorial cartoons",MSC916|duffy-041105|http://digital.lib.uiowa.edu/cdm/ref/collection/duffy/id/123,,,,,,,,,,,,,,,,,,,,,,,,,,,,,,,,,,,,,,,,,,,,,,,,"<a href=""http://digital.lib.uiowa.edu/cdm/ref/collection/duffy/id/123"" target=""_blank"">View this item in its source respository</a>",,,,,,,,,,,,,,,,,,,,,,,,,,,,,https://www.iowaheritage.org/files/original/358369c373f00b7133356f1b715895e5.jpg,"Remote Item","Editorial Cartoons of Brian Duffy",1,0
19158,https://www.iowaheritage.org/items/show/19158,"City Park, footprints in snow, Iowa City, Iowa, between 1915 and 1920","Parks|City Park (Iowa City, Iowa)|United States -- Iowa -- Iowa City|1910-1920|Footprints",,"Kent, Frederick W. (Frederick Wallace), 1894-1984",,"University of Iowa. Libraries. University Archives",1915/1920|2006-06-23,,"Educational use only, no other permissions given. U.S. and international copyright laws may protect this digital object. Commercial use or distribution of the object is not permitted without prior permission of the copyright holder.","Iowa City Town and Campus Scenes|Frederick W. Kent Collection of Photographs, 1866-2000|http://www.lib.uiowa.edu/collguides/?RG30.0001.01|Prints|Scenes -- Iowa City|City Park|City Park|Scanned with Ricoh Aficio 3228C @ 300 ppi. Master image saved in TIFF format.",13|17,,"Still image|Photographs|jpeg",RG30.0001.01|0008|park008.jpg|168413524|https://digital.lib.uiowa.edu/,,,,,,,,,,,,,,,,,,,,,,,,,,,,,,,,,,,,,,,,,,,,,,,,"<a href=""https://digital.lib.uiowa.edu/"" target=""_blank"">View this item in its source respository</a>",,,,,,,,,,,,,,,,,,,,,,,,,,,,,https://www.iowaheritage.org/files/original/e5f069ec1c6405a4209c8b1ca26e8e0a.jpg,"Remote Item","Iowa City Town and Campus Scenes",1,0
