 




﻿"Item Id","Item URI","Dublin Core:Title","Dublin Core:Subject","Dublin Core:Description","Dublin Core:Creator","Dublin Core:Source","Dublin Core:Publisher","Dublin Core:Date","Dublin Core:Contributor","Dublin Core:Rights","Dublin Core:Relation","Dublin Core:Format","Dublin Core:Language","Dublin Core:Type","Dublin Core:Identifier","Dublin Core:Coverage","Item Type Metadata:Text","Item Type Metadata:Interviewer","Item Type Metadata:Interviewee","Item Type Metadata:Location","Item Type Metadata:Transcription","Item Type Metadata:Local URL","Item Type Metadata:Original Format","Item Type Metadata:Physical Dimensions","Item Type Metadata:Duration","Item Type Metadata:Compression","Item Type Metadata:Producer","Item Type Metadata:Director","Item Type Metadata:Bit Rate/Frequency","Item Type Metadata:Time Summary","Item Type Metadata:Email Body","Item Type Metadata:Subject Line","Item Type Metadata:From","Item Type Metadata:To","Item Type Metadata:CC","Item Type Metadata:BCC","Item Type Metadata:Number of Attachments","Item Type Metadata:Standards","Item Type Metadata:Objectives","Item Type Metadata:Materials","Item Type Metadata:Lesson Plan Text","Item Type Metadata:URL","Item Type Metadata:Event Type","Item Type Metadata:Participants","Item Type Metadata:Birth Date","Item Type Metadata:Birthplace","Item Type Metadata:Death Date","Item Type Metadata:Occupation","Item Type Metadata:Biographical Text","Item Type Metadata:Bibliography","Item Type Metadata:Digital Reproduction Information","Item Type Metadata:Repository","Item Type Metadata:Repository Collection","Item Type Metadata:Contact information.","Item Type Metadata:File Name","Item Type Metadata:Notes","Item Type Metadata:Digital item created","Item Type Metadata:Digital item modified","Item Type Metadata:Executive Orders","Item Type Metadata:Record Created","Item Type Metadata:Record Modified","Item Type Metadata:Transcription2","Item Type Metadata:Source URL","Omeka Legacy File:Additional Creator","Omeka Legacy File:Transcriber","Omeka Legacy File:Producer","Omeka Legacy File:Render Device","Omeka Legacy File:Render Details","Omeka Legacy File:Capture Date","Omeka Legacy File:Capture Device","Omeka Legacy File:Capture Details","Omeka Legacy File:Change History","Omeka Legacy File:Watermark","Omeka Legacy File:Encryption","Omeka Legacy File:Compression","Omeka Legacy File:Post Processing","Omeka Image File:Width","Omeka Image File:Height","Omeka Image File:Bit Depth","Omeka Image File:Channels","Omeka Image File:Exif String","Omeka Image File:Exif Array","Omeka Image File:IPTC String","Omeka Image File:IPTC Array","Omeka Video File:Bitrate","Omeka Video File:Duration","Omeka Video File:Sample Rate","Omeka Video File:Codec","Omeka Video File:Width","Omeka Video File:Height",tags,file,itemType,collection,public,featured
64656,https://www.iowaheritage.org/items/show/64656,"Shhhh ... ?","Campaigns|Clinton, Bill, 1946-|United States|Presidents -- United States -- Election -- 1992|Men|1990-2000|Campaigning|Candidates|Elections|Voters|Votes|Bush, George, 1924-|Trees|Eggs|Easter egg hunts|Baskets|Nests|Birds|Bird nests",Voters,"Duffy, Brian, 1955-",,"University of Iowa. Libraries. Special Collections Dept.",1992-04-16|2011-04,,"Educational use only, no other permissions given. Copyright to this digital object is owned by The Des Moines Register; it may not be downloaded, reproduced, or distributed without written permission. For more information, contact the Special Collections Department.","Editorial Cartoons of Brian Duffy; Des Moines Register Cartoonists|Papers of Brian Duffy|Des Moines Register",,English,"Still image|Editorial cartoons",MSC916|duffy-920416|http://digital.lib.uiowa.edu/cdm/ref/collection/duffy/id/494,,,,,,,,,,,,,,,,,,,,,,,,,,,,,,,,,,,,,,,,,,,,,,,,"<a href=""http://digital.lib.uiowa.edu/cdm/ref/collection/duffy/id/494"" target=""_blank"">View this item in its source respository</a>",,,,,,,,,,,,,,,,,,,,,,,,,,,,,https://www.iowaheritage.org/files/original/0ad1ec9b8e46b895fea152b61c7569f2.jpg,"Remote Item","Editorial Cartoons of Brian Duffy",1,0
64540,https://www.iowaheritage.org/items/show/64540,"Ventriloquist Ronald Reagan","Presidents|Reagan, Ronald|United States|Presidents|1980-1990|Presidents -- United States|Presidential power|Presidential appointees|Press|Men|Ventriloquism|Dummies|Comedians|Stools|Eggs|Eggshells|Chickens|Bottles|Eyeglasses|Puppets",,"Duffy, Brian, 1955-",,"University of Iowa. Libraries. Special Collections Dept.",1985-03-03|2011-04,,"Educational use only, no other permissions given. Copyright to this digital object is owned by The Des Moines Register; it may not be downloaded, reproduced, or distributed without written permission. For more information, contact the Special Collections Department.","Editorial Cartoons of Brian Duffy; Des Moines Register Cartoonists|Papers of Brian Duffy|Des Moines Register",,English,"Still image|Editorial cartoons",MSC916|duffy-850303|http://digital.lib.uiowa.edu/cdm/ref/collection/duffy/id/378,,,,,,,,,,,,,,,,,,,,,,,,,,,,,,,,,,,,,,,,,,,,,,,,"<a href=""http://digital.lib.uiowa.edu/cdm/ref/collection/duffy/id/378"" target=""_blank"">View this item in its source respository</a>",,,,,,,,,,,,,,,,,,,,,,,,,,,,,https://www.iowaheritage.org/files/original/4408a022dd840bb26167a6c538dd0cc2.jpg,"Remote Item","Editorial Cartoons of Brian Duffy",1,0
64495,https://www.iowaheritage.org/items/show/64495,"I think the heat has gotten to Dad","Christmas|United States|Christmas trees|1990-2000|Holidays|Winter|Weather|Men|Costumes|Fathers|Children|Thermometers|Sun|Eggs|Rabbits",,"Duffy, Brian, 1955-",,"University of Iowa. Libraries. Special Collections Dept.",1998-12-03|2011-04,,"Educational use only, no other permissions given. Copyright to this digital object is owned by The Des Moines Register; it may not be downloaded, reproduced, or distributed without written permission. For more information, contact the Special Collections Department.","Editorial Cartoons of Brian Duffy; Des Moines Register Cartoonists|Papers of Brian Duffy|Des Moines Register",,English,"Still image|Editorial cartoons",MSC916|duffy-981203|http://digital.lib.uiowa.edu/cdm/ref/collection/duffy/id/333,,,,,,,,,,,,,,,,,,,,,,,,,,,,,,,,,,,,,,,,,,,,,,,,"<a href=""http://digital.lib.uiowa.edu/cdm/ref/collection/duffy/id/333"" target=""_blank"">View this item in its source respository</a>",,,,,,,,,,,,,,,,,,,,,,,,,,,,,https://www.iowaheritage.org/files/original/e00d190a4c53b722250a1f9c0b7aac9a.jpg,"Remote Item","Editorial Cartoons of Brian Duffy",1,0
64412,https://www.iowaheritage.org/items/show/64412,"S & L's banks","Savings|United States|Chickens|1990-2000|Loans|Banks|Credit|Money|Nests|Eyeglasses|Eggs|Eggshells","?; Nest eggs","Duffy, Brian, 1955-",,"University of Iowa. Libraries. Special Collections Dept.",1991-01-09|2011-04,,"Educational use only, no other permissions given. Copyright to this digital object is owned by The Des Moines Register; it may not be downloaded, reproduced, or distributed without written permission. For more information, contact the Special Collections Department.","Editorial Cartoons of Brian Duffy; Des Moines Register Cartoonists|Papers of Brian Duffy|Des Moines Register",,English,"Still image|Editorial cartoons",MSC916|duffy-910109|http://digital.lib.uiowa.edu/cdm/ref/collection/duffy/id/250,,,,,,,,,,,,,,,,,,,,,,,,,,,,,,,,,,,,,,,,,,,,,,,,"<a href=""http://digital.lib.uiowa.edu/cdm/ref/collection/duffy/id/250"" target=""_blank"">View this item in its source respository</a>",,,,,,,,,,,,,,,,,,,,,,,,,,,,,https://www.iowaheritage.org/files/original/a04afc6ef02b521fc21f1e340811b035.jpg,"Remote Item","Editorial Cartoons of Brian Duffy",1,0
64409,https://www.iowaheritage.org/items/show/64409,Deficit,"Governors|Branstad, Terry E.|Iowa|Kitchens|1990-2000|Budgets|States|State governments|Spending|Government|Government spending|Government spending policy|Deficits|Legislature|Stoves|Pots|Explosions|Governors|Cooks|Cooking|Men|Doors|Windows|Food|Eggs|Spoons|Cookbooks","Cooked book budget recipes; Legislature","Duffy, Brian, 1955-",,"University of Iowa. Libraries. Special Collections Dept.",1991-01-03|2011-04,,"Educational use only, no other permissions given. Copyright to this digital object is owned by The Des Moines Register; it may not be downloaded, reproduced, or distributed without written permission. For more information, contact the Special Collections Department.","Editorial Cartoons of Brian Duffy; Des Moines Register Cartoonists|Papers of Brian Duffy|Des Moines Register",,English,"Still image|Editorial cartoons",MSC916|duffy-910103|http://digital.lib.uiowa.edu/cdm/ref/collection/duffy/id/247,,,,,,,,,,,,,,,,,,,,,,,,,,,,,,,,,,,,,,,,,,,,,,,,"<a href=""http://digital.lib.uiowa.edu/cdm/ref/collection/duffy/id/247"" target=""_blank"">View this item in its source respository</a>",,,,,,,,,,,,,,,,,,,,,,,,,,,,,https://www.iowaheritage.org/files/original/fbb0f5646e988eccf3daa25d958f9861.jpg,"Remote Item","Editorial Cartoons of Brian Duffy",1,0
64331,https://www.iowaheritage.org/items/show/64331,"Isn't that one of our nest eggs?","Retirement|United States|Men|2000-2010|Savings|Economy|Economic conditions|Families|Recession|Women|Eggs|Eggshells|Frying pans|Stoves|Newspaper headlines|Newspapers|Cooking","Now it's dinner; 401K; Americans tap into savings to survive","Duffy, Brian, 1955-",,"University of Iowa. Libraries. Special Collections Dept.",2008-09-03|2011-04,,"Educational use only, no other permissions given. Copyright to this digital object is owned by The Des Moines Register; it may not be downloaded, reproduced, or distributed without written permission. For more information, contact the Special Collections Department.","Editorial Cartoons of Brian Duffy; Des Moines Register Cartoonists|Papers of Brian Duffy|Des Moines Register",,English,"Still image|Editorial cartoons",MSC916|duffy-080903|http://digital.lib.uiowa.edu/cdm/ref/collection/duffy/id/169,,,,,,,,,,,,,,,,,,,,,,,,,,,,,,,,,,,,,,,,,,,,,,,,"<a href=""http://digital.lib.uiowa.edu/cdm/ref/collection/duffy/id/169"" target=""_blank"">View this item in its source respository</a>",,,,,,,,,,,,,,,,,,,,,,,,,,,,,https://www.iowaheritage.org/files/original/d5c1c0cb53b0d3d1e283e555e9edf5f3.jpg,"Remote Item","Editorial Cartoons of Brian Duffy",1,0
23683,https://www.iowaheritage.org/items/show/23683,"Herky the Hawk playing golf, The University of Iowa, 1950s","Universities & colleges|University of Iowa|United States -- Iowa -- Iowa City|1950-1960|Mascots|Golf|Turtles|Eggs",,unknown,,"University of Iowa. Libraries. University Archives",1950/1959|2008-05,,"Educational use only, no other permissions given. U.S. and international copyright laws may protect this digital object. Commercial use or distribution of the object is not permitted without prior permission of the copyright holder.","Iowa City Town and Campus Scenes|Frederick W. Kent Collection of Photographs, 1866-2000|http://www.lib.uiowa.edu/collguides/?RG30.0001.01|Prints|Events and activities|Herky the Hawk|Herky the Hawk|Scanned with Ricoh Aficio 3228C @ 600 ppi, full color. Master image saved in TIFF format.",,,"Still image|Drawings|jpeg",RG30.0001.01|https://digital.lib.uiowa.edu/,,,,,,,,,,,,,,,,,,,,,,,,,,,,,,,,,,,,,,,,,,,,,,,,"<a href=""https://digital.lib.uiowa.edu/"" target=""_blank"">View this item in its source respository</a>",,,,,,,,,,,,,,,,,,,,,,,,,,,,,https://www.iowaheritage.org/files/original/4f0bc24aa324febbd614441da987147f.jpg,"Remote Item","Iowa City Town and Campus Scenes",1,0
10095,https://www.iowaheritage.org/items/show/10095,"Packing eggs for sale, Atarashiki Mura commune, Saitama-ken, Japan, 1965","Collective settlements|Japanese|Atarashiki Mura|Japan -- Saitama-ken|1960-1970|Collective farms|People|Men|Eggs|Chicken industry",,"Plath, David W.",,"University of Iowa. Libraries. University Archives",1965,,"Educational use only, no other permissions given. U.S. and international copyright laws may protect this item. Commercial use or distribution of this digital object is not permitted without written permission of the University Archives at The University of Iowa Libraries.","Anthropology at Iowa Digital Collection|David Plath Japanese Fieldwork Collection|David Plath Papers",5|5,,"Still image|Color slides|jpeg",PLA-slide047.jpg|https://digital.lib.uiowa.edu/,,,,,,,,,,,,,,,,,,,,,,,,,,,,,,,,,,,,,,,,,,,,,,,,"<a href=""https://digital.lib.uiowa.edu/"" target=""_blank"">View this item in its source respository</a>",,,,,,,,,,,,,,,,,,,,,,,,,,,,,https://www.iowaheritage.org/files/original/671e86a004c88a4ef3095f9a801e1633.jpg,"Remote Item","African American Women in Iowa Collection",1,0
10094,https://www.iowaheritage.org/items/show/10094,"Packing eggs for sale, Atarashiki Mura commune, Saitama-ken, Japan, 1965","Collective settlements|Japanese|Atarashiki Mura|Japan -- Saitama-ken|1960-1970|Collective farms|People|Men|Eggs|Chicken industry",,"Plath, David W.",,"University of Iowa. Libraries. University Archives",1965,,"Educational use only, no other permissions given. U.S. and international copyright laws may protect this item. Commercial use or distribution of this digital object is not permitted without written permission of the University Archives at The University of Iowa Libraries.","Anthropology at Iowa Digital Collection|David Plath Japanese Fieldwork Collection|David Plath Papers",5|5,,"Still image|Color slides|jpeg",PLA-slide046.jpg|https://digital.lib.uiowa.edu/,,,,,,,,,,,,,,,,,,,,,,,,,,,,,,,,,,,,,,,,,,,,,,,,"<a href=""https://digital.lib.uiowa.edu/"" target=""_blank"">View this item in its source respository</a>",,,,,,,,,,,,,,,,,,,,,,,,,,,,,https://www.iowaheritage.org/files/original/e0488d86a8eb8bc88e9ffba7cffd492e.jpg,"Remote Item","African American Women in Iowa Collection",1,0
10054,https://www.iowaheritage.org/items/show/10054,"Sorting eggs for sales, Yamagishi Kai, Mie-ken, Japan, 1965","Collective settlements|Japanese|Yamagishi Kai|Japan -- Mie-ken|1960-1970|Collective farms|Chicken industry|Eggs|People",,"Plath, David W.",,"University of Iowa. Libraries. University Archives",1965,,"Educational use only, no other permissions given. U.S. and international copyright laws may protect this item. Commercial use or distribution of this digital object is not permitted without written permission of the University Archives at The University of Iowa Libraries.","Anthropology at Iowa Digital Collection|David Plath Japanese Fieldwork Collection|David Plath Papers",5|5,,"Still image|Color slides|jpeg",https://digital.lib.uiowa.edu/,,,,,,,,,,,,,,,,,,,,,,,,,,,,,,,,,,,,,,,,,,,,,,,,"<a href=""https://digital.lib.uiowa.edu/"" target=""_blank"">View this item in its source respository</a>",,,,,,,,,,,,,,,,,,,,,,,,,,,,,https://www.iowaheritage.org/files/original/c5236bb12d6cebe1bc4248dc7289a2fa.jpg,"Remote Item","African American Women in Iowa Collection",1,0
