 




﻿"Item Id","Item URI","Dublin Core:Title","Dublin Core:Subject","Dublin Core:Description","Dublin Core:Creator","Dublin Core:Source","Dublin Core:Publisher","Dublin Core:Date","Dublin Core:Contributor","Dublin Core:Rights","Dublin Core:Relation","Dublin Core:Format","Dublin Core:Language","Dublin Core:Type","Dublin Core:Identifier","Dublin Core:Coverage","Item Type Metadata:Text","Item Type Metadata:Interviewer","Item Type Metadata:Interviewee","Item Type Metadata:Location","Item Type Metadata:Transcription","Item Type Metadata:Local URL","Item Type Metadata:Original Format","Item Type Metadata:Physical Dimensions","Item Type Metadata:Duration","Item Type Metadata:Compression","Item Type Metadata:Producer","Item Type Metadata:Director","Item Type Metadata:Bit Rate/Frequency","Item Type Metadata:Time Summary","Item Type Metadata:Email Body","Item Type Metadata:Subject Line","Item Type Metadata:From","Item Type Metadata:To","Item Type Metadata:CC","Item Type Metadata:BCC","Item Type Metadata:Number of Attachments","Item Type Metadata:Standards","Item Type Metadata:Objectives","Item Type Metadata:Materials","Item Type Metadata:Lesson Plan Text","Item Type Metadata:URL","Item Type Metadata:Event Type","Item Type Metadata:Participants","Item Type Metadata:Birth Date","Item Type Metadata:Birthplace","Item Type Metadata:Death Date","Item Type Metadata:Occupation","Item Type Metadata:Biographical Text","Item Type Metadata:Bibliography","Item Type Metadata:Digital Reproduction Information","Item Type Metadata:Repository","Item Type Metadata:Repository Collection","Item Type Metadata:Contact information.","Item Type Metadata:File Name","Item Type Metadata:Notes","Item Type Metadata:Digital item created","Item Type Metadata:Digital item modified","Item Type Metadata:Executive Orders","Item Type Metadata:Record Created","Item Type Metadata:Record Modified","Item Type Metadata:Transcription2","Item Type Metadata:Source URL","Omeka Legacy File:Additional Creator","Omeka Legacy File:Transcriber","Omeka Legacy File:Producer","Omeka Legacy File:Render Device","Omeka Legacy File:Render Details","Omeka Legacy File:Capture Date","Omeka Legacy File:Capture Device","Omeka Legacy File:Capture Details","Omeka Legacy File:Change History","Omeka Legacy File:Watermark","Omeka Legacy File:Encryption","Omeka Legacy File:Compression","Omeka Legacy File:Post Processing","Omeka Image File:Width","Omeka Image File:Height","Omeka Image File:Bit Depth","Omeka Image File:Channels","Omeka Image File:Exif String","Omeka Image File:Exif Array","Omeka Image File:IPTC String","Omeka Image File:IPTC Array","Omeka Video File:Bitrate","Omeka Video File:Duration","Omeka Video File:Sample Rate","Omeka Video File:Codec","Omeka Video File:Width","Omeka Video File:Height",tags,file,itemType,collection,public,featured
64187,https://www.iowaheritage.org/items/show/64187,"Yeah, sure, feed it to the pigs!","Corn|United States|Pigs|2000-2010|Science|Animal experimentation|Animals|Crops|Food|Food adulteration and inspection -- United States|Food law and legislation -- United States|Farmers|Buckets|Corn|Troughs","Starlink corn","Duffy, Brian, 1955-",,"University of Iowa. Libraries. Special Collections Dept.",2000-11-19|2011-04,,"Educational use only, no other permissions given. Copyright to this digital object is owned by The Des Moines Register; it may not be downloaded, reproduced, or distributed without written permission. For more information, contact the Special Collections Department.","Editorial Cartoons of Brian Duffy; Des Moines Register Cartoonists|Papers of Brian Duffy|Des Moines Register",,English,"Still image|Editorial cartoons",MSC916|duffy-001119|http://digital.lib.uiowa.edu/cdm/ref/collection/duffy/id/25,,,,,,,,,,,,,,,,,,,,,,,,,,,,,,,,,,,,,,,,,,,,,,,,"<a href=""http://digital.lib.uiowa.edu/cdm/ref/collection/duffy/id/25"" target=""_blank"">View this item in its source respository</a>",,,,,,,,,,,,,,,,,,,,,,,,,,,,,https://www.iowaheritage.org/files/original/3f05bb87aec2220000d0a852f63544bc.jpg,"Remote Item","Editorial Cartoons of Brian Duffy",1,0
9711,https://www.iowaheritage.org/items/show/9711,"St. George and the dragon.","Economics|Farmers|inflation|supply and demand|agriculture|farming|crops|labor|unions|strikes and lockouts|dragons|cattle|hogs|ordinary citizen.",,"Darling, Jay N. (Jay Norwood), 1876-1962","The Editorial cartoons of J.N. ""Ding"" Darling [electronic resource] : The Cowles Collection, Drake University, 1912-1962",,1948/09/12|1948,,"Copyright is owned by the ""Ding"" Darling Wildlife Society; it is administered on behalf of the Society by The University of Iowa. While use within the classroom is encouraged without specific authorization, publishing this cartoon in any format requires written permission. See policy and permissions procedure at: http://www.lib.uiowa.edu/spec-coll/services/dingdarling_fees.html","Cowles Library, Drake University, 2507 University Ave., Des Moines, IA 50311-4505.",,,,"480912.jpg|http://ddr.lib.drake.edu/u?/ddarling,6641",,,,,,,,,,,,,,,,,,,,,,,,,,,,,,,,,,,,,,,,,,,,,,,,"<a href=""http://ddr.lib.drake.edu/u?/ddarling,6641"" target=""_blank"">View this item in its source respository</a>",,,,,,,,,,,,,,,,,,,,,,,,,,,,,https://www.iowaheritage.org/files/original/a619377254e895165905d6e8b23f2a26.jpg,"Remote Item","Editorial Cartoons of J.N. ""Ding"" Darling, Drake University",1,0
73312,https://www.iowaheritage.org/items/show/73312,"Self-propelled combine harvesting crops, view from front, 1955","Iowa State University|Agricultural and Biosystems Engineering Dept.|Combines (Agricultural machinery)|Farmers|Crops|Harvesting","A farmer operates a self-propelled combine to harvest crops in Washington County, Iowa, shown in view from front.|The teaching of agricultural engineering at Iowa State University began in 1903 and was overseen by the Department of Agronomy from 1905 to 1907. The Department of Agricultural Engineering was formally established in 1907. It was renamed the Department of Agricultural and Biosystems Engineering in 1990. In 2004, the Department merged with  the Department of Industrial Education and Technology. It is jointly administered by the College of Engineering and College of Agriculture and Life Sciences.","Benn; Iowa State University",09-07-F.AgEngr.555-03-003-2,"Iowa State University Library Special Collections; http://www.add.lib.iastate.edu/spcl/index.html",1955,,"U.S. and international copyright laws protect this digital image. Commercial use or distribution of the image is not permitted without prior permission of the copyright holder. For permission to use the digital image, please contact Iowa State University Library, Special Collections archives@iastate.edu  For reproductions see:  http://www.add.lib.iastate.edu/spcl/services/photfees.html","University Photographs; http://www.add.lib.iastate.edu/spcl/collections/images.html",Photograph,,"Image (grayscale)|Image",09-07-F.AgEngr.555-03-003-2|https://digitalcollections.lib.iastate.edu/,,,,,,,,,,,,,,,,,,,,,,,,,,,,,,,,,,,,,,,,,,,,,,,,"<a href=""https://digitalcollections.lib.iastate.edu/"" target=""_blank"">View this item in its source respository</a>",,,,,,,,,,,,,,,,,,,,,,,,,,,,,https://www.iowaheritage.org/files/original/7b910dc6924b576b68e14166072b4cbe.jpg,"Remote Item",,1,0
68818,https://www.iowaheritage.org/items/show/68818,"Self-propelled combine harvesting crops, view from front, 1955","Iowa State University|Agricultural and Biosystems Engineering Dept.|Combines (Agricultural machinery)|Farmers|Crops|Harvesting","A farmer operates a self-propelled combine to harvest crops in Washington County, Iowa, shown in view from front.|The teaching of agricultural engineering at Iowa State University began in 1903 and was overseen by the Department of Agronomy from 1905 to 1907. The Department of Agricultural Engineering was formally established in 1907. It was renamed the Department of Agricultural and Biosystems Engineering in 1990. In 2004, the Department merged with  the Department of Industrial Education and Technology. It is jointly administered by the College of Engineering and College of Agriculture and Life Sciences.","Benn; Iowa State University",09-07-F.AgEngr.555-03-003-2,"Iowa State University Library Special Collections; http://www.add.lib.iastate.edu/spcl/index.html",1955,,"U.S. and international copyright laws protect this digital image. Commercial use or distribution of the image is not permitted without prior permission of the copyright holder. For permission to use the digital image, please contact Iowa State University Library, Special Collections archives@iastate.edu  For reproductions see:  http://www.add.lib.iastate.edu/spcl/services/photfees.html","University Photographs; http://www.add.lib.iastate.edu/spcl/collections/images.html",Photograph,,"Image (grayscale)|Image",09-07-F.AgEngr.555-03-003-2|https://digitalcollections.lib.iastate.edu/,,,,,,,,,,,,,,,,,,,,,,,,,,,,,,,,,,,,,,,,,,,,,,,,"<a href=""https://digitalcollections.lib.iastate.edu/"" target=""_blank"">View this item in its source respository</a>",,,,,,,,,,,,,,,,,,,,,,,,,,,,,https://www.iowaheritage.org/files/original/b0e0281172af96ffcaa74be4a1106c26.jpg,"Remote Item","Iowa State University Library Photograph Collection",1,0
73317,https://www.iowaheritage.org/items/show/73317,"Self-propelled combine harvesting crops, right side view showing brand name Massey Ferguson, 1955","Iowa State University|Agricultural and Biosystems Engineering Dept.|Combines (Agricultural machinery)|Farmers|Crops|Harvesting","A self-propelled Massey Ferguson combine is viewed from the right side harvesting crops in Washington County, Iowa.|The teaching of agricultural engineering at Iowa State University began in 1903 and was overseen by the Department of Agronomy from 1905 to 1907. The Department of Agricultural Engineering was formally established in 1907. It was renamed the Department of Agricultural and Biosystems Engineering in 1990. In 2004, the Department merged with  the Department of Industrial Education and Technology. It is jointly administered by the College of Engineering and College of Agriculture and Life Sciences.","Benn; Iowa State University",09-07-F.AgEngr.555-03-003-6,"Iowa State University Library Special Collections; http://www.add.lib.iastate.edu/spcl/index.html",1955,,"U.S. and international copyright laws protect this digital image. Commercial use or distribution of the image is not permitted without prior permission of the copyright holder. For permission to use the digital image, please contact Iowa State University Library, Special Collections archives@iastate.edu  For reproductions see:  http://www.add.lib.iastate.edu/spcl/services/photfees.html","University Photographs; http://www.add.lib.iastate.edu/spcl/collections/images.html",Photograph,,"Image (grayscale)|Image",09-07-F.AgEngr.555-03-003-6|https://digitalcollections.lib.iastate.edu/,,,,,,,,,,,,,,,,,,,,,,,,,,,,,,,,,,,,,,,,,,,,,,,,"<a href=""https://digitalcollections.lib.iastate.edu/"" target=""_blank"">View this item in its source respository</a>",,,,,,,,,,,,,,,,,,,,,,,,,,,,,https://www.iowaheritage.org/files/original/4ebcb0a6d6821001b83e2d10cfa7f1b2.jpg,"Remote Item",,1,0
68823,https://www.iowaheritage.org/items/show/68823,"Self-propelled combine harvesting crops, right side view showing brand name Massey Ferguson, 1955","Iowa State University|Agricultural and Biosystems Engineering Dept.|Combines (Agricultural machinery)|Farmers|Crops|Harvesting","A self-propelled Massey Ferguson combine is viewed from the right side harvesting crops in Washington County, Iowa.|The teaching of agricultural engineering at Iowa State University began in 1903 and was overseen by the Department of Agronomy from 1905 to 1907. The Department of Agricultural Engineering was formally established in 1907. It was renamed the Department of Agricultural and Biosystems Engineering in 1990. In 2004, the Department merged with  the Department of Industrial Education and Technology. It is jointly administered by the College of Engineering and College of Agriculture and Life Sciences.","Benn; Iowa State University",09-07-F.AgEngr.555-03-003-6,"Iowa State University Library Special Collections; http://www.add.lib.iastate.edu/spcl/index.html",1955,,"U.S. and international copyright laws protect this digital image. Commercial use or distribution of the image is not permitted without prior permission of the copyright holder. For permission to use the digital image, please contact Iowa State University Library, Special Collections archives@iastate.edu  For reproductions see:  http://www.add.lib.iastate.edu/spcl/services/photfees.html","University Photographs; http://www.add.lib.iastate.edu/spcl/collections/images.html",Photograph,,"Image (grayscale)|Image",09-07-F.AgEngr.555-03-003-6|https://digitalcollections.lib.iastate.edu/,,,,,,,,,,,,,,,,,,,,,,,,,,,,,,,,,,,,,,,,,,,,,,,,"<a href=""https://digitalcollections.lib.iastate.edu/"" target=""_blank"">View this item in its source respository</a>",,,,,,,,,,,,,,,,,,,,,,,,,,,,,https://www.iowaheritage.org/files/original/7eae8168640cdf2ad35580663f225f07.jpg,"Remote Item","Iowa State University Library Photograph Collection",1,0
73314,https://www.iowaheritage.org/items/show/73314,"Self-propelled combine harvesting crops, right rear view showing grain dust, 1955.","Iowa State University|Agricultural and Biosystems Engineering Dept.|Combines (Agricultural machinery)|Farmers|Crops|Harvesting|Agricultural wastes","Shown from the right rear, a self-propelled combine takes down crops in Washington County, Iowa, while simultaneously harvesting the grain in a cloud of dust.|The teaching of agricultural engineering at Iowa State University began in 1903 and was overseen by the Department of Agronomy from 1905 to 1907. The Department of Agricultural Engineering was formally established in 1907. It was renamed the Department of Agricultural and Biosystems Engineering in 1990. In 2004, the Department merged with  the Department of Industrial Education and Technology. It is jointly administered by the College of Engineering and College of Agriculture and Life Sciences.","Benn; Iowa State University",09-07-F.AgEngr.555-03-003-4,"Iowa State University Library Special Collections; http://www.add.lib.iastate.edu/spcl/index.html",1955,,"U.S. and international copyright laws protect this digital image. Commercial use or distribution of the image is not permitted without prior permission of the copyright holder. For permission to use the digital image, please contact Iowa State University Library, Special Collections archives@iastate.edu  For reproductions see:  http://www.add.lib.iastate.edu/spcl/services/photfees.html","University Photographs; http://www.add.lib.iastate.edu/spcl/collections/images.html",Photograph,,"Image (grayscale)|Image",09-07-F.AgEngr.555-03-003-4|https://digitalcollections.lib.iastate.edu/,,,,,,,,,,,,,,,,,,,,,,,,,,,,,,,,,,,,,,,,,,,,,,,,"<a href=""https://digitalcollections.lib.iastate.edu/"" target=""_blank"">View this item in its source respository</a>",,,,,,,,,,,,,,,,,,,,,,,,,,,,,https://www.iowaheritage.org/files/original/91a642f23c161a89afe2ebc355d7f3a2.jpg,"Remote Item",,1,0
68820,https://www.iowaheritage.org/items/show/68820,"Self-propelled combine harvesting crops, right rear view showing grain dust, 1955.","Iowa State University|Agricultural and Biosystems Engineering Dept.|Combines (Agricultural machinery)|Farmers|Crops|Harvesting|Agricultural wastes","Shown from the right rear, a self-propelled combine takes down crops in Washington County, Iowa, while simultaneously harvesting the grain in a cloud of dust.|The teaching of agricultural engineering at Iowa State University began in 1903 and was overseen by the Department of Agronomy from 1905 to 1907. The Department of Agricultural Engineering was formally established in 1907. It was renamed the Department of Agricultural and Biosystems Engineering in 1990. In 2004, the Department merged with  the Department of Industrial Education and Technology. It is jointly administered by the College of Engineering and College of Agriculture and Life Sciences.","Benn; Iowa State University",09-07-F.AgEngr.555-03-003-4,"Iowa State University Library Special Collections; http://www.add.lib.iastate.edu/spcl/index.html",1955,,"U.S. and international copyright laws protect this digital image. Commercial use or distribution of the image is not permitted without prior permission of the copyright holder. For permission to use the digital image, please contact Iowa State University Library, Special Collections archives@iastate.edu  For reproductions see:  http://www.add.lib.iastate.edu/spcl/services/photfees.html","University Photographs; http://www.add.lib.iastate.edu/spcl/collections/images.html",Photograph,,"Image (grayscale)|Image",09-07-F.AgEngr.555-03-003-4|https://digitalcollections.lib.iastate.edu/,,,,,,,,,,,,,,,,,,,,,,,,,,,,,,,,,,,,,,,,,,,,,,,,"<a href=""https://digitalcollections.lib.iastate.edu/"" target=""_blank"">View this item in its source respository</a>",,,,,,,,,,,,,,,,,,,,,,,,,,,,,https://www.iowaheritage.org/files/original/b9905a512d435062eca51046944e959a.jpg,"Remote Item","Iowa State University Library Photograph Collection",1,0
73315,https://www.iowaheritage.org/items/show/73315,"Self-propelled combine harvesting crops, right rear view showing crop stalks left behind, 1955","Iowa State University|Agricultural and Biosystems Engineering Dept.|Combines (Agricultural machinery)|Farmers|Crops|Harvesting|Agricultural wastes","Shown from the right rear, a self-propelled combine harvests crops in Washington County, Iowa, leaving behind shreds of unwanted crop stalks.|The teaching of agricultural engineering at Iowa State University began in 1903 and was overseen by the Department of Agronomy from 1905 to 1907. The Department of Agricultural Engineering was formally established in 1907. It was renamed the Department of Agricultural and Biosystems Engineering in 1990. In 2004, the Department merged with  the Department of Industrial Education and Technology. It is jointly administered by the College of Engineering and College of Agriculture and Life Sciences.","Benn; Iowa State University",09-07-F.AgEngr.555-03-003-5,"Iowa State University Library Special Collections; http://www.add.lib.iastate.edu/spcl/index.html",1955,,"U.S. and international copyright laws protect this digital image. Commercial use or distribution of the image is not permitted without prior permission of the copyright holder. For permission to use the digital image, please contact Iowa State University Library, Special Collections archives@iastate.edu  For reproductions see:  http://www.add.lib.iastate.edu/spcl/services/photfees.html","University Photographs; http://www.add.lib.iastate.edu/spcl/collections/images.html",Photograph,,"Image (grayscale)|Image",09-07-F.AgEngr.555-03-003-5|https://digitalcollections.lib.iastate.edu/,,,,,,,,,,,,,,,,,,,,,,,,,,,,,,,,,,,,,,,,,,,,,,,,"<a href=""https://digitalcollections.lib.iastate.edu/"" target=""_blank"">View this item in its source respository</a>",,,,,,,,,,,,,,,,,,,,,,,,,,,,,https://www.iowaheritage.org/files/original/3274280d7d3f22b5fffa0fb649a9caf3.jpg,"Remote Item",,1,0
68821,https://www.iowaheritage.org/items/show/68821,"Self-propelled combine harvesting crops, right rear view showing crop stalks left behind, 1955","Iowa State University|Agricultural and Biosystems Engineering Dept.|Combines (Agricultural machinery)|Farmers|Crops|Harvesting|Agricultural wastes","Shown from the right rear, a self-propelled combine harvests crops in Washington County, Iowa, leaving behind shreds of unwanted crop stalks.|The teaching of agricultural engineering at Iowa State University began in 1903 and was overseen by the Department of Agronomy from 1905 to 1907. The Department of Agricultural Engineering was formally established in 1907. It was renamed the Department of Agricultural and Biosystems Engineering in 1990. In 2004, the Department merged with  the Department of Industrial Education and Technology. It is jointly administered by the College of Engineering and College of Agriculture and Life Sciences.","Benn; Iowa State University",09-07-F.AgEngr.555-03-003-5,"Iowa State University Library Special Collections; http://www.add.lib.iastate.edu/spcl/index.html",1955,,"U.S. and international copyright laws protect this digital image. Commercial use or distribution of the image is not permitted without prior permission of the copyright holder. For permission to use the digital image, please contact Iowa State University Library, Special Collections archives@iastate.edu  For reproductions see:  http://www.add.lib.iastate.edu/spcl/services/photfees.html","University Photographs; http://www.add.lib.iastate.edu/spcl/collections/images.html",Photograph,,"Image (grayscale)|Image",09-07-F.AgEngr.555-03-003-5|https://digitalcollections.lib.iastate.edu/,,,,,,,,,,,,,,,,,,,,,,,,,,,,,,,,,,,,,,,,,,,,,,,,"<a href=""https://digitalcollections.lib.iastate.edu/"" target=""_blank"">View this item in its source respository</a>",,,,,,,,,,,,,,,,,,,,,,,,,,,,,https://www.iowaheritage.org/files/original/163ad396e2a8326505162a74b351d8d9.jpg,"Remote Item","Iowa State University Library Photograph Collection",1,0
