 




﻿"Item Id","Item URI","Dublin Core:Title","Dublin Core:Subject","Dublin Core:Description","Dublin Core:Creator","Dublin Core:Source","Dublin Core:Publisher","Dublin Core:Date","Dublin Core:Contributor","Dublin Core:Rights","Dublin Core:Relation","Dublin Core:Format","Dublin Core:Language","Dublin Core:Type","Dublin Core:Identifier","Dublin Core:Coverage","Item Type Metadata:Text","Item Type Metadata:Interviewer","Item Type Metadata:Interviewee","Item Type Metadata:Location","Item Type Metadata:Transcription","Item Type Metadata:Local URL","Item Type Metadata:Original Format","Item Type Metadata:Physical Dimensions","Item Type Metadata:Duration","Item Type Metadata:Compression","Item Type Metadata:Producer","Item Type Metadata:Director","Item Type Metadata:Bit Rate/Frequency","Item Type Metadata:Time Summary","Item Type Metadata:Email Body","Item Type Metadata:Subject Line","Item Type Metadata:From","Item Type Metadata:To","Item Type Metadata:CC","Item Type Metadata:BCC","Item Type Metadata:Number of Attachments","Item Type Metadata:Standards","Item Type Metadata:Objectives","Item Type Metadata:Materials","Item Type Metadata:Lesson Plan Text","Item Type Metadata:URL","Item Type Metadata:Event Type","Item Type Metadata:Participants","Item Type Metadata:Birth Date","Item Type Metadata:Birthplace","Item Type Metadata:Death Date","Item Type Metadata:Occupation","Item Type Metadata:Biographical Text","Item Type Metadata:Bibliography","Item Type Metadata:Digital Reproduction Information","Item Type Metadata:Repository","Item Type Metadata:Repository Collection","Item Type Metadata:Contact information.","Item Type Metadata:File Name","Item Type Metadata:Notes","Item Type Metadata:Digital item created","Item Type Metadata:Digital item modified","Item Type Metadata:Executive Orders","Item Type Metadata:Record Created","Item Type Metadata:Record Modified","Item Type Metadata:Transcription2","Item Type Metadata:Source URL","Omeka Legacy File:Additional Creator","Omeka Legacy File:Transcriber","Omeka Legacy File:Producer","Omeka Legacy File:Render Device","Omeka Legacy File:Render Details","Omeka Legacy File:Capture Date","Omeka Legacy File:Capture Device","Omeka Legacy File:Capture Details","Omeka Legacy File:Change History","Omeka Legacy File:Watermark","Omeka Legacy File:Encryption","Omeka Legacy File:Compression","Omeka Legacy File:Post Processing","Omeka Image File:Width","Omeka Image File:Height","Omeka Image File:Bit Depth","Omeka Image File:Channels","Omeka Image File:Exif String","Omeka Image File:Exif Array","Omeka Image File:IPTC String","Omeka Image File:IPTC Array","Omeka Video File:Bitrate","Omeka Video File:Duration","Omeka Video File:Sample Rate","Omeka Video File:Codec","Omeka Video File:Width","Omeka Video File:Height",tags,file,itemType,collection,public,featured
2767,https://www.iowaheritage.org/items/show/2767,"Arlington Avenue, Ralph Orwig Residence|Residence of Ralph Orwig","Houses|Trees|Outdoor furniture|Rivers|Bridges|Canoes","This house on Arlington Avenue was the home of Ralph Orwig. Mr. Orwig was a patent lawyer with Orwig and Bair. The view from the property is looking northwest along the Des Moines River and the Sixth Avenue Bridge is visible. The house was razed and in 1944 a new structure was built on the property.",,"Special Collections, Cowles Library -- Drake University.","Chicago, Il. : Gravure Illustration Co.",1914|2005/05/24,,"U.S. and International copyright laws protect this digital image. Commercial use or distribution of the image is not permitted without prior permission of the copyright holder. For permission to use the digital image, please contact: bart.schmidt@drake.edu","Art Work of Des Moines -- Book Nine","Photographic print, 4.5 x 7 in.",,Image,"v. 9, p. 8|dm0166|http://ddr.lib.drake.edu/u?/du-hdm,118","1919 Arlington Ave.",,,,,,,,,,,,,,,,,,,,,,,,,,,,,,,,,,,,,,,,,,,,,,,"<a href=""http://ddr.lib.drake.edu/u?/du-hdm,118"" target=""_blank"">View this item in its source respository</a>",,,,,,,,,,,,,,,,,,,,,,,,,,,,,https://www.iowaheritage.org/files/original/5f8157187307250e26cf1aefead11e02.jpg,"Remote Item","Des Moines University Historic Photograph Collection",1,0
12357,https://www.iowaheritage.org/items/show/12357,"Inside Iowa Advanced Technology Laboratories after flooding, The University of Iowa, June 19, 2008","Floods|University of Iowa|United States -- Iowa -- Iowa City|2000-2010|Evacuations|Disaster relief|Canoes|Educational facilities|University of Iowa. Museum of Art","Inside the Iowa Advanced Technology Laboratories and Iowa Memorial Union on Thursday, June 19, 2008.","Schoon, Tim",,"University of Iowa. University News Services",2008-06-19|2008-06-19,,"Educational use only, no other permissions given. U.S. and international copyright laws may protect this item. Commercial use or distribution of this digital object is not permitted without written permission of the copyright holder.","Iowa City Flood|Flood Images|Flood, June 19, 2008",jpeg,,"Still image|Photographs",https://digital.lib.uiowa.edu/,,,,,,,,,,,,,,,,,,,,,,,,,,,,,,,,,,,,,,,,,,,,,,,,"<a href=""https://digital.lib.uiowa.edu/"" target=""_blank"">View this item in its source respository</a>",,,,,,,,,,,,,,,,,,,,,,,,,,,,,https://www.iowaheritage.org/files/original/e02b4ac6abac25f2e128b1765b5a0312.jpg,"Remote Item","Iowa City Flood",1,0
17964,https://www.iowaheritage.org/items/show/17964,"Canoing at  Marjory Camp, The University of Iowa, 1930s","Women|University of Iowa. Dept. of Physical Education for Women|United States -- Iowa -- Iowa City|1930-1940|Students|Universities & colleges|Canoes|Canoeists (Sports)|University of Iowa. Dept. of Health and Sport Studies",,unknown,,"University of Iowa. Libraries. Iowa Women's Archives",1930/1939|2008-03-20,,"Educational use only, no other permissions given. U.S. and international copyright laws may protect this item. Commercial use or distribution of this digital object is not permitted without written permission of the Iowa Women's Archives.","University of Iowa Physical Education for Women|The University of Iowa Department of Physical Education for Women Records, 1900-2006|http://www.lib.uiowa.edu/collguides/?IWA0106|Canoeing",jpeg|11|16,,"Still image|Photographs",IWA0106|uipe0068.jpg|https://digital.lib.uiowa.edu/,,,,,,,,,,,,,,,,,,,,,,,,,,,,,,,,,,,,,,,,,,,,,,,,"<a href=""https://digital.lib.uiowa.edu/"" target=""_blank"">View this item in its source respository</a>",,,,,,,,,,,,,,,,,,,,,,,,,,,,,https://www.iowaheritage.org/files/original/5631feec380da6caeaee702f09b35024.jpg,"Remote Item","University of Iowa Physical Education for Women",1,0
17967,https://www.iowaheritage.org/items/show/17967,"Students launching a canoe from a dock, The University of Iowa, 1928?","Women|University of Iowa. Dept. of Physical Education for Women|United States -- Iowa -- Iowa City|1920-1930|Students|Universities & colleges|Canoeists (Sports)|Canoes|University of Iowa. Dept. of Health and Sport Studies",,unknown,,"University of Iowa. Libraries. Iowa Women's Archives",1928|2008-03-20,,"Educational use only, no other permissions given. U.S. and international copyright laws may protect this item. Commercial use or distribution of this digital object is not permitted without written permission of the Iowa Women's Archives.","University of Iowa Physical Education for Women|The University of Iowa Department of Physical Education for Women Records, 1900-2006|http://www.lib.uiowa.edu/collguides/?IWA0106|Canoeing",jpeg|11|16,,"Still image|Photographs",IWA0106|uipe0093.jpg|https://digital.lib.uiowa.edu/,,,,,,,,,,,,,,,,,,,,,,,,,,,,,,,,,,,,,,,,,,,,,,,,"<a href=""https://digital.lib.uiowa.edu/"" target=""_blank"">View this item in its source respository</a>",,,,,,,,,,,,,,,,,,,,,,,,,,,,,https://www.iowaheritage.org/files/original/d739bb07f451932610386ad5a56b583b.jpg,"Remote Item","University of Iowa Physical Education for Women",1,0
17969,https://www.iowaheritage.org/items/show/17969,"Land drill demonstrating changing paddles with oar straight up, The University of Iowa, 1930s","Women|University of Iowa. Dept. of Physical Education for Women|United States -- Iowa -- Iowa City|1930-1940|Students|Universities & colleges|Canoes|Canoeists (Sports)|University of Iowa. Dept. of Health and Sport Studies",,unknown,,"University of Iowa. Libraries. Iowa Women's Archives",1930/1939|2008-03-20,,"Educational use only, no other permissions given. U.S. and international copyright laws may protect this item. Commercial use or distribution of this digital object is not permitted without written permission of the Iowa Women's Archives.","University of Iowa Physical Education for Women|The University of Iowa Department of Physical Education for Women Records, 1900-2006|http://www.lib.uiowa.edu/collguides/?IWA0106|Canoeing",jpeg|11|17,,"Still image|Photographs",IWA0106|uipe0086.jpg|https://digital.lib.uiowa.edu/,,,,,,,,,,,,,,,,,,,,,,,,,,,,,,,,,,,,,,,,,,,,,,,,"<a href=""https://digital.lib.uiowa.edu/"" target=""_blank"">View this item in its source respository</a>",,,,,,,,,,,,,,,,,,,,,,,,,,,,,https://www.iowaheritage.org/files/original/6890e63e3c4ecfe04735609d12e980e4.jpg,"Remote Item","University of Iowa Physical Education for Women",1,0
17970,https://www.iowaheritage.org/items/show/17970,"Land drill demonstrating change paddles, The University of Iowa, 1930s","Women|University of Iowa. Dept. of Physical Education for Women|United States -- Iowa -- Iowa City|1930-1940|Students|Universities & colleges|Canoeists (Sports)|Canoes|University of Iowa. Dept. of Health and Sport Studies",,unknown,,"University of Iowa. Libraries. Iowa Women's Archives",1930/1939|2008-03-20,,"Educational use only, no other permissions given. U.S. and international copyright laws may protect this item. Commercial use or distribution of this digital object is not permitted without written permission of the Iowa Women's Archives.","University of Iowa Physical Education for Women|The University of Iowa Department of Physical Education for Women Records, 1900-2006|http://www.lib.uiowa.edu/collguides/?IWA0106|Canoeing",jpeg|11|17,,"Still image|Photographs",IWA0106|uipe0076.jpg|https://digital.lib.uiowa.edu/,,,,,,,,,,,,,,,,,,,,,,,,,,,,,,,,,,,,,,,,,,,,,,,,"<a href=""https://digital.lib.uiowa.edu/"" target=""_blank"">View this item in its source respository</a>",,,,,,,,,,,,,,,,,,,,,,,,,,,,,https://www.iowaheritage.org/files/original/dc6a8b269da74387fed50983d7594929.jpg,"Remote Item","University of Iowa Physical Education for Women",1,0
17971,https://www.iowaheritage.org/items/show/17971,"Students canoeing, The University of Iowa, 1930s","Women|Scott, M. Gladys (Myrtle Gladys), 1905-|University of Iowa. Dept. of Physical Education for Women|United States -- Iowa -- Iowa City|1930-1940|Students|Universities & colleges|Canoeists (Sports)|Canoes|Holmes, Blanche|Ashton, Gladys|University of Iowa. Dept. of Health and Sport Studies",,unknown,,"University of Iowa. Libraries. Iowa Women's Archives",1930/1939|2008-03-20,,"Educational use only, no other permissions given. U.S. and international copyright laws may protect this item. Commercial use or distribution of this digital object is not permitted without written permission of the Iowa Women's Archives.","University of Iowa Physical Education for Women|The University of Iowa Department of Physical Education for Women Records, 1900-2006|http://www.lib.uiowa.edu/collguides/?IWA0106|Canoeing",jpeg|9|13,,"Still image|Photographs",IWA0106|uipe0088.jpg|https://digital.lib.uiowa.edu/,,,,,,,,,,,,,,,,,,,,,,,,,,,,,,,,,,,,,,,,,,,,,,,,"<a href=""https://digital.lib.uiowa.edu/"" target=""_blank"">View this item in its source respository</a>",,,,,,,,,,,,,,,,,,,,,,,,,,,,,https://www.iowaheritage.org/files/original/dde377ac0bcf1ea3e11802592c4b3bef.jpg,"Remote Item","University of Iowa Physical Education for Women",1,0
17972,https://www.iowaheritage.org/items/show/17972,"Students on dock, The University of Iowa, 1930s","Women|University of Iowa. Dept. of Physical Education for Women|United States -- Iowa -- Iowa City|1930-1940|Students|Universities & colleges|Canoeists (Sports)|Canoes|University of Iowa. Dept. of Health and Sport Studies",,unknown,,"University of Iowa. Libraries. Iowa Women's Archives",1930/1939|2008-03-20,,"Educational use only, no other permissions given. U.S. and international copyright laws may protect this item. Commercial use or distribution of this digital object is not permitted without written permission of the Iowa Women's Archives.","University of Iowa Physical Education for Women|The University of Iowa Department of Physical Education for Women Records, 1900-2006|http://www.lib.uiowa.edu/collguides/?IWA0106|Canoeing",jpeg|10|16,,"Still image|Photographs",IWA0106|uipe0078.jpg|https://digital.lib.uiowa.edu/,,,,,,,,,,,,,,,,,,,,,,,,,,,,,,,,,,,,,,,,,,,,,,,,"<a href=""https://digital.lib.uiowa.edu/"" target=""_blank"">View this item in its source respository</a>",,,,,,,,,,,,,,,,,,,,,,,,,,,,,https://www.iowaheritage.org/files/original/149c06d28c3c381f169b6e2a5393644e.jpg,"Remote Item","University of Iowa Physical Education for Women",1,0
17973,https://www.iowaheritage.org/items/show/17973,"Canoeing, The University of Iowa, 1930s","Women|University of Iowa. Dept. of Physical Education for Women|United States -- Iowa -- Iowa City|1930-1940|Students|Universities & colleges|Canoes|Canoeists (Sports)|University of Iowa. Dept. of Health and Sport Studies",,unknown,,"University of Iowa. Libraries. Iowa Women's Archives",1930/1939|2008-03-20,,"Educational use only, no other permissions given. U.S. and international copyright laws may protect this item. Commercial use or distribution of this digital object is not permitted without written permission of the Iowa Women's Archives.","University of Iowa Physical Education for Women|The University of Iowa Department of Physical Education for Women Records, 1900-2006|http://www.lib.uiowa.edu/collguides/?IWA0106|Canoeing",jpeg|11|17,,"Still image|Photographs",IWA0106|uipe0066.jpg|https://digital.lib.uiowa.edu/,,,,,,,,,,,,,,,,,,,,,,,,,,,,,,,,,,,,,,,,,,,,,,,,"<a href=""https://digital.lib.uiowa.edu/"" target=""_blank"">View this item in its source respository</a>",,,,,,,,,,,,,,,,,,,,,,,,,,,,,https://www.iowaheritage.org/files/original/239e3816521e40a8d9393c1e5dbf4de5.jpg,"Remote Item","University of Iowa Physical Education for Women",1,0
17974,https://www.iowaheritage.org/items/show/17974,"Land drill demonstrating straight draw and reach, The University of Iowa, 1930s","Women|University of Iowa. Dept. of Physical Education for Women|United States -- Iowa -- Iowa City|1930-1940|Students|Universities & colleges|Canoeists (Sports)|Canoes|University of Iowa. Dept. of Health and Sport Studies",,unknown,,"University of Iowa. Libraries. Iowa Women's Archives",1930/1939|2008-03-20,,"Educational use only, no other permissions given. U.S. and international copyright laws may protect this item. Commercial use or distribution of this digital object is not permitted without written permission of the Iowa Women's Archives.","University of Iowa Physical Education for Women|The University of Iowa Department of Physical Education for Women Records, 1900-2006|http://www.lib.uiowa.edu/collguides/?IWA0106|Canoeing",jpeg|11|17,,"Still image|Photographs",IWA0106|uipe0075.jpg|https://digital.lib.uiowa.edu/,,,,,,,,,,,,,,,,,,,,,,,,,,,,,,,,,,,,,,,,,,,,,,,,"<a href=""https://digital.lib.uiowa.edu/"" target=""_blank"">View this item in its source respository</a>",,,,,,,,,,,,,,,,,,,,,,,,,,,,,https://www.iowaheritage.org/files/original/87130f92cfe661e1bebf37c36b215287.jpg,"Remote Item","University of Iowa Physical Education for Women",1,0
