 




﻿"Item Id","Item URI","Dublin Core:Title","Dublin Core:Subject","Dublin Core:Description","Dublin Core:Creator","Dublin Core:Source","Dublin Core:Publisher","Dublin Core:Date","Dublin Core:Contributor","Dublin Core:Rights","Dublin Core:Relation","Dublin Core:Format","Dublin Core:Language","Dublin Core:Type","Dublin Core:Identifier","Dublin Core:Coverage","Item Type Metadata:Text","Item Type Metadata:Interviewer","Item Type Metadata:Interviewee","Item Type Metadata:Location","Item Type Metadata:Transcription","Item Type Metadata:Local URL","Item Type Metadata:Original Format","Item Type Metadata:Physical Dimensions","Item Type Metadata:Duration","Item Type Metadata:Compression","Item Type Metadata:Producer","Item Type Metadata:Director","Item Type Metadata:Bit Rate/Frequency","Item Type Metadata:Time Summary","Item Type Metadata:Email Body","Item Type Metadata:Subject Line","Item Type Metadata:From","Item Type Metadata:To","Item Type Metadata:CC","Item Type Metadata:BCC","Item Type Metadata:Number of Attachments","Item Type Metadata:Standards","Item Type Metadata:Objectives","Item Type Metadata:Materials","Item Type Metadata:Lesson Plan Text","Item Type Metadata:URL","Item Type Metadata:Event Type","Item Type Metadata:Participants","Item Type Metadata:Birth Date","Item Type Metadata:Birthplace","Item Type Metadata:Death Date","Item Type Metadata:Occupation","Item Type Metadata:Biographical Text","Item Type Metadata:Bibliography","Item Type Metadata:Digital Reproduction Information","Item Type Metadata:Repository","Item Type Metadata:Repository Collection","Item Type Metadata:Contact information.","Item Type Metadata:File Name","Item Type Metadata:Notes","Item Type Metadata:Digital item created","Item Type Metadata:Digital item modified","Item Type Metadata:Executive Orders","Item Type Metadata:Record Created","Item Type Metadata:Record Modified","Item Type Metadata:Transcription2","Item Type Metadata:Source URL","Omeka Legacy File:Additional Creator","Omeka Legacy File:Transcriber","Omeka Legacy File:Producer","Omeka Legacy File:Render Device","Omeka Legacy File:Render Details","Omeka Legacy File:Capture Date","Omeka Legacy File:Capture Device","Omeka Legacy File:Capture Details","Omeka Legacy File:Change History","Omeka Legacy File:Watermark","Omeka Legacy File:Encryption","Omeka Legacy File:Compression","Omeka Legacy File:Post Processing","Omeka Image File:Width","Omeka Image File:Height","Omeka Image File:Bit Depth","Omeka Image File:Channels","Omeka Image File:Exif String","Omeka Image File:Exif Array","Omeka Image File:IPTC String","Omeka Image File:IPTC Array","Omeka Video File:Bitrate","Omeka Video File:Duration","Omeka Video File:Sample Rate","Omeka Video File:Codec","Omeka Video File:Width","Omeka Video File:Height",tags,file,itemType,collection,public,featured
50352,https://www.iowaheritage.org/items/show/50352,"Baby Betsy and nanny","Burden family|United States -- Iowa -- Dubuque County|Miller, Elizabeth P. (""Betsy"") (Burden) (MacLeod), 1940 -|Grey house","Baby Betsy Burden and her nanny outside Grey house in north yard.",unknown,,,unknown,"Four Mounds Foundation","This digital image may be used for educational purposes, as long as it is not altered in any way. No commercial reproduction or distribution of this file is permitted without permission. For permission to use the digital image, please contact:  office@fourmounds.org",,"1 photograph : col. ; 3.5 x 3.5 in|JPEG",,"Still Image; Photographs",,,,,,,,,,,,,,,,,,,,,,,,,,,,,,,,,,,,,"Photographs scanned using HP Scanjet 3500c scanner at 200 ppi, 24-bit depth.",,"Four Mounds Digital Collection",,parc_26.jpg,,6/14/2006,,,,,,,,,,,,,,,,,,,,,,,,,,,,,,,,,,,https://www.iowaheritage.org/files/original/24424b83e072626394e18a388879443b.jpg,"Still Image","Four Mounds Digital Collection",1,0
50782,https://www.iowaheritage.org/items/show/50782,"Baby Frindy Burden in small scooter with friend in toy carriage with horse in front","Burden family|United States -- Iowa -- Dubuque County|Gronen, Winifred A. (""Frindy"") (Burden), 1927-1994",,Unknown,,,"c. 1928","John N. Gronen","This digital image may be used for educational purposes, as long as it is not altered in any way. No commercial reproduction or distribution of this file is permitted without permission. For permission to use the digital image, please contact: office@fourmounds.org",,"1 photograph : b&w ; 7 x 12 cm|JPEG",,"Still Image; Photographs",,,,,,,,,,,,,,,,,,,,,,,,,,,,,,,,,,,,,"Photographs scanned using HP Scanjet 3500c scanner at 600ppi, 24-bit depth.",,"Four Mounds Digital Collection",,parc_452.jpg,,1/19/2007,,,,,,,,,,,,,,,,,,,,,,,,,,,,,,,,,,,https://www.iowaheritage.org/files/original/40ecf260845227852d53fc21b9e5b025.jpg,"Still Image","Four Mounds Digital Collection",1,0
50323,https://www.iowaheritage.org/items/show/50323,"Baby Frindy in carriage","Burden family|United States -- Iowa -- Dubuque County|Gronen, Winifred A. (""Frindy"") (Burden), 1927-1994","Baby Frindy in carriage with horse in front pushed by nanny.",unknown,,,1928,"Four Mounds Foundation","This digital image may be used for educational purposes, as long as it is not altered in any way. No commercial reproduction or distribution of this file is permitted without permission. For permission to use the digital image, please contact:  office@fourmounds.org",,"1 photograph : b&w ; 3.5 x 5.5 in|JPEG",,"Still Image; Photographs",,,,,,,,,,,,,,,,,,,,,,,,,,,,,,,,,,,,,"Photographs scanned using HP Scanjet 3500c scanner at 200 ppi, 24-bit depth.",,"Four Mounds Digital Collection",,parc_11.jpg,,6/14/2006,,,,,,,,,,,,,,,,,,,,,,,,,,,,,,,,,,,https://www.iowaheritage.org/files/original/b67c66aed1ae6556b9afb9c34c9aac36.jpg,"Still Image","Four Mounds Digital Collection",1,0
50340,https://www.iowaheritage.org/items/show/50340,"Baby Frindy on floor","Burden family|United States -- Iowa -- Dubuque County|Gronen, Winifred A. (""Frindy"") (Burden), 1927-1994|White house","Baby Frindy in dress and booties seated on floor of White house.",unknown,,,1927,"Four Mounds Foundation","This digital image may be used for educational purposes, as long as it is not altered in any way. No commercial reproduction or distribution of this file is permitted without permission. For permission to use the digital image, please contact:  office@fourmounds.org",,"1 photograph : b&w ; 5 x 3 in|JPEG",,"Still Image; Photographs",,,,,,,,,,,,,,,,,,,,,,,,,,,,,,,,,,,,,"Photographs scanned using HP Scanjet 3500c scanner at 200 ppi, 24-bit depth.",,"Four Mounds Digital Collection",,parc_20.jpg,,6/14/2006,,,,,,,,,,,,,,,,,,,,,,,,,,,,,,,,,,,https://www.iowaheritage.org/files/original/c6f5683203a47fbb0d607bd4e90e00ea.jpg,"Still Image","Four Mounds Digital Collection",1,0
50783,https://www.iowaheritage.org/items/show/50783,"Baby Vidie And Frindy Burden on bench between Grey house and White house","Burden family|United States -- Iowa -- Dubuque County|Gronen, Winifred A. (""Frindy"") (Burden), 1927-1994|Lange, Viola R. (""Vidie"") (Burden), 1931-","View looks North",Unknown,,,"c. 1932-1933","John N. Gronen","This digital image may be used for educational purposes, as long as it is not altered in any way. No commercial reproduction or distribution of this file is permitted without permission. For permission to use the digital image, please contact: office@fourmounds.org",,"1 photograph : b&w ; 6 x 10 cm|JPEG",,"Still Image; Photographs",,,,,,,,,,,,,,,,,,,,,,,,,,,,,,,,,,,,,"Photographs scanned using HP Scanjet 3500c scanner at 600ppi, 24-bit depth.",,"Four Mounds Digital Collection",,parc_453.jpg,,1/19/2007,,,,,,,,,,,,,,,,,,,,,,,,,,,,,,,,,,,https://www.iowaheritage.org/files/original/01b06a3f376f754a8c8a3691150e63a5.jpg,"Still Image","Four Mounds Digital Collection",1,0
50692,https://www.iowaheritage.org/items/show/50692,"Betsy in doorway","Burden family|United States -- Iowa -- Dubuque County|Miller, Elizabeth P. (""Betsy"") (Burden) (MacLeod), 1940 -|Grey house","Betsy Burden standing in Grey house porch doorway",unknown,,,194-?,"Four Mounds Foundation","This digital image may be used for educational purposes, as long as it is not altered in any way. No commercial reproduction or distribution of this file is permitted without permission. For permission to use the digital image, please contact:  office@fourmounds.org",,"1 photograph : b&w ; 2 x 4 in|JPEG",,"Still Image; Photographs",,,,,,,,,,,,,,,,,,,,,,,,,,,,,,,,,,,,,"Photographs scanned using HP Photosmart 3210 scanner at 600 ppi, 24-bit depth.",,"Four Mounds Digital Collection",,parc_187.jpg,,7/10/2006,,,,,,,,,,,,,,,,,,,,,,,,,,,,,,,,,,,https://www.iowaheritage.org/files/original/c476acedc0ae66eecf4c5160c4caebad.jpg,"Still Image","Four Mounds Digital Collection",1,0
50461,https://www.iowaheritage.org/items/show/50461,"Betsy's Wedding","Burden family|United States -- Iowa -- Dubuque County|Weddings|Miller, Elizabeth P. (""Betsy"") (Burden) (MacLeod), 1940 -","Photograph of the wedding of Betsy Burden and Bill Mcleod at Four Mounds.",unknown,,,6/23/1962,"Four Mounds Foundation","This digital image may be used for educational purposes, as long as it is not altered in any way. No commercial reproduction or distribution of this file is permitted without permission. For permission to use the digital image, please contact:  office@fourmounds.org",,"1 photograph : b&w ; 4 x 5 in|JPEG",,"Still Image; Photographs",,,,,,,,,,,,,,,,,,,,,,,,,,,,,,,,,,,,,"Photographs scanned using HP Scanjet 3500c scanner at 200 ppi, 24-bit depth.",,"Four Mounds Digital Collection",,parc_146.JPG,,6/19/2006,,,,,,,,,,,,,,,,,,,,,,,,,,,,,,,,,,,https://www.iowaheritage.org/files/original/6f0780ca5c0d97604c31b81f19ad4818.jpg,"Still Image","Four Mounds Digital Collection",1,0
50347,https://www.iowaheritage.org/items/show/50347,"Bill and Elizabeth Burden","Burden family|United States -- Iowa -- Dubuque County|Burden, George Rider (""Bill""), 1899-1974|Burden, Elizabeth Taylor (Adams), 1903-1982|White house","Bill and Elizabeth Burden seated in cart with dog standing, near White house.",unknown,,,unknown,"Four Mounds Foundation","This digital image may be used for educational purposes, as long as it is not altered in any way. No commercial reproduction or distribution of this file is permitted without permission. For permission to use the digital image, please contact:  office@fourmounds.org",,"1 photograph : col. ; 3.5 x 3.5 in|JPEG",,"Still Image; Photographs",,,,,,,,,,,,,,,,,,,,,,,,,,,,,,,,,,,,,"Photographs scanned using HP Scanjet 3500c scanner at 200 ppi, 24-bit depth.",,"Four Mounds Digital Collection",,parc_36.jpg,,6/14/2006,,,,,,,,,,,,,,,,,,,,,,,,,,,,,,,,,,,https://www.iowaheritage.org/files/original/4b8980edf65199d92e4cf90abe01f10c.jpg,"Still Image","Four Mounds Digital Collection",1,0
50486,https://www.iowaheritage.org/items/show/50486,"Bill and Elizabeth by a van","Burden family|United States -- Wisconsin -- Hayward|Burden, Elizabeth Taylor (Adams), 1903-1982|Burden, George Rider (""Bill""), 1899-1974|Automobiles","Photograph of people by a van. From left to right: unknown, unknown, Bill Burden, Elizabeth Burden, unknown.",unknown,,,194-?,"Four Mounds Foundation","This digital image may be used for educational purposes, as long as it is not altered in any way. No commercial reproduction or distribution of this file is permitted without permission. For permission to use the digital image, please contact:  office@fourmounds.org",,"1 photograph : b&w ; 2.5 x 3.5 in|JPEG",,"Still Image; Photographs",,,,,,,,,,,,,,,,,,,,,,,,,,,,,,,,,,,,,"Photographs scanned using HP Scanjet 3500c scanner at 200 ppi, 24-bit depth.",,"Four Mounds Digital Collection",,parc_172.jpg,,6/20/2006,,,,,,,,,,,,,,,,,,,,,,,,,,,,,,,,,,,https://www.iowaheritage.org/files/original/31412808b8a94c3e7ccf3195824e2de9.jpg,"Still Image","Four Mounds Digital Collection",1,0
50650,https://www.iowaheritage.org/items/show/50650,"Bill and Elizabeth wedding portrait","Burden family|United States -- Iowa -- Dubuque County|Burden, George Rider (""Bill""), 1899-1974|Burden, Elizabeth Taylor (Adams), 1903-1982|Weddings","Professional studio group wedding photo, Bill Burden and Elizabeth Burden's wedding.","Tasker, Guy E., d. 1951",,,4/18/1925,"Four Mounds Foundation","This digital image may be used for educational purposes, as long as it is not altered in any way. No commercial reproduction or distribution of this file is permitted without permission. For permission to use the digital image, please contact:  office@fourmounds.org",,"1 photograph : b&w ; 8 x 10 in|JPEG",,"Still Image; Photographs",,,,,,,,,,,,,,,,,,,,,,,,,,,,,,,,,,,,,"Photographs scanned using HP Scanjet 3500c scanner at 200 ppi, 24-bit depth.",,"Four Mounds Digital Collection",,parc_344.jpg,,6/23/2006,,,,,,,,,,,,,,,,,,,,,,,,,,,,,,,,,,,https://www.iowaheritage.org/files/original/63165e3a6844c45655770f8c694a55f9.jpg,"Still Image","Four Mounds Digital Collection",1,0
