 




﻿"Item Id","Item URI","Dublin Core:Title","Dublin Core:Subject","Dublin Core:Description","Dublin Core:Creator","Dublin Core:Source","Dublin Core:Publisher","Dublin Core:Date","Dublin Core:Contributor","Dublin Core:Rights","Dublin Core:Relation","Dublin Core:Format","Dublin Core:Language","Dublin Core:Type","Dublin Core:Identifier","Dublin Core:Coverage","Item Type Metadata:Text","Item Type Metadata:Interviewer","Item Type Metadata:Interviewee","Item Type Metadata:Location","Item Type Metadata:Transcription","Item Type Metadata:Local URL","Item Type Metadata:Original Format","Item Type Metadata:Physical Dimensions","Item Type Metadata:Duration","Item Type Metadata:Compression","Item Type Metadata:Producer","Item Type Metadata:Director","Item Type Metadata:Bit Rate/Frequency","Item Type Metadata:Time Summary","Item Type Metadata:Email Body","Item Type Metadata:Subject Line","Item Type Metadata:From","Item Type Metadata:To","Item Type Metadata:CC","Item Type Metadata:BCC","Item Type Metadata:Number of Attachments","Item Type Metadata:Standards","Item Type Metadata:Objectives","Item Type Metadata:Materials","Item Type Metadata:Lesson Plan Text","Item Type Metadata:URL","Item Type Metadata:Event Type","Item Type Metadata:Participants","Item Type Metadata:Birth Date","Item Type Metadata:Birthplace","Item Type Metadata:Death Date","Item Type Metadata:Occupation","Item Type Metadata:Biographical Text","Item Type Metadata:Bibliography","Item Type Metadata:Digital Reproduction Information","Item Type Metadata:Repository","Item Type Metadata:Repository Collection","Item Type Metadata:Contact information.","Item Type Metadata:File Name","Item Type Metadata:Notes","Item Type Metadata:Digital item created","Item Type Metadata:Digital item modified","Item Type Metadata:Executive Orders","Item Type Metadata:Record Created","Item Type Metadata:Record Modified","Item Type Metadata:Transcription2","Item Type Metadata:Source URL","Omeka Legacy File:Additional Creator","Omeka Legacy File:Transcriber","Omeka Legacy File:Producer","Omeka Legacy File:Render Device","Omeka Legacy File:Render Details","Omeka Legacy File:Capture Date","Omeka Legacy File:Capture Device","Omeka Legacy File:Capture Details","Omeka Legacy File:Change History","Omeka Legacy File:Watermark","Omeka Legacy File:Encryption","Omeka Legacy File:Compression","Omeka Legacy File:Post Processing","Omeka Image File:Width","Omeka Image File:Height","Omeka Image File:Bit Depth","Omeka Image File:Channels","Omeka Image File:Exif String","Omeka Image File:Exif Array","Omeka Image File:IPTC String","Omeka Image File:IPTC Array","Omeka Video File:Bitrate","Omeka Video File:Duration","Omeka Video File:Sample Rate","Omeka Video File:Codec","Omeka Video File:Width","Omeka Video File:Height",tags,file,itemType,collection,public,featured
2689,https://www.iowaheritage.org/items/show/2689,"42nd Street, Edwin Thomas Meredith Residence|Residence of E. T. Meredith",Houses|Trees|Awnings,"This house on 42nd Street was the home of E. T. Meredith and his wife Edna. Mr. Meredith was the president and manager of the Successful Farming Publishing Company. Unsuccessful in his 1914 bid for U.S. Senate and his 1916 bid for Governor of Iowa, Mr. Meredith was appointed Secretary of Agriculture by President Wilson. Current site of an apartment building.",,"Special Collections, Cowles Library -- Drake University.","Chicago, Il. : Gravure Illustration Co.",1914|2005/04/25,,"U.S. and International copyright laws protect this digital image. Commercial use or distribution of the image is not permitted without prior permission of the copyright holder. For permission to use the digital image, please contact: bart.schmidt@drake.edu","Art Work of Des Moines -- Book Two","Photographic print, 4.5 x 7 in.",,Image,"v. 2, p. 3|dm0025|http://ddr.lib.drake.edu/u?/du-hdm,38","600 42nd St.",,,,,,,,,,,,,,,,,,,,,,,,,,,,,,,,,,,,,,,,,,,,,,,"<a href=""http://ddr.lib.drake.edu/u?/du-hdm,38"" target=""_blank"">View this item in its source respository</a>",,,,,,,,,,,,,,,,,,,,,,,,,,,,,https://www.iowaheritage.org/files/original/91387e258086f8f4cdbf620a398fc994.jpg,"Remote Item","Des Moines University Historic Photograph Collection",1,0
2709,https://www.iowaheritage.org/items/show/2709,"Grand Avenue, Carl J. Kurtz Residence|Residence of Carl J. Kurtz",Houses|Driveways|Automobiles|Porches|Awnings|Trees,"This house on Grand Avenue was the home of Carl J. Kurtz and his wife Nellie. Mr. Kurtz was the president of Norman Lichty Manufacturing Co. The house is no longer standing. Current site of an apartment complex.",,"Special Collections, Cowles Library -- Drake University.","Chicago, Il. : Gravure Illustration Co.",1914|2005/04/26,,"U.S. and International copyright laws protect this digital image. Commercial use or distribution of the image is not permitted without prior permission of the copyright holder. For permission to use the digital image, please contact: bart.schmidt@drake.edu","Art Work of Des Moines -- Book Two","Photographic print, 4.5 x 7 in.",,Image,"v. 2, p. 6|dm0031|http://ddr.lib.drake.edu/u?/du-hdm,60","3801 Grand Ave.",,,,,,,,,,,,,,,,,,,,,,,,,,,,,,,,,,,,,,,,,,,,,,,"<a href=""http://ddr.lib.drake.edu/u?/du-hdm,60"" target=""_blank"">View this item in its source respository</a>",,,,,,,,,,,,,,,,,,,,,,,,,,,,,https://www.iowaheritage.org/files/original/548df74a40bcc77a69177d85f52d5f04.jpg,"Remote Item","Des Moines University Historic Photograph Collection",1,0
2714,https://www.iowaheritage.org/items/show/2714,"Golf and Country Club|Golf and Country Club","Country Clubs|Clubhouses|Golf|Porches|Automobiles|Awnings|Sports & recreation facilities","The Golf and Country Club was organized in October 1897. The club offered golf, tennis, archery, baseball, bowling, trap-shooting and cards. Originally organized on a 40 acre piece of land near Ingersoll Park, the club moved west to a 100 acre tract in 1903. On this site they build their  clubhouse, which was home to many social gatherings.",,"Special Collections, Cowles Library -- Drake University.","Chicago, Il. : Gravure Illustration Co.",1914|2005/04/26,,"U.S. and International copyright laws protect this digital image. Commercial use or distribution of the image is not permitted without prior permission of the copyright holder. For permission to use the digital image, please contact: bart.schmidt@drake.edu","Art Work of Des Moines -- Book Two","Photographic print, 4.5 x 7 in.",,Image,"v. 2, p. 10|dm0037|http://ddr.lib.drake.edu/u?/du-hdm,65","Harwood Dr. at 49th",,,,,,,,,,,,,,,,,,,,,,,,,,,,,,,,,,,,,,,,,,,,,,,"<a href=""http://ddr.lib.drake.edu/u?/du-hdm,65"" target=""_blank"">View this item in its source respository</a>",,,,,,,,,,,,,,,,,,,,,,,,,,,,,https://www.iowaheritage.org/files/original/6d2baba088825ebe30ffd23417db17f3.jpg,"Remote Item","Des Moines University Historic Photograph Collection",1,0
2766,https://www.iowaheritage.org/items/show/2766,"Walnut Street, Looking West from Fourth Ave.|Walnut Street from Fourth - Looking West","Cityscapes|Business districts|Commercial streets|Pedestrians|Automobiles|Marquees|Street lights|Street railroads|Street railroad tracks|Awnings","Automobiles, trolley cars, and horse drawn carriages all shared the road on Walnut Street in downtown Des Moines. On the left is the original Kirkwood Hotel, replaced in 1930 by the current building. On the right is a variety of clothing, and dry goods retailers. These stores stood on the current site of the Capitol Square Office Building. Davidson's, visible on the left, was Iowa's largest furniture store.",,"Special Collections, Cowles Library -- Drake University.","Chicago, Il. : Gravure Illustration Co.",1914|2005/05/24,,"U.S. and International copyright laws protect this digital image. Commercial use or distribution of the image is not permitted without prior permission of the copyright holder. For permission to use the digital image, please contact: bart.schmidt@drake.edu","Art Work of Des Moines -- Book Nine","Photographic print, 4.5 x 7 in.",,Image,"v. 9, p. 9|dm0167|http://ddr.lib.drake.edu/u?/du-hdm,117","Walnut St. at 4th",,,,,,,,,,,,,,,,,,,,,,,,,,,,,,,,,,,,,,,,,,,,,,,"<a href=""http://ddr.lib.drake.edu/u?/du-hdm,117"" target=""_blank"">View this item in its source respository</a>",,,,,,,,,,,,,,,,,,,,,,,,,,,,,https://www.iowaheritage.org/files/original/7152d02d3fee41c4d2fc6f2b8f8517b7.jpg,"Remote Item","Des Moines University Historic Photograph Collection",1,0
2776,https://www.iowaheritage.org/items/show/2776,"Kinsey Avenue, J. S. Carpenter Residence|Oakwood - Residence of J. S. Carpenter","Houses|Historic buildings|Trees|Porches|Awnings|Dirt roads","This house on Kinsey Avenue was built in 1890 and is still standing. It was the home of J. S. Carpenter. Mr. Carpenter was the proprietor of Iowa Bridge Co. Carpenter nicknamed his home Oakwood. The house is listed on National Register of Historic Places.",,"Special Collections, Cowles Library -- Drake University.","Chicago, Il. : Gravure Illustration Co.",1914|2005/05/24,,"U.S. and International copyright laws protect this digital image. Commercial use or distribution of the image is not permitted without prior permission of the copyright holder. For permission to use the digital image, please contact: bart.schmidt@drake.edu","Art Work of Des Moines -- Book Nine","Photographic print, 4.5 x 7 in.",,Image,"v. 9, p. 5|dm0160|http://ddr.lib.drake.edu/u?/du-hdm,127","3320 Kinsey Ave.",,,,,,,,,,,,,,,,,,,,,,,,,,,,,,,,,,,,,,,,,,,,,,,"<a href=""http://ddr.lib.drake.edu/u?/du-hdm,127"" target=""_blank"">View this item in its source respository</a>",,,,,,,,,,,,,,,,,,,,,,,,,,,,,https://www.iowaheritage.org/files/original/eacfe3a548f4ce505e1dd0fcc539e5d7.jpg,"Remote Item","Des Moines University Historic Photograph Collection",1,0
2788,https://www.iowaheritage.org/items/show/2788,"View from Fleming Building Facing Southeast|Birdseye Views from Fleming Building","Cityscapes|Rivers|Courthouses|Flags|Commercial streets|Automobiles|Convertible automobiles|Factories|Awnings|Clock towers|Historic buildings|Business districts","This is a view from the Fleming Building facing southeast. The intersection pictured is 5th and Court. To the right is the Polk County Courthouse. The building with the Standard Life Insurance Co. sign is the Youhe building. Visible buildings listed on the National Register of Historic Places include; the Polk County Courthouse, the Des Moines Saddlrey Co., the Warfield-Pratt-Howell Co. Warehouse and the Fleming Building. The river is the Des Moines River and the bridges are Vine and First Streets. ",,"Special Collections, Cowles Library -- Drake University.","Chicago, Il. : Gravure Illustration Co.",1914|2005/05/24,,"U.S. and International copyright laws protect this digital image. Commercial use or distribution of the image is not permitted without prior permission of the copyright holder. For permission to use the digital image, please contact: bart.schmidt@drake.edu","Art Work of Des Moines -- Book Eight","Photographic print, 4.5 x 7 in.",,Image,"v. 8, p. 9|dm0148|http://ddr.lib.drake.edu/u?/du-hdm,139","218 6th Ave.",,,,,,,,,,,,,,,,,,,,,,,,,,,,,,,,,,,,,,,,,,,,,,,"<a href=""http://ddr.lib.drake.edu/u?/du-hdm,139"" target=""_blank"">View this item in its source respository</a>",,,,,,,,,,,,,,,,,,,,,,,,,,,,,https://www.iowaheritage.org/files/original/7e67ec2d1174cf128ed1468e4ad969fd.jpg,"Remote Item","Des Moines University Historic Photograph Collection",1,0
2794,https://www.iowaheritage.org/items/show/2794,"Forest Drive, Lafayette Young Residence|Residence of Lafayette Young",Houses|Trees|Porches|Driveways|Awnings,"This house on Forest Dr. was built in 1900 and is still standing. The sign next to the driveway reads ""PRIVATE GROUNDS [ST]AY OUT.""It was the home of Lafayette Young and his wife Josephine. Mr. Young was the editor and proprietor of The Des Moines Capital. He served 12 years in the Iowa Senate and was appointed to the U.S. Senate where he served four months. He was also a member of the Taft party that visited the Philippines in 1905.",,"Special Collections, Cowles Library -- Drake University.","Chicago, Il. : Gravure Illustration Co.",1914|2005/05/23,,"U.S. and International copyright laws protect this digital image. Commercial use or distribution of the image is not permitted without prior permission of the copyright holder. For permission to use the digital image, please contact: bart.schmidt@drake.edu","Art Work of Des Moines -- Book Six","Photographic print, 4.5 x 7 in.",,Image,"v. 6, p. 4|dm0102|http://ddr.lib.drake.edu/u?/du-hdm,145","2846 Forest Dr.",,,,,,,,,,,,,,,,,,,,,,,,,,,,,,,,,,,,,,,,,,,,,,,"<a href=""http://ddr.lib.drake.edu/u?/du-hdm,145"" target=""_blank"">View this item in its source respository</a>",,,,,,,,,,,,,,,,,,,,,,,,,,,,,https://www.iowaheritage.org/files/original/1676c7fbc055da0126ece6ad1c0dd829.jpg,"Remote Item","Des Moines University Historic Photograph Collection",1,0
2812,https://www.iowaheritage.org/items/show/2812,"Locust Street Looking West from 5th Street|Scene on Locust Street","Commercial streets|Street railroads|Automobiles|Buildings|Pedestrians|Awnings|Marquees","This view of Locust Street was taken from just beyond the 5th Avenue intersection. On the right is the Marquardt Block, home of the Commercial Savings Bank and Franklin Hotel. Across the street is the Crocker Building, home to a variety of offices and storefronts. Behind the Marquardt Block is The Family Theatre, The Alexandria and The Casino Theatre. The tall building on the right-hand side is the Equitable Building and past that is the Palace Theatre. ",,"Special Collections, Cowles Library -- Drake University.","Chicago, Il. : Gravure Illustration Co.",1914|2005/05/24,,"U.S. and International copyright laws protect this digital image. Commercial use or distribution of the image is not permitted without prior permission of the copyright holder. For permission to use the digital image, please contact: bart.schmidt@drake.edu","Art Work of Des Moines -- Book Eight","Photographic print",,Image,"v. 8, p. 3|dm0138|http://ddr.lib.drake.edu/u?/du-hdm,156",,,,,,,,,,,,,,,,,,,,,,,,,,,,,,,,,,,,,,,,,,,,,,,,"<a href=""http://ddr.lib.drake.edu/u?/du-hdm,156"" target=""_blank"">View this item in its source respository</a>",,,,,,,,,,,,,,,,,,,,,,,,,,,,,https://www.iowaheritage.org/files/original/ea301102ca3eab03cb5b74cb42286f83.jpg,"Remote Item","Des Moines University Historic Photograph Collection",1,0
2813,https://www.iowaheritage.org/items/show/2813,"Locust Street Looking West from 5th Street|Scene on Locust Street","Commercial streets|Street railroads|Automobiles|Buildings|Pedestrians|Awnings|Marquees","This view of Locust Street was taken from just beyond the 5th Avenue intersection. On the right is the Marquardt Block, home of the Commercial Savings Bank and Franklin Hotel. Across the street is the Crocker Building, home to a variety of offices and storefronts. Behind the Marquardt Block is The Family Theatre, The Alexandria and The Casino Theatre. The tall building on the right-hand side is the Equitable Building and past that is the Palace Theatre. ",,"Special Collections, Cowles Library -- Drake University.","Chicago, Il. : Gravure Illustration Co.",1914|2005/05/24,,"U.S. and International copyright laws protect this digital image. Commercial use or distribution of the image is not permitted without prior permission of the copyright holder. For permission to use the digital image, please contact: bart.schmidt@drake.edu","Art Work of Des Moines -- Book Eight","Photographic print",,Image,"v. 8, p. 3|dm0138|http://ddr.lib.drake.edu/u?/du-hdm,156",,,,,,,,,,,,,,,,,,,,,,,,,,,,,,,,,,,,,,,,,,,,,,,,"<a href=""http://ddr.lib.drake.edu/u?/du-hdm,156"" target=""_blank"">View this item in its source respository</a>",,,,,,,,,,,,,,,,,,,,,,,,,,,,,https://www.iowaheritage.org/files/original/757380ce5a79cd989d782051a2806da8.jpg,"Remote Item","Des Moines University Historic Photograph Collection",1,0
2828,https://www.iowaheritage.org/items/show/2828,"E. 9th Street, E. R. Engelbeck Residence|Residence of E. R. Engelbeck",Houses|Trees|Awnings|Garages|Dormers,"This house on E. 9th Street was built in 1913 and is still standing. It was the home of E. R. Engelbeck and his wife Lucy. Mr. Engelbeck was the manager of J H Queal & Co.",,"Special Collections, Cowles Library -- Drake University.","Chicago, Il. : Gravure Illustration Co.",1914|2005/05/24,,"U.S. and International copyright laws protect this digital image. Commercial use or distribution of the image is not permitted without prior permission of the copyright holder. For permission to use the digital image, please contact: bart.schmidt@drake.edu","Art Work of Des Moines -- Book Seven","Photographic print",,Image,"v. 7, p. 9|dm0129|http://ddr.lib.drake.edu/u?/du-hdm,165","1901 E. 9th St.",,,,,,,,,,,,,,,,,,,,,,,,,,,,,,,,,,,,,,,,,,,,,,,"<a href=""http://ddr.lib.drake.edu/u?/du-hdm,165"" target=""_blank"">View this item in its source respository</a>",,,,,,,,,,,,,,,,,,,,,,,,,,,,,https://www.iowaheritage.org/files/original/72755b1344f13e57c95c3a34f2c2a922.jpg,"Remote Item","Des Moines University Historic Photograph Collection",1,0
