 




﻿"Item Id","Item URI","Dublin Core:Title","Dublin Core:Subject","Dublin Core:Description","Dublin Core:Creator","Dublin Core:Source","Dublin Core:Publisher","Dublin Core:Date","Dublin Core:Contributor","Dublin Core:Rights","Dublin Core:Relation","Dublin Core:Format","Dublin Core:Language","Dublin Core:Type","Dublin Core:Identifier","Dublin Core:Coverage","Item Type Metadata:Text","Item Type Metadata:Interviewer","Item Type Metadata:Interviewee","Item Type Metadata:Location","Item Type Metadata:Transcription","Item Type Metadata:Local URL","Item Type Metadata:Original Format","Item Type Metadata:Physical Dimensions","Item Type Metadata:Duration","Item Type Metadata:Compression","Item Type Metadata:Producer","Item Type Metadata:Director","Item Type Metadata:Bit Rate/Frequency","Item Type Metadata:Time Summary","Item Type Metadata:Email Body","Item Type Metadata:Subject Line","Item Type Metadata:From","Item Type Metadata:To","Item Type Metadata:CC","Item Type Metadata:BCC","Item Type Metadata:Number of Attachments","Item Type Metadata:Standards","Item Type Metadata:Objectives","Item Type Metadata:Materials","Item Type Metadata:Lesson Plan Text","Item Type Metadata:URL","Item Type Metadata:Event Type","Item Type Metadata:Participants","Item Type Metadata:Birth Date","Item Type Metadata:Birthplace","Item Type Metadata:Death Date","Item Type Metadata:Occupation","Item Type Metadata:Biographical Text","Item Type Metadata:Bibliography","Item Type Metadata:Digital Reproduction Information","Item Type Metadata:Repository","Item Type Metadata:Repository Collection","Item Type Metadata:Contact information.","Item Type Metadata:File Name","Item Type Metadata:Notes","Item Type Metadata:Digital item created","Item Type Metadata:Digital item modified","Item Type Metadata:Executive Orders","Item Type Metadata:Record Created","Item Type Metadata:Record Modified","Item Type Metadata:Transcription2","Item Type Metadata:Source URL","Omeka Legacy File:Additional Creator","Omeka Legacy File:Transcriber","Omeka Legacy File:Producer","Omeka Legacy File:Render Device","Omeka Legacy File:Render Details","Omeka Legacy File:Capture Date","Omeka Legacy File:Capture Device","Omeka Legacy File:Capture Details","Omeka Legacy File:Change History","Omeka Legacy File:Watermark","Omeka Legacy File:Encryption","Omeka Legacy File:Compression","Omeka Legacy File:Post Processing","Omeka Image File:Width","Omeka Image File:Height","Omeka Image File:Bit Depth","Omeka Image File:Channels","Omeka Image File:Exif String","Omeka Image File:Exif Array","Omeka Image File:IPTC String","Omeka Image File:IPTC Array","Omeka Video File:Bitrate","Omeka Video File:Duration","Omeka Video File:Sample Rate","Omeka Video File:Codec","Omeka Video File:Width","Omeka Video File:Height",tags,file,itemType,collection,public,featured
9602,https://www.iowaheritage.org/items/show/9602,"Doesn't seem to be much hope.","Government|Taft, Robert Alphonso, 1889-1953|Elections 1948|Bees|politics|elections|candidates|Republican Party|Democratic Party|Dewey, Thomas Edmund, 1902-1971|Eisenhower, Dwight D. (Dwight David), 1890-1969|ambulances|elephants|Miss Democracy.",,"Darling, Jay N. (Jay Norwood), 1876-1962","The Editorial cartoons of J.N. ""Ding"" Darling [electronic resource] : The Cowles Collection, Drake University, 1912-1962",,1948/01/30|1948,,"Copyright is owned by the ""Ding"" Darling Wildlife Society; it is administered on behalf of the Society by The University of Iowa. While use within the classroom is encouraged without specific authorization, publishing this cartoon in any format requires written permission. See policy and permissions procedure at: http://www.lib.uiowa.edu/spec-coll/services/dingdarling_fees.html","Cowles Library, Drake University, 2507 University Ave., Des Moines, IA 50311-4505.",,,,"480130.jpg|http://ddr.lib.drake.edu/u?/ddarling,6532",,,,,,,,,,,,,,,,,,,,,,,,,,,,,,,,,,,,,,,,,,,,,,,,"<a href=""http://ddr.lib.drake.edu/u?/ddarling,6532"" target=""_blank"">View this item in its source respository</a>",,,,,,,,,,,,,,,,,,,,,,,,,,,,,https://www.iowaheritage.org/files/original/a1f90f0a1b2a87495ad55198e6e35804.jpg,"Remote Item","Editorial Cartoons of J.N. ""Ding"" Darling, Drake University",1,0
64644,https://www.iowaheritage.org/items/show/64644,"Soviet Union 1922-1991","Presidents -- Soviet Union|Yeltsin, Boris Nikolayevich, 1931-2007|Soviet Union|Ambulances|1990-2000|Presidents -- Russia|Communism|Communism -- Soviet Union|Federations|Gorbachev, Mikhail Sergeevich, 1931-|Russia|Shovels|Presidents|Gravediggers|Gravedigging|Graves|Graveyards|Tombstones","Ambulance; Gorby; Yeltsin","Duffy, Brian, 1955-",,"University of Iowa. Libraries. Special Collections Dept.",1991-12-11|2011-04,,"Educational use only, no other permissions given. Copyright to this digital object is owned by The Des Moines Register; it may not be downloaded, reproduced, or distributed without written permission. For more information, contact the Special Collections Department.","Editorial Cartoons of Brian Duffy; Des Moines Register Cartoonists|Papers of Brian Duffy|Des Moines Register",,English,"Still image|Editorial cartoons",MSC916|duffy-911211|http://digital.lib.uiowa.edu/cdm/ref/collection/duffy/id/482,,,,,,,,,,,,,,,,,,,,,,,,,,,,,,,,,,,,,,,,,,,,,,,,"<a href=""http://digital.lib.uiowa.edu/cdm/ref/collection/duffy/id/482"" target=""_blank"">View this item in its source respository</a>",,,,,,,,,,,,,,,,,,,,,,,,,,,,,https://www.iowaheritage.org/files/original/a74e8f020b586294b319e05e4128de34.jpg,"Remote Item","Editorial Cartoons of Brian Duffy",1,0
18252,https://www.iowaheritage.org/items/show/18252,"Ambulance, The University of Iowa, July 20, 1932","Ambulances|University of Iowa. Hospitals and Clinics|United States -- Iowa -- Iowa City|1930-1940|Universities & colleges",,"Kent, Frederick W. (Frederick Wallace), 1894-1984",,"University of Iowa. Libraries. University Archives",1932-07-20|2006-06-07,,"Educational use only, no other permissions given. U.S. and international copyright laws may protect this digital object. Commercial use or distribution of the object is not permitted without prior permission of the copyright holder.","Iowa City Town and Campus Scenes|Frederick W. Kent Collection of Photographs, 1866-2000|http://www.lib.uiowa.edu/collguides/?RG30.0001.01|Prints|Scenes -- Iowa City|Ambulances|Ambulances|Scanned with Ricoh Aficio 3228C @ 300 ppi, full color. Master images saved in tiff format.|http://www.flickr.com/photos/uiowa/2090212004",13|18,,"Still image|Photographs|jpeg",RG30.0001.01|0001|ambulance001.jpg|168413524|2090212004|https://digital.lib.uiowa.edu/,,,,,,,,,,,,,,,,,,,,,,,,,,,,,,,,,,,,,,,,,,,,,,,,"<a href=""https://digital.lib.uiowa.edu/"" target=""_blank"">View this item in its source respository</a>",,,,,,,,,,,,,,,,,,,,,,,,,,,,,https://www.iowaheritage.org/files/original/61b256d5068114bfce031a03effb2d2b.jpg,"Remote Item","Iowa City Town and Campus Scenes",1,0
18254,https://www.iowaheritage.org/items/show/18254,"Ambulance seats, The University of Iowa, July 20, 1932","Ambulances|University of Iowa. Hospitals and Clinics|United States -- Iowa -- Iowa City|1930-1940|Universities & colleges",,"Kent, Frederick W. (Frederick Wallace), 1894-1984",,"University of Iowa. Libraries. University Archives",1932-07-20|2006-06-07,,"Educational use only, no other permissions given. U.S. and international copyright laws may protect this digital object. Commercial use or distribution of the object is not permitted without prior permission of the copyright holder.","Iowa City Town and Campus Scenes|Frederick W. Kent Collection of Photographs, 1866-2000|http://www.lib.uiowa.edu/collguides/?RG30.0001.01|Prints|Scenes -- Iowa City|Ambulances|Ambulances|Scanned with Ricoh Aficio 3228C @ 300 ppi, full color. Master images saved in tiff format.|http://www.flickr.com/photos/uiowa/2090212016",13|18,,"Still image|Photographs|jpeg",RG30.0001.01|0002|ambulance002.jpg|168413524|2090212016|https://digital.lib.uiowa.edu/,,,,,,,,,,,,,,,,,,,,,,,,,,,,,,,,,,,,,,,,,,,,,,,,"<a href=""https://digital.lib.uiowa.edu/"" target=""_blank"">View this item in its source respository</a>",,,,,,,,,,,,,,,,,,,,,,,,,,,,,https://www.iowaheritage.org/files/original/02ec0969c88e17be05e2140f5f0c3854.jpg,"Remote Item","Iowa City Town and Campus Scenes",1,0
18256,https://www.iowaheritage.org/items/show/18256,"Ambulance fleet next to hospital building, The University of Iowa, December 15, 1935","Ambulances|University of Iowa. Hospitals and Clinics|United States -- Iowa -- Iowa City|1930-1940|Men|Hospitals|Universities & colleges",,"Kent, Frederick W. (Frederick Wallace), 1894-1984",,"University of Iowa. Libraries. University Archives",1935-12-15|2006-06-07,,"Educational use only, no other permissions given. U.S. and international copyright laws may protect this digital object. Commercial use or distribution of the object is not permitted without prior permission of the copyright holder.","Iowa City Town and Campus Scenes|Frederick W. Kent Collection of Photographs, 1866-2000|http://www.lib.uiowa.edu/collguides/?RG30.0001.01|Prints|Scenes -- Iowa City|Ambulances|Ambulances|Scanned with Ricoh Aficio 3228C @ 300 ppi, full color. Master images saved in tiff format.|http://www.flickr.com/photos/uiowa/2090212030",13|18,,"Still image|Photographs|jpeg",RG30.0001.01|0003|ambulance003.jpg|168413524|2090212030|https://digital.lib.uiowa.edu/,,,,,,,,,,,,,,,,,,,,,,,,,,,,,,,,,,,,,,,,,,,,,,,,"<a href=""https://digital.lib.uiowa.edu/"" target=""_blank"">View this item in its source respository</a>",,,,,,,,,,,,,,,,,,,,,,,,,,,,,https://www.iowaheritage.org/files/original/8c177bea12deec3957312ba9d1505ae0.jpg,"Remote Item","Iowa City Town and Campus Scenes",1,0
18258,https://www.iowaheritage.org/items/show/18258,"Ambulance fleet, The University of Iowa, October 21, 1945","Ambulances|University of Iowa. Hospitals and Clinics|United States -- Iowa -- Iowa City|1940-1950|Universities & colleges",,"Kent, Frederick W. (Frederick Wallace), 1894-1984",,"University of Iowa. Libraries. University Archives",1945-10-21|2006-06-07,,"Educational use only, no other permissions given. U.S. and international copyright laws may protect this digital object. Commercial use or distribution of the object is not permitted without prior permission of the copyright holder.","Iowa City Town and Campus Scenes|Frederick W. Kent Collection of Photographs, 1866-2000|http://www.lib.uiowa.edu/collguides/?RG30.0001.01|Prints|Scenes -- Iowa City|Ambulances|Ambulances|Scanned with Ricoh Aficio 3228C @ 300 ppi, full color. Master images saved in tiff format.|http://www.flickr.com/photos/uiowa/2089425539",13|18,,"Still image|Photographs|jpeg",RG30.0001.01|0004|ambulance004.jpg|168413524|2089425539|https://digital.lib.uiowa.edu/,,,,,,,,,,,,,,,,,,,,,,,,,,,,,,,,,,,,,,,,,,,,,,,,"<a href=""https://digital.lib.uiowa.edu/"" target=""_blank"">View this item in its source respository</a>",,,,,,,,,,,,,,,,,,,,,,,,,,,,,https://www.iowaheritage.org/files/original/ff472fc4f4679540a33e6d71773ad934.jpg,"Remote Item","Iowa City Town and Campus Scenes",1,0
18260,https://www.iowaheritage.org/items/show/18260,"Ambulance fleet and drivers, The University of Iowa, October 21, 1945","Ambulances|University of Iowa. Hospitals and Clinics|United States -- Iowa -- Iowa City|1940-1950|Men|Universities & colleges",,"Kent, Frederick W. (Frederick Wallace), 1894-1984",,"University of Iowa. Libraries. University Archives",1945-10-21|2006-06-07,,"Educational use only, no other permissions given. U.S. and international copyright laws may protect this digital object. Commercial use or distribution of the object is not permitted without prior permission of the copyright holder.","Iowa City Town and Campus Scenes|Frederick W. Kent Collection of Photographs, 1866-2000|http://www.lib.uiowa.edu/collguides/?RG30.0001.01|Prints|Scenes -- Iowa City|Ambulances|Ambulances|Scanned with Ricoh Aficio 3228C @ 300 ppi, full color. Master images saved in tiff format.",13|18,,"Still image|Photographs|jpeg",RG30.0001.01|0005|ambulance005.jpg|168413524|https://digital.lib.uiowa.edu/,,,,,,,,,,,,,,,,,,,,,,,,,,,,,,,,,,,,,,,,,,,,,,,,"<a href=""https://digital.lib.uiowa.edu/"" target=""_blank"">View this item in its source respository</a>",,,,,,,,,,,,,,,,,,,,,,,,,,,,,https://www.iowaheritage.org/files/original/80a74e66770aee1ba901084e9fdb07c8.jpg,"Remote Item","Iowa City Town and Campus Scenes",1,0
18262,https://www.iowaheritage.org/items/show/18262,"Hospital staff posed with new ambulance, The University of Iowa, 1948","Ambulances|University of Iowa. Hospitals and Clinics|United States -- Iowa -- Iowa City|1940-1950|Physicians|Nurses|Universities & colleges",,"Kent, Frederick W. (Frederick Wallace), 1894-1984",,"University of Iowa. Libraries. University Archives",1948|2006-06-07,,"Educational use only, no other permissions given. U.S. and international copyright laws may protect this digital object. Commercial use or distribution of the object is not permitted without prior permission of the copyright holder.","Iowa City Town and Campus Scenes|Frederick W. Kent Collection of Photographs, 1866-2000|http://www.lib.uiowa.edu/collguides/?RG30.0001.01|Prints|Scenes -- Iowa City|Ambulances|Ambulances|Scanned with Ricoh Aficio 3228C @ 300 ppi, full color. Master images saved in tiff format.",13|18,,"Still image|Photographs|jpeg",RG30.0001.01|0006|ambulance006.jpg|168413524|https://digital.lib.uiowa.edu/,,,,,,,,,,,,,,,,,,,,,,,,,,,,,,,,,,,,,,,,,,,,,,,,"<a href=""https://digital.lib.uiowa.edu/"" target=""_blank"">View this item in its source respository</a>",,,,,,,,,,,,,,,,,,,,,,,,,,,,,https://www.iowaheritage.org/files/original/85ea9030a4452cdba157d924a761c77d.jpg,"Remote Item","Iowa City Town and Campus Scenes",1,0
18264,https://www.iowaheritage.org/items/show/18264,"Nurses with ambulance, The University of Iowa, 1948","Ambulances|University of Iowa. Hospitals and Clinics|United States -- Iowa -- Iowa City|1940-1950|Nurses|Universities & colleges",,"Kent, Frederick W. (Frederick Wallace), 1894-1984",,"University of Iowa. Libraries. University Archives",1948|2006-06-07,,"Educational use only, no other permissions given. U.S. and international copyright laws may protect this digital object. Commercial use or distribution of the object is not permitted without prior permission of the copyright holder.","Iowa City Town and Campus Scenes|Frederick W. Kent Collection of Photographs, 1866-2000|http://www.lib.uiowa.edu/collguides/?RG30.0001.01|Prints|Scenes -- Iowa City|Ambulances|Ambulances|Scanned with Ricoh Aficio 3228C @ 300 ppi, full color. Master images saved in tiff format.",13|18,,"Still image|Photographs|jpeg",RG30.0001.01|0007|ambulance007.jpg|168413524|https://digital.lib.uiowa.edu/,,,,,,,,,,,,,,,,,,,,,,,,,,,,,,,,,,,,,,,,,,,,,,,,"<a href=""https://digital.lib.uiowa.edu/"" target=""_blank"">View this item in its source respository</a>",,,,,,,,,,,,,,,,,,,,,,,,,,,,,https://www.iowaheritage.org/files/original/7ff1811031f9349953d5e2498b3ca64a.jpg,"Remote Item","Iowa City Town and Campus Scenes",1,0
18266,https://www.iowaheritage.org/items/show/18266,"Ambulance trunk, The Unversity of Iowa, 1948","Ambulances|University of Iowa. Hospitals and Clinics|United States -- Iowa -- Iowa City|1940-1950|Universities & colleges",,"Kent, Frederick W. (Frederick Wallace), 1894-1984",,"University of Iowa. Libraries. University Archives",1948|2006-06-07,,"Educational use only, no other permissions given. U.S. and international copyright laws may protect this digital object. Commercial use or distribution of the object is not permitted without prior permission of the copyright holder.","Iowa City Town and Campus Scenes|Frederick W. Kent Collection of Photographs, 1866-2000|http://www.lib.uiowa.edu/collguides/?RG30.0001.01|Prints|Scenes -- Iowa City|Ambulances|Ambulances|Scanned with Ricoh Aficio 3228C @ 300 ppi, full color. Master images saved in tiff format.",13|18,,"Still image|Photographs|jpeg",RG30.0001.01|0008|ambulance008.jpg|168413524|https://digital.lib.uiowa.edu/,,,,,,,,,,,,,,,,,,,,,,,,,,,,,,,,,,,,,,,,,,,,,,,,"<a href=""https://digital.lib.uiowa.edu/"" target=""_blank"">View this item in its source respository</a>",,,,,,,,,,,,,,,,,,,,,,,,,,,,,https://www.iowaheritage.org/files/original/73eafa3c02044762b6df41850b3348b3.jpg,"Remote Item","Iowa City Town and Campus Scenes",1,0
