 




﻿"Item Id","Item URI","Dublin Core:Title","Dublin Core:Subject","Dublin Core:Description","Dublin Core:Creator","Dublin Core:Source","Dublin Core:Publisher","Dublin Core:Date","Dublin Core:Contributor","Dublin Core:Rights","Dublin Core:Relation","Dublin Core:Format","Dublin Core:Language","Dublin Core:Type","Dublin Core:Identifier","Dublin Core:Coverage","Item Type Metadata:Text","Item Type Metadata:Interviewer","Item Type Metadata:Interviewee","Item Type Metadata:Location","Item Type Metadata:Transcription","Item Type Metadata:Local URL","Item Type Metadata:Original Format","Item Type Metadata:Physical Dimensions","Item Type Metadata:Duration","Item Type Metadata:Compression","Item Type Metadata:Producer","Item Type Metadata:Director","Item Type Metadata:Bit Rate/Frequency","Item Type Metadata:Time Summary","Item Type Metadata:Email Body","Item Type Metadata:Subject Line","Item Type Metadata:From","Item Type Metadata:To","Item Type Metadata:CC","Item Type Metadata:BCC","Item Type Metadata:Number of Attachments","Item Type Metadata:Standards","Item Type Metadata:Objectives","Item Type Metadata:Materials","Item Type Metadata:Lesson Plan Text","Item Type Metadata:URL","Item Type Metadata:Event Type","Item Type Metadata:Participants","Item Type Metadata:Birth Date","Item Type Metadata:Birthplace","Item Type Metadata:Death Date","Item Type Metadata:Occupation","Item Type Metadata:Biographical Text","Item Type Metadata:Bibliography","Item Type Metadata:Digital Reproduction Information","Item Type Metadata:Repository","Item Type Metadata:Repository Collection","Item Type Metadata:Contact information.","Item Type Metadata:File Name","Item Type Metadata:Notes","Item Type Metadata:Digital item created","Item Type Metadata:Digital item modified","Item Type Metadata:Executive Orders","Item Type Metadata:Record Created","Item Type Metadata:Record Modified","Item Type Metadata:Transcription2","Item Type Metadata:Source URL","Omeka Legacy File:Additional Creator","Omeka Legacy File:Transcriber","Omeka Legacy File:Producer","Omeka Legacy File:Render Device","Omeka Legacy File:Render Details","Omeka Legacy File:Capture Date","Omeka Legacy File:Capture Device","Omeka Legacy File:Capture Details","Omeka Legacy File:Change History","Omeka Legacy File:Watermark","Omeka Legacy File:Encryption","Omeka Legacy File:Compression","Omeka Legacy File:Post Processing","Omeka Image File:Width","Omeka Image File:Height","Omeka Image File:Bit Depth","Omeka Image File:Channels","Omeka Image File:Exif String","Omeka Image File:Exif Array","Omeka Image File:IPTC String","Omeka Image File:IPTC Array","Omeka Video File:Bitrate","Omeka Video File:Duration","Omeka Video File:Sample Rate","Omeka Video File:Codec","Omeka Video File:Width","Omeka Video File:Height",tags,file,itemType,collection,public,featured
68895,https://www.iowaheritage.org/items/show/68895,"Library study tables and desks in the 1st Addition, 1966","Iowa State University|University Library|Desks|1st Addition","Library study tables and desks sit on orange carpet next to blue columns in the 1st Addition.|The library was first housed in Old Main, which also contained the college's reception room, lecture hall, specimen museum, students' rooms, a chapel, kitchen, laundry, and dining room. An initial purchase of $2,500 for books for the library was made in 1870 by President Welch. The library was moved to Morrill Hall in 1896 and to the Central Building (now Beardshear Hall) in 1913. In 1925, the new library building was completed to house the library's 115,000 volumes under one roof. The new facility was not large enough to allow for adequate expansion and was outgrown within five years. The first addition to the library was completed in 1961, with a second addition completed in 1969 and a third addition was completed in 1983. In 1984, the Iowa State University Library was officially dedicated as the W. Robert and Ellen Sorge Parks Library.","Iowa State University",RS-4-8-H.Library.147-05-03,"Iowa State University Library Special Collections: http://www.add.lib.iastate.edu/spcl/index.html",1966|2012-08,,"U.S. and international copyright laws protect this digital image. Commercial use or distribution of the image is not permitted without prior permission of the copyright holder. For permission to use the digital image, please contact Iowa State University Library, Special Collections archives@iastate.edu  For reproductions see:  http://www.add.lib.iastate.edu/spcl/services/photfees.html","University Photographs; http://www.add.lib.iastate.edu/spcl/collections/images.html",Photograph,,Image|Image,RS-4-8-H.Library.147-05-03|https://digitalcollections.lib.iastate.edu/,,,,,,,,,,,,,,,,,,,,,,,,,,,,,,,,,,,,,,,,,,,,,,,,"<a href=""https://digitalcollections.lib.iastate.edu/"" target=""_blank"">View this item in its source respository</a>",,,,,,,,,,,,,,,,,,,,,,,,,,,,,https://www.iowaheritage.org/files/original/4dc2844f95ca03de0afbb45f03030cba.jpg,"Remote Item","Iowa State University Library Photograph Collection",1,0
73389,https://www.iowaheritage.org/items/show/73389,"Library study tables and desks in the 1st Addition, 1966","Iowa State University|University Library|Desks|1st Addition","Library study tables and desks sit on orange carpet next to blue columns in the 1st Addition.|The library was first housed in Old Main, which also contained the college's reception room, lecture hall, specimen museum, students' rooms, a chapel, kitchen, laundry, and dining room. An initial purchase of $2,500 for books for the library was made in 1870 by President Welch. The library was moved to Morrill Hall in 1896 and to the Central Building (now Beardshear Hall) in 1913. In 1925, the new library building was completed to house the library's 115,000 volumes under one roof. The new facility was not large enough to allow for adequate expansion and was outgrown within five years. The first addition to the library was completed in 1961, with a second addition completed in 1969 and a third addition was completed in 1983. In 1984, the Iowa State University Library was officially dedicated as the W. Robert and Ellen Sorge Parks Library.","Iowa State University",RS-4-8-H.Library.147-05-03,"Iowa State University Library Special Collections: http://www.add.lib.iastate.edu/spcl/index.html",1966|2012-08,,"U.S. and international copyright laws protect this digital image. Commercial use or distribution of the image is not permitted without prior permission of the copyright holder. For permission to use the digital image, please contact Iowa State University Library, Special Collections archives@iastate.edu  For reproductions see:  http://www.add.lib.iastate.edu/spcl/services/photfees.html","University Photographs; http://www.add.lib.iastate.edu/spcl/collections/images.html",Photograph,,Image|Image,RS-4-8-H.Library.147-05-03|https://digitalcollections.lib.iastate.edu/,,,,,,,,,,,,,,,,,,,,,,,,,,,,,,,,,,,,,,,,,,,,,,,,"<a href=""https://digitalcollections.lib.iastate.edu/"" target=""_blank"">View this item in its source respository</a>",,,,,,,,,,,,,,,,,,,,,,,,,,,,,https://www.iowaheritage.org/files/original/6e8d9a2c993a6dd73966f42d7fc1c8f2.jpg,"Remote Item",,1,0
68880,https://www.iowaheritage.org/items/show/68880,"Student chatting with reference librarian William Birdsall","Iowa State University|University Library|Reference librarians|1st Addition","A female student stands and chats with reference librarian William Birdsall, seated at a metal desk next to a room divider with multi-colored circles, circa 1961.  There were reference areas like this on each of the first three floors after open stacks were adopted with the opening of the 1st Addition.|The library was first housed in Old Main, which also contained the college's reception room, lecture hall, specimen museum, students' rooms, a chapel, kitchen, laundry, and dining room. An initial purchase of $2,500 for books for the library was made in 1870 by President Welch. The library was moved to Morrill Hall in 1896 and to the Central Building (now Beardshear Hall) in 1913. In 1925, the new library building was completed to house the library's 115,000 volumes under one roof. The new facility was not large enough to allow for adequate expansion and was outgrown within five years. The first addition to the library was completed in 1961, with a second addition completed in 1969 and a third addition was completed in 1983. In 1984, the Iowa State University Library was officially dedicated as the W. Robert and Ellen Sorge Parks Library.","Iowa State University",RS-4-8-H.Library.147-01-05,"Iowa State University Library Special Collections: http://www.add.lib.iastate.edu/spcl/index.html",1961?|2012-08,,"U.S. and international copyright laws protect this digital image. Commercial use or distribution of the image is not permitted without prior permission of the copyright holder. For permission to use the digital image, please contact Iowa State University Library, Special Collections archives@iastate.edu  For reproductions see:  http://www.add.lib.iastate.edu/spcl/services/photfees.html","University Photographs; http://www.add.lib.iastate.edu/spcl/collections/images.html",Photograph,,Image|Image,RS-4-8-H.Library.147-01-05|https://digitalcollections.lib.iastate.edu/,,,,,,,,,,,,,,,,,,,,,,,,,,,,,,,,,,,,,,,,,,,,,,,,"<a href=""https://digitalcollections.lib.iastate.edu/"" target=""_blank"">View this item in its source respository</a>",,,,,,,,,,,,,,,,,,,,,,,,,,,,,https://www.iowaheritage.org/files/original/34f8e01ffca7d18498577672cc8dc4fa.jpg,"Remote Item","Iowa State University Library Photograph Collection",1,0
73374,https://www.iowaheritage.org/items/show/73374,"Student chatting with reference librarian William Birdsall","Iowa State University|University Library|Reference librarians|1st Addition","A female student stands and chats with reference librarian William Birdsall, seated at a metal desk next to a room divider with multi-colored circles, circa 1961.  There were reference areas like this on each of the first three floors after open stacks were adopted with the opening of the 1st Addition.|The library was first housed in Old Main, which also contained the college's reception room, lecture hall, specimen museum, students' rooms, a chapel, kitchen, laundry, and dining room. An initial purchase of $2,500 for books for the library was made in 1870 by President Welch. The library was moved to Morrill Hall in 1896 and to the Central Building (now Beardshear Hall) in 1913. In 1925, the new library building was completed to house the library's 115,000 volumes under one roof. The new facility was not large enough to allow for adequate expansion and was outgrown within five years. The first addition to the library was completed in 1961, with a second addition completed in 1969 and a third addition was completed in 1983. In 1984, the Iowa State University Library was officially dedicated as the W. Robert and Ellen Sorge Parks Library.","Iowa State University",RS-4-8-H.Library.147-01-05,"Iowa State University Library Special Collections: http://www.add.lib.iastate.edu/spcl/index.html",1961?|2012-08,,"U.S. and international copyright laws protect this digital image. Commercial use or distribution of the image is not permitted without prior permission of the copyright holder. For permission to use the digital image, please contact Iowa State University Library, Special Collections archives@iastate.edu  For reproductions see:  http://www.add.lib.iastate.edu/spcl/services/photfees.html","University Photographs; http://www.add.lib.iastate.edu/spcl/collections/images.html",Photograph,,Image|Image,RS-4-8-H.Library.147-01-05|https://digitalcollections.lib.iastate.edu/,,,,,,,,,,,,,,,,,,,,,,,,,,,,,,,,,,,,,,,,,,,,,,,,"<a href=""https://digitalcollections.lib.iastate.edu/"" target=""_blank"">View this item in its source respository</a>",,,,,,,,,,,,,,,,,,,,,,,,,,,,,https://www.iowaheritage.org/files/original/9e2df70fd1bac2d5812ae8cd904a526e.jpg,"Remote Item",,1,0
68878,https://www.iowaheritage.org/items/show/68878,"Student using the Typing Room in the newly opened 1st Addition, 1961","Iowa State University|University Library|Typewriting|1st Addition","A male student uses a typewriter in the Typing Room of the newly opened 1st Addition.|The library was first housed in Old Main, which also contained the college's reception room, lecture hall, specimen museum, students' rooms, a chapel, kitchen, laundry, and dining room. An initial purchase of $2,500 for books for the library was made in 1870 by President Welch. The library was moved to Morrill Hall in 1896 and to the Central Building (now Beardshear Hall) in 1913. In 1925, the new library building was completed to house the library's 115,000 volumes under one roof. The new facility was not large enough to allow for adequate expansion and was outgrown within five years. The first addition to the library was completed in 1961, with a second addition completed in 1969 and a third addition was completed in 1983. In 1984, the Iowa State University Library was officially dedicated as the W. Robert and Ellen Sorge Parks Library.","Iowa State University",RS-4-8-H.Library.147-01-03,"Iowa State University Library Special Collections: http://www.add.lib.iastate.edu/spcl/index.html",1961|2008-03,,"U.S. and international copyright laws protect this digital image. Commercial use or distribution of the image is not permitted without prior permission of the copyright holder. For permission to use the digital image, please contact Iowa State University Library, Special Collections archives@iastate.edu  For reproductions see:  http://www.add.lib.iastate.edu/spcl/services/photfees.html","University Photographs; http://www.add.lib.iastate.edu/spcl/collections/images.html",Photograph,,Image|Image,RS-4-8-H.Library.147-01-03|https://digitalcollections.lib.iastate.edu/,,,,,,,,,,,,,,,,,,,,,,,,,,,,,,,,,,,,,,,,,,,,,,,,"<a href=""https://digitalcollections.lib.iastate.edu/"" target=""_blank"">View this item in its source respository</a>",,,,,,,,,,,,,,,,,,,,,,,,,,,,,https://www.iowaheritage.org/files/original/ccf94d5ec0f86431cc45f976032cde35.jpg,"Remote Item","Iowa State University Library Photograph Collection",1,0
73372,https://www.iowaheritage.org/items/show/73372,"Student using the Typing Room in the newly opened 1st Addition, 1961","Iowa State University|University Library|Typewriting|1st Addition","A male student uses a typewriter in the Typing Room of the newly opened 1st Addition.|The library was first housed in Old Main, which also contained the college's reception room, lecture hall, specimen museum, students' rooms, a chapel, kitchen, laundry, and dining room. An initial purchase of $2,500 for books for the library was made in 1870 by President Welch. The library was moved to Morrill Hall in 1896 and to the Central Building (now Beardshear Hall) in 1913. In 1925, the new library building was completed to house the library's 115,000 volumes under one roof. The new facility was not large enough to allow for adequate expansion and was outgrown within five years. The first addition to the library was completed in 1961, with a second addition completed in 1969 and a third addition was completed in 1983. In 1984, the Iowa State University Library was officially dedicated as the W. Robert and Ellen Sorge Parks Library.","Iowa State University",RS-4-8-H.Library.147-01-03,"Iowa State University Library Special Collections: http://www.add.lib.iastate.edu/spcl/index.html",1961|2008-03,,"U.S. and international copyright laws protect this digital image. Commercial use or distribution of the image is not permitted without prior permission of the copyright holder. For permission to use the digital image, please contact Iowa State University Library, Special Collections archives@iastate.edu  For reproductions see:  http://www.add.lib.iastate.edu/spcl/services/photfees.html","University Photographs; http://www.add.lib.iastate.edu/spcl/collections/images.html",Photograph,,Image|Image,RS-4-8-H.Library.147-01-03|https://digitalcollections.lib.iastate.edu/,,,,,,,,,,,,,,,,,,,,,,,,,,,,,,,,,,,,,,,,,,,,,,,,"<a href=""https://digitalcollections.lib.iastate.edu/"" target=""_blank"">View this item in its source respository</a>",,,,,,,,,,,,,,,,,,,,,,,,,,,,,https://www.iowaheritage.org/files/original/a118ba8230cc156568ed1e0eebb567fd.jpg,"Remote Item",,1,0
68882,https://www.iowaheritage.org/items/show/68882,"Students using study carrels in the newly opened library 1st Addition","Iowa State University|University Library|Desks|1st Addition","Students use three study carrels in the newly opened library 1st Addition.|The library was first housed in Old Main, which also contained the college's reception room, lecture hall, specimen museum, students' rooms, a chapel, kitchen, laundry, and dining room. An initial purchase of $2,500 for books for the library was made in 1870 by President Welch. The library was moved to Morrill Hall in 1896 and to the Central Building (now Beardshear Hall) in 1913. In 1925, the new library building was completed to house the library's 115,000 volumes under one roof. The new facility was not large enough to allow for adequate expansion and was outgrown within five years. The first addition to the library was completed in 1961, with a second addition completed in 1969 and a third addition was completed in 1983. In 1984, the Iowa State University Library was officially dedicated as the W. Robert and Ellen Sorge Parks Library.","Iowa State University",RS-4-8-H.Library.147-01-07,"Iowa State University Library Special Collections: http://www.add.lib.iastate.edu/spcl/index.html",1961?|2012-08,,"U.S. and international copyright laws protect this digital image. Commercial use or distribution of the image is not permitted without prior permission of the copyright holder. For permission to use the digital image, please contact Iowa State University Library, Special Collections archives@iastate.edu  For reproductions see:  http://www.add.lib.iastate.edu/spcl/services/photfees.html","University Photographs; http://www.add.lib.iastate.edu/spcl/collections/images.html",Photograph,,Image|Image,RS-4-8-H.Library.147-01-07|https://digitalcollections.lib.iastate.edu/,,,,,,,,,,,,,,,,,,,,,,,,,,,,,,,,,,,,,,,,,,,,,,,,"<a href=""https://digitalcollections.lib.iastate.edu/"" target=""_blank"">View this item in its source respository</a>",,,,,,,,,,,,,,,,,,,,,,,,,,,,,https://www.iowaheritage.org/files/original/19128878bd77e0e1ce5189c24e8b73c6.jpg,"Remote Item","Iowa State University Library Photograph Collection",1,0
73376,https://www.iowaheritage.org/items/show/73376,"Students using study carrels in the newly opened library 1st Addition","Iowa State University|University Library|Desks|1st Addition","Students use three study carrels in the newly opened library 1st Addition.|The library was first housed in Old Main, which also contained the college's reception room, lecture hall, specimen museum, students' rooms, a chapel, kitchen, laundry, and dining room. An initial purchase of $2,500 for books for the library was made in 1870 by President Welch. The library was moved to Morrill Hall in 1896 and to the Central Building (now Beardshear Hall) in 1913. In 1925, the new library building was completed to house the library's 115,000 volumes under one roof. The new facility was not large enough to allow for adequate expansion and was outgrown within five years. The first addition to the library was completed in 1961, with a second addition completed in 1969 and a third addition was completed in 1983. In 1984, the Iowa State University Library was officially dedicated as the W. Robert and Ellen Sorge Parks Library.","Iowa State University",RS-4-8-H.Library.147-01-07,"Iowa State University Library Special Collections: http://www.add.lib.iastate.edu/spcl/index.html",1961?|2012-08,,"U.S. and international copyright laws protect this digital image. Commercial use or distribution of the image is not permitted without prior permission of the copyright holder. For permission to use the digital image, please contact Iowa State University Library, Special Collections archives@iastate.edu  For reproductions see:  http://www.add.lib.iastate.edu/spcl/services/photfees.html","University Photographs; http://www.add.lib.iastate.edu/spcl/collections/images.html",Photograph,,Image|Image,RS-4-8-H.Library.147-01-07|https://digitalcollections.lib.iastate.edu/,,,,,,,,,,,,,,,,,,,,,,,,,,,,,,,,,,,,,,,,,,,,,,,,"<a href=""https://digitalcollections.lib.iastate.edu/"" target=""_blank"">View this item in its source respository</a>",,,,,,,,,,,,,,,,,,,,,,,,,,,,,https://www.iowaheritage.org/files/original/ff50f049ef2bc33916586dccb6f6072a.jpg,"Remote Item",,1,0
