 




﻿"Item Id","Item URI","Dublin Core:Title","Dublin Core:Subject","Dublin Core:Description","Dublin Core:Creator","Dublin Core:Source","Dublin Core:Publisher","Dublin Core:Date","Dublin Core:Contributor","Dublin Core:Rights","Dublin Core:Relation","Dublin Core:Format","Dublin Core:Language","Dublin Core:Type","Dublin Core:Identifier","Dublin Core:Coverage","Item Type Metadata:Text","Item Type Metadata:Interviewer","Item Type Metadata:Interviewee","Item Type Metadata:Location","Item Type Metadata:Transcription","Item Type Metadata:Local URL","Item Type Metadata:Original Format","Item Type Metadata:Physical Dimensions","Item Type Metadata:Duration","Item Type Metadata:Compression","Item Type Metadata:Producer","Item Type Metadata:Director","Item Type Metadata:Bit Rate/Frequency","Item Type Metadata:Time Summary","Item Type Metadata:Email Body","Item Type Metadata:Subject Line","Item Type Metadata:From","Item Type Metadata:To","Item Type Metadata:CC","Item Type Metadata:BCC","Item Type Metadata:Number of Attachments","Item Type Metadata:Standards","Item Type Metadata:Objectives","Item Type Metadata:Materials","Item Type Metadata:Lesson Plan Text","Item Type Metadata:URL","Item Type Metadata:Event Type","Item Type Metadata:Participants","Item Type Metadata:Birth Date","Item Type Metadata:Birthplace","Item Type Metadata:Death Date","Item Type Metadata:Occupation","Item Type Metadata:Biographical Text","Item Type Metadata:Bibliography","Item Type Metadata:Digital Reproduction Information","Item Type Metadata:Repository","Item Type Metadata:Repository Collection","Item Type Metadata:Contact information.","Item Type Metadata:File Name","Item Type Metadata:Notes","Item Type Metadata:Digital item created","Item Type Metadata:Digital item modified","Item Type Metadata:Executive Orders","Item Type Metadata:Record Created","Item Type Metadata:Record Modified","Item Type Metadata:Transcription2","Item Type Metadata:Source URL","Omeka Legacy File:Additional Creator","Omeka Legacy File:Transcriber","Omeka Legacy File:Producer","Omeka Legacy File:Render Device","Omeka Legacy File:Render Details","Omeka Legacy File:Capture Date","Omeka Legacy File:Capture Device","Omeka Legacy File:Capture Details","Omeka Legacy File:Change History","Omeka Legacy File:Watermark","Omeka Legacy File:Encryption","Omeka Legacy File:Compression","Omeka Legacy File:Post Processing","Omeka Image File:Width","Omeka Image File:Height","Omeka Image File:Bit Depth","Omeka Image File:Channels","Omeka Image File:Exif String","Omeka Image File:Exif Array","Omeka Image File:IPTC String","Omeka Image File:IPTC Array","Omeka Video File:Bitrate","Omeka Video File:Duration","Omeka Video File:Sample Rate","Omeka Video File:Codec","Omeka Video File:Width","Omeka Video File:Height",tags,file,itemType,collection,public,featured
99146,http://www.iowaheritage.org/items/show/99146,"Children and gentleman with cattle","Appanoose County Soil and Water Conservation District|Children|Livestock","B&W photograph of four children and gentleman standing next to cattle.","Appanoose County Soil and Water Conservation District ",,"State Library of Iowa",Unknown,"Appanoose County Soil and Water Conservation District of Iowa. For questions about copyright, contact the State Library of Iowa at  <a href=""http://www.statelibraryofiowa.org"">http://www.statelibraryofiowa.org</a>.","This item is protected by copyright and/or related rights. Your are free to use this Item in any way that is permitted by the copyright and related rights legislation that applies to your use. For other uses you need to obtain permission from the rights-holder(s). <a href=""http://rightsstatements.org/"">http://rightsstatements.org</a>",,jpg,,"Still Image; Photograph",,,,,,,,,,,,,,,,,,,,,,,,,,,,,,,,,,,,,,,,,Appanoose_cattle_children_,,,,,,,,,,,,,,,,,,,,,,,,,,,,,,,,,,,,"Appanoose County Soil and Water Conservation District,Children,Livestock",http://www.iowaheritage.org/files/original/24e7783c34cbd2d47367a5e3d275ff00.jpg,"Still Image","Appanoose County Soil and Water Conservation District Historic Collection",1,0
73311,http://www.iowaheritage.org/items/show/73311,"Farm safety problem of a child walking on a fence, 1953","Iowa State University|Agricultural and Biosystems Engineering Dept.|Fences|Children|Safety measures","Little Sorenson walks on a fence on the Irving Sorenson farm, in an example of a farm safety issue.|The teaching of agricultural engineering at Iowa State University began in 1903 and was overseen by the Department of Agronomy from 1905 to 1907. The Department of Agricultural Engineering was formally established in 1907. It was renamed the Department of Agricultural and Biosystems Engineering in 1990. In 2004, the Department merged with  the Department of Industrial Education and Technology. It is jointly administered by the College of Engineering and College of Agriculture and Life Sciences.","Benn; Iowa State University",09-07-F.AgEngr.555-03-002-5,"Iowa State University Library Special Collections; http://www.add.lib.iastate.edu/spcl/index.html",1953,,"U.S. and international copyright laws protect this digital image. Commercial use or distribution of the image is not permitted without prior permission of the copyright holder. For permission to use the digital image, please contact Iowa State University Library, Special Collections archives@iastate.edu  For reproductions see:  http://www.add.lib.iastate.edu/spcl/services/photfees.html","University Photographs; http://www.add.lib.iastate.edu/spcl/collections/images.html",Photograph,,"Image (grayscale)|Image",09-07-F.AgEngr.555-03-002-5|https://digitalcollections.lib.iastate.edu/,,,,,,,,,,,,,,,,,,,,,,,,,,,,,,,,,,,,,,,,,,,,,,,,"<a href=""https://digitalcollections.lib.iastate.edu/"" target=""_blank"">View this item in its source respository</a>",,,,,,,,,,,,,,,,,,,,,,,,,,,,,http://www.iowaheritage.org/files/original/dc15b6f66ac293c5e51cdf091c313b0b.jpg,"Remote Item",,1,0
73309,http://www.iowaheritage.org/items/show/73309,"Farm safety problem of child riding on the side of a moving tractor, 1953","Iowa State University|Agricultural and Biosystems Engineering Dept.|Farm tractors|Children|Safety measures","Little Sorenson rides on a tractor by standing on the side with Irving Sorenson driving, showing a farm safety issue.|The teaching of agricultural engineering at Iowa State University began in 1903 and was overseen by the Department of Agronomy from 1905 to 1907. The Department of Agricultural Engineering was formally established in 1907. It was renamed the Department of Agricultural and Biosystems Engineering in 1990. In 2004, the Department merged with  the Department of Industrial Education and Technology. It is jointly administered by the College of Engineering and College of Agriculture and Life Sciences.","Benn; Iowa State University",09-07-F.AgEngr.555-03-002-3,"Iowa State University Library Special Collections; http://www.add.lib.iastate.edu/spcl/index.html",1953,,"U.S. and international copyright laws protect this digital image. Commercial use or distribution of the image is not permitted without prior permission of the copyright holder. For permission to use the digital image, please contact Iowa State University Library, Special Collections archives@iastate.edu  For reproductions see:  http://www.add.lib.iastate.edu/spcl/services/photfees.html","University Photographs; http://www.add.lib.iastate.edu/spcl/collections/images.html",Photograph,,"Image (grayscale)|Image",09-07-F.AgEngr.555-03-002-3|https://digitalcollections.lib.iastate.edu/,,,,,,,,,,,,,,,,,,,,,,,,,,,,,,,,,,,,,,,,,,,,,,,,"<a href=""https://digitalcollections.lib.iastate.edu/"" target=""_blank"">View this item in its source respository</a>",,,,,,,,,,,,,,,,,,,,,,,,,,,,,http://www.iowaheritage.org/files/original/3b451ead95d3ea66537463d7649d8a26.jpg,"Remote Item",,1,0
73308,http://www.iowaheritage.org/items/show/73308,"Farm safety problem of child climbing conveyor belt, viewed from below, 1953","Iowa State University|Agricultural and Biosystems Engineering Dept.|Conveyor belts|Granaries|Children|Safety measures","Viewed from below, little Sorenson climbs up the conveyor that carries crops from the wagon to the top of the bins on the family farm, in an example of a farm safety issue.|The teaching of agricultural engineering at Iowa State University began in 1903 and was overseen by the Department of Agronomy from 1905 to 1907. The Department of Agricultural Engineering was formally established in 1907. It was renamed the Department of Agricultural and Biosystems Engineering in 1990. In 2004, the Department merged with  the Department of Industrial Education and Technology. It is jointly administered by the College of Engineering and College of Agriculture and Life Sciences.","Benn; Iowa State University",09-07-F.AgEngr.555-03-002-2,"Iowa State University Library Special Collections; http://www.add.lib.iastate.edu/spcl/index.html",1953,,"U.S. and international copyright laws protect this digital image. Commercial use or distribution of the image is not permitted without prior permission of the copyright holder. For permission to use the digital image, please contact Iowa State University Library, Special Collections archives@iastate.edu  For reproductions see:  http://www.add.lib.iastate.edu/spcl/services/photfees.html","University Photographs; http://www.add.lib.iastate.edu/spcl/collections/images.html",Photograph,,"Image (grayscale)|Image",09-07-F.AgEngr.555-03-002-2|https://digitalcollections.lib.iastate.edu/,,,,,,,,,,,,,,,,,,,,,,,,,,,,,,,,,,,,,,,,,,,,,,,,"<a href=""https://digitalcollections.lib.iastate.edu/"" target=""_blank"">View this item in its source respository</a>",,,,,,,,,,,,,,,,,,,,,,,,,,,,,http://www.iowaheritage.org/files/original/e00d3a4355bc199550408693b629825b.jpg,"Remote Item",,1,0
73307,http://www.iowaheritage.org/items/show/73307,"Farm safety problem of child climbing conveyor belt, 1953","Iowa State University|Agricultural and Biosystems Engineering Dept.|Conveyor belts|Children|Safety measures","Little Sorenson, on Irving Sorenson family farm, climbs up the conveyor belt that carries crops to the top of the grain bin, in an example of a farm safety issue.|The teaching of agricultural engineering at Iowa State University began in 1903 and was overseen by the Department of Agronomy from 1905 to 1907. The Department of Agricultural Engineering was formally established in 1907. It was renamed the Department of Agricultural and Biosystems Engineering in 1990. In 2004, the Department merged with  the Department of Industrial Education and Technology. It is jointly administered by the College of Engineering and College of Agriculture and Life Sciences.","Benn; Iowa State University",09-07-F.AgEngr.555-03-002-1,"Iowa State University Library Special Collections; http://www.add.lib.iastate.edu/spcl/index.html",1953,,"U.S. and international copyright laws protect this digital image. Commercial use or distribution of the image is not permitted without prior permission of the copyright holder. For permission to use the digital image, please contact Iowa State University Library, Special Collections archives@iastate.edu  For reproductions see:  http://www.add.lib.iastate.edu/spcl/services/photfees.html","University Photographs; http://www.add.lib.iastate.edu/spcl/collections/images.html",Photograph,,"Image (grayscale)|Image",09-07-F.AgEngr.555-03-002-1|https://digitalcollections.lib.iastate.edu/,,,,,,,,,,,,,,,,,,,,,,,,,,,,,,,,,,,,,,,,,,,,,,,,"<a href=""https://digitalcollections.lib.iastate.edu/"" target=""_blank"">View this item in its source respository</a>",,,,,,,,,,,,,,,,,,,,,,,,,,,,,http://www.iowaheritage.org/files/original/566fdc0c51f86047b34f5bac8b2c41dd.jpg,"Remote Item",,1,0
69675,http://www.iowaheritage.org/items/show/69675,"Children playing outside",Children,"A boy pours something from a bucket into a cauldron steaming over a fire. The girls are dressed in coats and bonnets.","Pascal, Descartes L., 1870","MS 0091","Iowa State University Library Special Collections: http://www.add.lib.iastate.edu/spcl/index.html","1880; 1881; 1882; 1883; 1884; 1885; 1886; 1887; 1888; 1889; 1890; 1891; 1892; 1893; 1894; 1895; 1896; 1897; 1898; 1899; 1900; 1901; 1902; 1903; 1904; 1905; 1906; 1907; 1908; 1909; 1910; 1911; 1912; 1913; 1914; 1915; 1916; 1917; 1918; 1919; 1920|2005-06-20",,"U.S. and international copyright laws protect this digital image. Commercial use or distribution of the image is not permitted without prior permission of the copyright holder. For permission to use the digital image, please contact Iowa State University Library Special Collections at archives@iastate.edu   For reproductions see:  http://www.add.lib.iastate.edu/spcl/services/photfees.html","Descartes Pascal scrapbook and glass plate negatives; http://www.add.lib.iastate.edu/spcl/manuscripts/MS091.html","Glass plate negative",,Image,91.Pascal.9-15|https://digitalcollections.lib.iastate.edu/,,,,,,,,,,,,,,,,,,,,,,,,,,,,,,,,,,,,,,,,,,,,,,,,"<a href=""https://digitalcollections.lib.iastate.edu/"" target=""_blank"">View this item in its source respository</a>",,,,,,,,,,,,,,,,,,,,,,,,,,,,,http://www.iowaheritage.org/files/original/39f1fbf8e1559f23eb69fab43dfb0a7c.jpg,"Remote Item",,1,0
68817,http://www.iowaheritage.org/items/show/68817,"Farm safety problem of a child walking on a fence, 1953","Iowa State University|Agricultural and Biosystems Engineering Dept.|Fences|Children|Safety measures","Little Sorenson walks on a fence on the Irving Sorenson farm, in an example of a farm safety issue.|The teaching of agricultural engineering at Iowa State University began in 1903 and was overseen by the Department of Agronomy from 1905 to 1907. The Department of Agricultural Engineering was formally established in 1907. It was renamed the Department of Agricultural and Biosystems Engineering in 1990. In 2004, the Department merged with  the Department of Industrial Education and Technology. It is jointly administered by the College of Engineering and College of Agriculture and Life Sciences.","Benn; Iowa State University",09-07-F.AgEngr.555-03-002-5,"Iowa State University Library Special Collections; http://www.add.lib.iastate.edu/spcl/index.html",1953,,"U.S. and international copyright laws protect this digital image. Commercial use or distribution of the image is not permitted without prior permission of the copyright holder. For permission to use the digital image, please contact Iowa State University Library, Special Collections archives@iastate.edu  For reproductions see:  http://www.add.lib.iastate.edu/spcl/services/photfees.html","University Photographs; http://www.add.lib.iastate.edu/spcl/collections/images.html",Photograph,,"Image (grayscale)|Image",09-07-F.AgEngr.555-03-002-5|https://digitalcollections.lib.iastate.edu/,,,,,,,,,,,,,,,,,,,,,,,,,,,,,,,,,,,,,,,,,,,,,,,,"<a href=""https://digitalcollections.lib.iastate.edu/"" target=""_blank"">View this item in its source respository</a>",,,,,,,,,,,,,,,,,,,,,,,,,,,,,http://www.iowaheritage.org/files/original/232e71abc8669f5e1ef97127710bee4c.jpg,"Remote Item","Iowa State University Library Photograph Collection",1,0
68815,http://www.iowaheritage.org/items/show/68815,"Farm safety problem of child riding on the side of a moving tractor, 1953","Iowa State University|Agricultural and Biosystems Engineering Dept.|Farm tractors|Children|Safety measures","Little Sorenson rides on a tractor by standing on the side with Irving Sorenson driving, showing a farm safety issue.|The teaching of agricultural engineering at Iowa State University began in 1903 and was overseen by the Department of Agronomy from 1905 to 1907. The Department of Agricultural Engineering was formally established in 1907. It was renamed the Department of Agricultural and Biosystems Engineering in 1990. In 2004, the Department merged with  the Department of Industrial Education and Technology. It is jointly administered by the College of Engineering and College of Agriculture and Life Sciences.","Benn; Iowa State University",09-07-F.AgEngr.555-03-002-3,"Iowa State University Library Special Collections; http://www.add.lib.iastate.edu/spcl/index.html",1953,,"U.S. and international copyright laws protect this digital image. Commercial use or distribution of the image is not permitted without prior permission of the copyright holder. For permission to use the digital image, please contact Iowa State University Library, Special Collections archives@iastate.edu  For reproductions see:  http://www.add.lib.iastate.edu/spcl/services/photfees.html","University Photographs; http://www.add.lib.iastate.edu/spcl/collections/images.html",Photograph,,"Image (grayscale)|Image",09-07-F.AgEngr.555-03-002-3|https://digitalcollections.lib.iastate.edu/,,,,,,,,,,,,,,,,,,,,,,,,,,,,,,,,,,,,,,,,,,,,,,,,"<a href=""https://digitalcollections.lib.iastate.edu/"" target=""_blank"">View this item in its source respository</a>",,,,,,,,,,,,,,,,,,,,,,,,,,,,,http://www.iowaheritage.org/files/original/7f62a4cd11abf4c0f45839c4fbee812e.jpg,"Remote Item","Iowa State University Library Photograph Collection",1,0
68814,http://www.iowaheritage.org/items/show/68814,"Farm safety problem of child climbing conveyor belt, viewed from below, 1953","Iowa State University|Agricultural and Biosystems Engineering Dept.|Conveyor belts|Granaries|Children|Safety measures","Viewed from below, little Sorenson climbs up the conveyor that carries crops from the wagon to the top of the bins on the family farm, in an example of a farm safety issue.|The teaching of agricultural engineering at Iowa State University began in 1903 and was overseen by the Department of Agronomy from 1905 to 1907. The Department of Agricultural Engineering was formally established in 1907. It was renamed the Department of Agricultural and Biosystems Engineering in 1990. In 2004, the Department merged with  the Department of Industrial Education and Technology. It is jointly administered by the College of Engineering and College of Agriculture and Life Sciences.","Benn; Iowa State University",09-07-F.AgEngr.555-03-002-2,"Iowa State University Library Special Collections; http://www.add.lib.iastate.edu/spcl/index.html",1953,,"U.S. and international copyright laws protect this digital image. Commercial use or distribution of the image is not permitted without prior permission of the copyright holder. For permission to use the digital image, please contact Iowa State University Library, Special Collections archives@iastate.edu  For reproductions see:  http://www.add.lib.iastate.edu/spcl/services/photfees.html","University Photographs; http://www.add.lib.iastate.edu/spcl/collections/images.html",Photograph,,"Image (grayscale)|Image",09-07-F.AgEngr.555-03-002-2|https://digitalcollections.lib.iastate.edu/,,,,,,,,,,,,,,,,,,,,,,,,,,,,,,,,,,,,,,,,,,,,,,,,"<a href=""https://digitalcollections.lib.iastate.edu/"" target=""_blank"">View this item in its source respository</a>",,,,,,,,,,,,,,,,,,,,,,,,,,,,,http://www.iowaheritage.org/files/original/ada6ec1dfc5f7b52875a04e84be488c7.jpg,"Remote Item","Iowa State University Library Photograph Collection",1,0
68813,http://www.iowaheritage.org/items/show/68813,"Farm safety problem of child climbing conveyor belt, 1953","Iowa State University|Agricultural and Biosystems Engineering Dept.|Conveyor belts|Children|Safety measures","Little Sorenson, on Irving Sorenson family farm, climbs up the conveyor belt that carries crops to the top of the grain bin, in an example of a farm safety issue.|The teaching of agricultural engineering at Iowa State University began in 1903 and was overseen by the Department of Agronomy from 1905 to 1907. The Department of Agricultural Engineering was formally established in 1907. It was renamed the Department of Agricultural and Biosystems Engineering in 1990. In 2004, the Department merged with  the Department of Industrial Education and Technology. It is jointly administered by the College of Engineering and College of Agriculture and Life Sciences.","Benn; Iowa State University",09-07-F.AgEngr.555-03-002-1,"Iowa State University Library Special Collections; http://www.add.lib.iastate.edu/spcl/index.html",1953,,"U.S. and international copyright laws protect this digital image. Commercial use or distribution of the image is not permitted without prior permission of the copyright holder. For permission to use the digital image, please contact Iowa State University Library, Special Collections archives@iastate.edu  For reproductions see:  http://www.add.lib.iastate.edu/spcl/services/photfees.html","University Photographs; http://www.add.lib.iastate.edu/spcl/collections/images.html",Photograph,,"Image (grayscale)|Image",09-07-F.AgEngr.555-03-002-1|https://digitalcollections.lib.iastate.edu/,,,,,,,,,,,,,,,,,,,,,,,,,,,,,,,,,,,,,,,,,,,,,,,,"<a href=""https://digitalcollections.lib.iastate.edu/"" target=""_blank"">View this item in its source respository</a>",,,,,,,,,,,,,,,,,,,,,,,,,,,,,http://www.iowaheritage.org/files/original/bbb3f2ba69c0fd88f363f896c2017950.jpg,"Remote Item","Iowa State University Library Photograph Collection",1,0
