 




﻿"Item Id","Item URI","Dublin Core:Title","Dublin Core:Subject","Dublin Core:Description","Dublin Core:Creator","Dublin Core:Source","Dublin Core:Publisher","Dublin Core:Date","Dublin Core:Contributor","Dublin Core:Rights","Dublin Core:Relation","Dublin Core:Format","Dublin Core:Language","Dublin Core:Type","Dublin Core:Identifier","Dublin Core:Coverage","Item Type Metadata:Text","Item Type Metadata:Interviewer","Item Type Metadata:Interviewee","Item Type Metadata:Location","Item Type Metadata:Transcription","Item Type Metadata:Local URL","Item Type Metadata:Original Format","Item Type Metadata:Physical Dimensions","Item Type Metadata:Duration","Item Type Metadata:Compression","Item Type Metadata:Producer","Item Type Metadata:Director","Item Type Metadata:Bit Rate/Frequency","Item Type Metadata:Time Summary","Item Type Metadata:Email Body","Item Type Metadata:Subject Line","Item Type Metadata:From","Item Type Metadata:To","Item Type Metadata:CC","Item Type Metadata:BCC","Item Type Metadata:Number of Attachments","Item Type Metadata:Standards","Item Type Metadata:Objectives","Item Type Metadata:Materials","Item Type Metadata:Lesson Plan Text","Item Type Metadata:URL","Item Type Metadata:Event Type","Item Type Metadata:Participants","Item Type Metadata:Birth Date","Item Type Metadata:Birthplace","Item Type Metadata:Death Date","Item Type Metadata:Occupation","Item Type Metadata:Biographical Text","Item Type Metadata:Bibliography","Item Type Metadata:Digital Reproduction Information","Item Type Metadata:Repository","Item Type Metadata:Repository Collection","Item Type Metadata:Contact information.","Item Type Metadata:File Name","Item Type Metadata:Notes","Item Type Metadata:Digital item created","Item Type Metadata:Digital item modified","Item Type Metadata:Executive Orders","Item Type Metadata:Record Created","Item Type Metadata:Record Modified","Item Type Metadata:Transcription2","Item Type Metadata:Source URL","Omeka Legacy File:Additional Creator","Omeka Legacy File:Transcriber","Omeka Legacy File:Producer","Omeka Legacy File:Render Device","Omeka Legacy File:Render Details","Omeka Legacy File:Capture Date","Omeka Legacy File:Capture Device","Omeka Legacy File:Capture Details","Omeka Legacy File:Change History","Omeka Legacy File:Watermark","Omeka Legacy File:Encryption","Omeka Legacy File:Compression","Omeka Legacy File:Post Processing","Omeka Image File:Width","Omeka Image File:Height","Omeka Image File:Bit Depth","Omeka Image File:Channels","Omeka Image File:Exif String","Omeka Image File:Exif Array","Omeka Image File:IPTC String","Omeka Image File:IPTC Array","Omeka Video File:Bitrate","Omeka Video File:Duration","Omeka Video File:Sample Rate","Omeka Video File:Codec","Omeka Video File:Width","Omeka Video File:Height",tags,file,itemType,collection,public,featured
64430,https://www.iowaheritage.org/items/show/64430,Deficit,"Deficits|Branstad, Terry E.|Iowa|Governors|1990-2000|Governors|States|State governments|State governments -- Officials and employees|State politics|Legislators|Legislature|Campbell, Bonnie J., 1948-|Miller, Tom|Politicians|Potatoes|Steam|Men","Atty. general; Treasurer; Legislature","Duffy, Brian, 1955-",,"University of Iowa. Libraries. Special Collections Dept.",1991-02-03|2011-04,,"Educational use only, no other permissions given. Copyright to this digital object is owned by The Des Moines Register; it may not be downloaded, reproduced, or distributed without written permission. For more information, contact the Special Collections Department.","Editorial Cartoons of Brian Duffy; Des Moines Register Cartoonists|Papers of Brian Duffy|Des Moines Register",,English,"Still image|Editorial cartoons",MSC916|duffy-910203|http://digital.lib.uiowa.edu/cdm/ref/collection/duffy/id/268,,,,,,,,,,,,,,,,,,,,,,,,,,,,,,,,,,,,,,,,,,,,,,,,"<a href=""http://digital.lib.uiowa.edu/cdm/ref/collection/duffy/id/268"" target=""_blank"">View this item in its source respository</a>",,,,,,,,,,,,,,,,,,,,,,,,,,,,,https://www.iowaheritage.org/files/original/8099ee8cf03d6576d613887f89a45c33.jpg,"Remote Item","Editorial Cartoons of Brian Duffy",1,0
64580,https://www.iowaheritage.org/items/show/64580,Democracy,"Democracy|China|Men|1980-1990|Communism|Communism -- China|Isolationism|China|China -- Politics and government|Walls|Water|Fingers",,"Duffy, Brian, 1955-",,"University of Iowa. Libraries. Special Collections Dept.",1989-05-23|2011-04,,"Educational use only, no other permissions given. Copyright to this digital object is owned by The Des Moines Register; it may not be downloaded, reproduced, or distributed without written permission. For more information, contact the Special Collections Department.","Editorial Cartoons of Brian Duffy; Des Moines Register Cartoonists|Papers of Brian Duffy|Des Moines Register",,English,"Still image|Editorial cartoons",MSC916|duffy-890523|http://digital.lib.uiowa.edu/cdm/ref/collection/duffy/id/418,,,,,,,,,,,,,,,,,,,,,,,,,,,,,,,,,,,,,,,,,,,,,,,,"<a href=""http://digital.lib.uiowa.edu/cdm/ref/collection/duffy/id/418"" target=""_blank"">View this item in its source respository</a>",,,,,,,,,,,,,,,,,,,,,,,,,,,,,https://www.iowaheritage.org/files/original/93672e65deb0bea0163b50749be1de82.jpg,"Remote Item","Editorial Cartoons of Brian Duffy",1,0
64188,https://www.iowaheritage.org/items/show/64188,"Department of Human Services study","Children|Duis, Shelby|Iowa|Men|2000-2010|Abuse|Murder|Parents|Bureaucracy|Bureaucracy -- United States|Protection|Mandatory Reporting|Spirit Lake (Iowa)|Equipment|Parachutes|Graves|Flowers|Pens|Records","Extensive patching needed ... ; Shelby Duis","Duffy, Brian, 1955-",,"University of Iowa. Libraries. Special Collections Dept.",2000-11-22|2011-04,,"Educational use only, no other permissions given. Copyright to this digital object is owned by The Des Moines Register; it may not be downloaded, reproduced, or distributed without written permission. For more information, contact the Special Collections Department.","Editorial Cartoons of Brian Duffy; Des Moines Register Cartoonists|Papers of Brian Duffy|Des Moines Register",,English,"Still image|Editorial cartoons",MSC916|duffy-001122|http://digital.lib.uiowa.edu/cdm/ref/collection/duffy/id/26,,,,,,,,,,,,,,,,,,,,,,,,,,,,,,,,,,,,,,,,,,,,,,,,"<a href=""http://digital.lib.uiowa.edu/cdm/ref/collection/duffy/id/26"" target=""_blank"">View this item in its source respository</a>",,,,,,,,,,,,,,,,,,,,,,,,,,,,,https://www.iowaheritage.org/files/original/66e8b6b5b7c94e3bf9c20623bc2a6f7f.jpg,"Remote Item","Editorial Cartoons of Brian Duffy",1,0
64692,https://www.iowaheritage.org/items/show/64692,"Des Moines business leadership viewing the working model of the loop bypass plan","Business|Iowa|Men|1990-2000|Highways|Government|Highways|City traffic|Des Moines (Iowa)|Nooses|Roads",,"Duffy, Brian, 1955-",,"University of Iowa. Libraries. Special Collections Dept.",1996-10-22|2011-04,,"Educational use only, no other permissions given. Copyright to this digital object is owned by The Des Moines Register; it may not be downloaded, reproduced, or distributed without written permission. For more information, contact the Special Collections Department.","Editorial Cartoons of Brian Duffy; Des Moines Register Cartoonists|Papers of Brian Duffy|Des Moines Register",,English,"Still image|Editorial cartoons",MSC916|duffy-961022|http://digital.lib.uiowa.edu/cdm/ref/collection/duffy/id/530,,,,,,,,,,,,,,,,,,,,,,,,,,,,,,,,,,,,,,,,,,,,,,,,"<a href=""http://digital.lib.uiowa.edu/cdm/ref/collection/duffy/id/530"" target=""_blank"">View this item in its source respository</a>",,,,,,,,,,,,,,,,,,,,,,,,,,,,,https://www.iowaheritage.org/files/original/475e4a87e5badfa5632e8861b46e4297.jpg,"Remote Item","Editorial Cartoons of Brian Duffy",1,0
64516,https://www.iowaheritage.org/items/show/64516,"Desk legislator chair","Legislators|Iowa|Men|1980-1990|Legislature|States|State governments|State governments -- Officials and employees|State politics|Desks|Chairs|Sleeping|Arrows","Zzz; File cabinet","Duffy, Brian, 1955-",,"University of Iowa. Libraries. Special Collections Dept.",1984-08-13|2011-04,,"Educational use only, no other permissions given. Copyright to this digital object is owned by The Des Moines Register; it may not be downloaded, reproduced, or distributed without written permission. For more information, contact the Special Collections Department.","Editorial Cartoons of Brian Duffy; Des Moines Register Cartoonists|Papers of Brian Duffy|Des Moines Register",,English,"Still image|Editorial cartoons",MSC916|duffy-840813|http://digital.lib.uiowa.edu/cdm/ref/collection/duffy/id/354,,,,,,,,,,,,,,,,,,,,,,,,,,,,,,,,,,,,,,,,,,,,,,,,"<a href=""http://digital.lib.uiowa.edu/cdm/ref/collection/duffy/id/354"" target=""_blank"">View this item in its source respository</a>",,,,,,,,,,,,,,,,,,,,,,,,,,,,,https://www.iowaheritage.org/files/original/a0a1f6752ec43ba6f05b53881f8694aa.jpg,"Remote Item","Editorial Cartoons of Brian Duffy",1,0
64195,https://www.iowaheritage.org/items/show/64195,"Did you pack your razor?","Social Security|Gore, Albert, 1948-|United States|Caves|2000-2010|Primaries|Caucus|Campaigns|Politicians|Defeat|Government policy|Suitcases|Men|Books|Chests|Beards|Birds|Padlocks|Bumper stickers","Iowa; New Hampshire; Social Security; The zen of teaching","Duffy, Brian, 1955-",,"University of Iowa. Libraries. Special Collections Dept.",2001-09-12|2011-04,,"Educational use only, no other permissions given. Copyright to this digital object is owned by The Des Moines Register; it may not be downloaded, reproduced, or distributed without written permission. For more information, contact the Special Collections Department.","Editorial Cartoons of Brian Duffy; Des Moines Register Cartoonists|Papers of Brian Duffy|Des Moines Register",,English,"Still image|Editorial cartoons","MSC916|duffy-010912 (2)|http://digital.lib.uiowa.edu/cdm/ref/collection/duffy/id/33",,,,,,,,,,,,,,,,,,,,,,,,,,,,,,,,,,,,,,,,,,,,,,,,"<a href=""http://digital.lib.uiowa.edu/cdm/ref/collection/duffy/id/33"" target=""_blank"">View this item in its source respository</a>",,,,,,,,,,,,,,,,,,,,,,,,,,,,,https://www.iowaheritage.org/files/original/753f2649a98814cf82ab1f364c20d095.jpg,"Remote Item","Editorial Cartoons of Brian Duffy",1,0
64595,https://www.iowaheritage.org/items/show/64595,"Dinosaur stamp","Postal service -- United States|United States|Stamps|1990-2000|Postal service|Postal Service -- United States -- Finance|Postage stamps|Mail|Mailboxes|Snails|Money|Trees|Eating & drinking|Clouds","30 cents; Munch ... munch ... ; Postalsaurus","Duffy, Brian, 1955-",,"University of Iowa. Libraries. Special Collections Dept.",1990-03-11|2011-04,,"Educational use only, no other permissions given. Copyright to this digital object is owned by The Des Moines Register; it may not be downloaded, reproduced, or distributed without written permission. For more information, contact the Special Collections Department.","Editorial Cartoons of Brian Duffy; Des Moines Register Cartoonists|Papers of Brian Duffy|Des Moines Register",,English,"Still image|Editorial cartoons",MSC916|duffy-900311|http://digital.lib.uiowa.edu/cdm/ref/collection/duffy/id/433,,,,,,,,,,,,,,,,,,,,,,,,,,,,,,,,,,,,,,,,,,,,,,,,"<a href=""http://digital.lib.uiowa.edu/cdm/ref/collection/duffy/id/433"" target=""_blank"">View this item in its source respository</a>",,,,,,,,,,,,,,,,,,,,,,,,,,,,,https://www.iowaheritage.org/files/original/20b3761107bb566953ce7bc8f2f7f4cd.jpg,"Remote Item","Editorial Cartoons of Brian Duffy",1,0
64543,https://www.iowaheritage.org/items/show/64543,"Dirty Ronnie","Vetoes|Reagan, Ronald|United States|Guns|1980-1990|Presidents|Presidential vetoes|Presidents -- United States|Congress|Taxes|Taxation|Presidents|Men|Bullet holes","Go ahead, punk, make my day!; Veto; Tax hike; Congress","Duffy, Brian, 1955-",,"University of Iowa. Libraries. Special Collections Dept.",1985-03-15|2011-04,,"Educational use only, no other permissions given. Copyright to this digital object is owned by The Des Moines Register; it may not be downloaded, reproduced, or distributed without written permission. For more information, contact the Special Collections Department.","Editorial Cartoons of Brian Duffy; Des Moines Register Cartoonists|Papers of Brian Duffy|Des Moines Register",,English,"Still image|Editorial cartoons",MSC916|duffy-850315|http://digital.lib.uiowa.edu/cdm/ref/collection/duffy/id/381,,,,,,,,,,,,,,,,,,,,,,,,,,,,,,,,,,,,,,,,,,,,,,,,"<a href=""http://digital.lib.uiowa.edu/cdm/ref/collection/duffy/id/381"" target=""_blank"">View this item in its source respository</a>",,,,,,,,,,,,,,,,,,,,,,,,,,,,,https://www.iowaheritage.org/files/original/75c1a45b290fc91f897cd76efea55b63.jpg,"Remote Item","Editorial Cartoons of Brian Duffy",1,0
64163,https://www.iowaheritage.org/items/show/64163,"Doctored the photo? Why, we would never resort to such negative campaign tactics","Candidates|Bush, George W. (George Walker), 1946-|United States|Men|2000-2010|Caucus|Presidency|Campaigns|Mudslinging|Republican Party|Nominations for office|Governors|Business|Forbes, Steve, 1947-|Candidates|Posters|Signs|Noses|Ears|Businessmen","Bush tax plan won't fly vote Forbes; Forbes campaign","Duffy, Brian, 1955-",,"University of Iowa. Libraries. Special Collections Dept.",2000-01-20|2011-04,,"Educational use only, no other permissions given. Copyright to this digital object is owned by The Des Moines Register; it may not be downloaded, reproduced, or distributed without written permission. For more information, contact the Special Collections Department.","Editorial Cartoons of Brian Duffy; Des Moines Register Cartoonists|Papers of Brian Duffy|Des Moines Register",,English,"Still image|Editorial cartoons",MSC916|duffy-000120|http://digital.lib.uiowa.edu/cdm/ref/collection/duffy/id/1,,,,,,,,,,,,,,,,,,,,,,,,,,,,,,,,,,,,,,,,,,,,,,,,"<a href=""http://digital.lib.uiowa.edu/cdm/ref/collection/duffy/id/1"" target=""_blank"">View this item in its source respository</a>",,,,,,,,,,,,,,,,,,,,,,,,,,,,,https://www.iowaheritage.org/files/original/d0333fbdb65cebbfc63dd53f893cb3c1.jpg,"Remote Item","Editorial Cartoons of Brian Duffy",1,0
64634,https://www.iowaheritage.org/items/show/64634,"Dog days of summer","War|Liberia|Dogs|1990-2000|Wars|Violence|Foreign relations|South Africa|Middle East|Sri Lanka|Bones","Liberia; South Africa; Mideast; Sri Lanka; Violence","Duffy, Brian, 1955-",,"University of Iowa. Libraries. Special Collections Dept.",1990-08|2011-04,,"Educational use only, no other permissions given. Copyright to this digital object is owned by The Des Moines Register; it may not be downloaded, reproduced, or distributed without written permission. For more information, contact the Special Collections Department.","Editorial Cartoons of Brian Duffy; Des Moines Register Cartoonists|Papers of Brian Duffy|Des Moines Register",,English,"Still image|Editorial cartoons","MSC916|duffy-9008xx 2|http://digital.lib.uiowa.edu/cdm/ref/collection/duffy/id/472",,,,,,,,,,,,,,,,,,,,,,,,,,,,,,,,,,,,,,,,,,,,,,,,"<a href=""http://digital.lib.uiowa.edu/cdm/ref/collection/duffy/id/472"" target=""_blank"">View this item in its source respository</a>",,,,,,,,,,,,,,,,,,,,,,,,,,,,,https://www.iowaheritage.org/files/original/5d6a640e339baed8f419c9d6c517b730.jpg,"Remote Item","Editorial Cartoons of Brian Duffy",1,0
