 




﻿"Item Id","Item URI","Dublin Core:Title","Dublin Core:Subject","Dublin Core:Description","Dublin Core:Creator","Dublin Core:Source","Dublin Core:Publisher","Dublin Core:Date","Dublin Core:Contributor","Dublin Core:Rights","Dublin Core:Relation","Dublin Core:Format","Dublin Core:Language","Dublin Core:Type","Dublin Core:Identifier","Dublin Core:Coverage","Item Type Metadata:Text","Item Type Metadata:Interviewer","Item Type Metadata:Interviewee","Item Type Metadata:Location","Item Type Metadata:Transcription","Item Type Metadata:Local URL","Item Type Metadata:Original Format","Item Type Metadata:Physical Dimensions","Item Type Metadata:Duration","Item Type Metadata:Compression","Item Type Metadata:Producer","Item Type Metadata:Director","Item Type Metadata:Bit Rate/Frequency","Item Type Metadata:Time Summary","Item Type Metadata:Email Body","Item Type Metadata:Subject Line","Item Type Metadata:From","Item Type Metadata:To","Item Type Metadata:CC","Item Type Metadata:BCC","Item Type Metadata:Number of Attachments","Item Type Metadata:Standards","Item Type Metadata:Objectives","Item Type Metadata:Materials","Item Type Metadata:Lesson Plan Text","Item Type Metadata:URL","Item Type Metadata:Event Type","Item Type Metadata:Participants","Item Type Metadata:Birth Date","Item Type Metadata:Birthplace","Item Type Metadata:Death Date","Item Type Metadata:Occupation","Item Type Metadata:Biographical Text","Item Type Metadata:Bibliography","Item Type Metadata:Digital Reproduction Information","Item Type Metadata:Repository","Item Type Metadata:Repository Collection","Item Type Metadata:Contact information.","Item Type Metadata:File Name","Item Type Metadata:Notes","Item Type Metadata:Digital item created","Item Type Metadata:Digital item modified","Item Type Metadata:Executive Orders","Item Type Metadata:Record Created","Item Type Metadata:Record Modified","Item Type Metadata:Transcription2","Item Type Metadata:Source URL","Omeka Legacy File:Additional Creator","Omeka Legacy File:Transcriber","Omeka Legacy File:Producer","Omeka Legacy File:Render Device","Omeka Legacy File:Render Details","Omeka Legacy File:Capture Date","Omeka Legacy File:Capture Device","Omeka Legacy File:Capture Details","Omeka Legacy File:Change History","Omeka Legacy File:Watermark","Omeka Legacy File:Encryption","Omeka Legacy File:Compression","Omeka Legacy File:Post Processing","Omeka Image File:Width","Omeka Image File:Height","Omeka Image File:Bit Depth","Omeka Image File:Channels","Omeka Image File:Exif String","Omeka Image File:Exif Array","Omeka Image File:IPTC String","Omeka Image File:IPTC Array","Omeka Video File:Bitrate","Omeka Video File:Duration","Omeka Video File:Sample Rate","Omeka Video File:Codec","Omeka Video File:Width","Omeka Video File:Height",tags,file,itemType,collection,public,featured
12028,https://www.iowaheritage.org/items/show/12028,"Temporary boiler at Burge Residence Hall, The University of Iowa, July 16, 2008","Floods|University of Iowa|United States -- Iowa -- Iowa City|2000-2010|Evacuations|Disaster relief|Boilers|Dormitories||Burge Residence Hall (Iowa City, Iowa)","Images of the temporary boiler setup behind Burge Residence Hall. The boiler was needed to supply hot water until the power plant was re-opened.","Jorgensen, Tom",,"University of Iowa. University News Services",2008-07-16|2008-07-16,,"Educational use only, no other permissions given. U.S. and international copyright laws may protect this item. Commercial use or distribution of this digital object is not permitted without written permission of the copyright holder.","Iowa City Flood|Flood Images|Temp. Boiler Burge, July 16, 2008",jpeg,,"Still image|Photographs",https://digital.lib.uiowa.edu/,,,,,,,,,,,,,,,,,,,,,,,,,,,,,,,,,,,,,,,,,,,,,,,,"<a href=""https://digital.lib.uiowa.edu/"" target=""_blank"">View this item in its source respository</a>",,,,,,,,,,,,,,,,,,,,,,,,,,,,,https://www.iowaheritage.org/files/original/60f2d3d8b63dc70511137fb3ef77564c.jpg,"Remote Item","Iowa City Flood",1,0
12036,https://www.iowaheritage.org/items/show/12036,"Temporary boiler at Burge Residence Hall, The University of Iowa, July 17, 2008","Floods|University of Iowa|United States -- Iowa -- Iowa City|2000-2010|Evacuations|Disaster relief|Boilers|Dormitories||Burge Residence Hall (Iowa City, Iowa)","Images of the temporary boiler setup behind Burge Residence Hall. The boiler was needed to supply hot water until the power plant was re-opened.","Jorgensen, Tom",,"University of Iowa. University News Services",2008-07-17|2008-07-17,,"Educational use only, no other permissions given. U.S. and international copyright laws may protect this item. Commercial use or distribution of this digital object is not permitted without written permission of the copyright holder.","Iowa City Flood|Flood Images|Temp. Boiler Burge, July 17, 2008",jpeg,,"Still image|Photographs",https://digital.lib.uiowa.edu/,,,,,,,,,,,,,,,,,,,,,,,,,,,,,,,,,,,,,,,,,,,,,,,,"<a href=""https://digital.lib.uiowa.edu/"" target=""_blank"">View this item in its source respository</a>",,,,,,,,,,,,,,,,,,,,,,,,,,,,,https://www.iowaheritage.org/files/original/084e2897b06443acfd121b633419404a.jpg,"Remote Item","Iowa City Flood",1,0
12041,https://www.iowaheritage.org/items/show/12041,"Aerial photographs of campus flooding, The University of Iowa, June 16, 2008","Floods|University of Iowa|United States -- Iowa -- Iowa City|2000-2010|Evacuations|Disaster relief, Rivers|Educational facilities|Old Capitol (Iowa City, Iowa)|United States -- Iowa -- Iowa River","Aerial photographs of The University of Iowa campus. Photos taken when the Iowa River was at about 31 feet. Flood stage for the Iowa River at Iowa City is 22 feet.  The previous record was set in 1993 at 28.5 feet.","Jorgensen, Tom",,"University of Iowa. University News Services",2008-06-16|2008-06-16,,"Educational use only, no other permissions given. U.S. and international copyright laws may protect this item. Commercial use or distribution of this digital object is not permitted without written permission of the copyright holder.","Iowa City Flood|Flood Images|Flood Aerials, June 16, 2008",jpeg,,"Still image|Photographs; Aerial photographs",https://digital.lib.uiowa.edu/,,,,,,,,,,,,,,,,,,,,,,,,,,,,,,,,,,,,,,,,,,,,,,,,"<a href=""https://digital.lib.uiowa.edu/"" target=""_blank"">View this item in its source respository</a>",,,,,,,,,,,,,,,,,,,,,,,,,,,,,https://www.iowaheritage.org/files/original/1f2ee9101e48f30d682c836538de2699.jpg,"Remote Item","Iowa City Flood",1,0
12043,https://www.iowaheritage.org/items/show/12043,"Studio Arts in use, The University of Iowa, August 27, 2008","Floods|University of Iowa|United States -- Iowa -- Iowa City|2000-2010|Evacuations|Disaster relief|Educational facilities|Art education|Students|Studio Arts (Iowa City, Iowa)","Studio Arts Building opens for classes.  Photos taken the first day the facility was used by The University of Iowa Art and Art History faculty and students.","Jorgensen, Tom",,"University of Iowa. University News Services",2008-08-27|2008-08-27,,"Educational use only, no other permissions given. U.S. and international copyright laws may protect this item. Commercial use or distribution of this digital object is not permitted without written permission of the copyright holder.","Iowa City Flood|Flood Images|Studio Arts In Use, Aug. 27, 2008",jpeg,,"Still image|Photographs",https://digital.lib.uiowa.edu/,,,,,,,,,,,,,,,,,,,,,,,,,,,,,,,,,,,,,,,,,,,,,,,,"<a href=""https://digital.lib.uiowa.edu/"" target=""_blank"">View this item in its source respository</a>",,,,,,,,,,,,,,,,,,,,,,,,,,,,,https://www.iowaheritage.org/files/original/528372877a07448cc0cd32016e318a3a.jpg,"Remote Item","Iowa City Flood",1,0
12047,https://www.iowaheritage.org/items/show/12047,"Studio Arts construction, The University of Iowa, August 15, 2008","Floods|University of Iowa|United States -- Iowa -- Iowa City|2000-2010|Evacuations|Disaster relief|Building construction|Art education|Educational facilities||Studio Arts (Iowa City, Iowa)","Studio Arts construction in former Menards building on Highway 6 West in Iowa City. Installation of panels, framing, and electrical.","Jorgensen, Tom",,"University of Iowa. University News Services",2008-08-15|2008-08-15,,"Educational use only, no other permissions given. U.S. and international copyright laws may protect this item. Commercial use or distribution of this digital object is not permitted without written permission of the copyright holder.","Iowa City Flood|Flood Images|Studio Arts Construction, Aug. 15, 2008",jpeg,,"Still image|Photographs",https://digital.lib.uiowa.edu/,,,,,,,,,,,,,,,,,,,,,,,,,,,,,,,,,,,,,,,,,,,,,,,,"<a href=""https://digital.lib.uiowa.edu/"" target=""_blank"">View this item in its source respository</a>",,,,,,,,,,,,,,,,,,,,,,,,,,,,,https://www.iowaheritage.org/files/original/c25fcd8474a36e7d3c93f9b6840c9a95.jpg,"Remote Item","Iowa City Flood",1,0
12051,https://www.iowaheritage.org/items/show/12051,"Construction inside Clinton Street Music, The University of Iowa, August 1, 2008","Floods|University of Iowa|United States -- Iowa -- Iowa City|2000-2010|Evacuations|Disaster relief|Construction workers|Music education|Clinton Street Music (Iowa City, Iowa)","Clinton Street Music under construction.  Employees working on electrical framework, drywall, and structural aspects of building.","Jorgensen, Tom",,"University of Iowa. University News Services",2008-08-01|2008-08-01,,"Educational use only, no other permissions given. U.S. and international copyright laws may protect this item. Commercial use or distribution of this digital object is not permitted without written permission of the copyright holder.","Iowa City Flood|Flood Images|Clinton Music Construction, Aug. 1, 2008",jpeg,,"Still image|Photographs",https://digital.lib.uiowa.edu/,,,,,,,,,,,,,,,,,,,,,,,,,,,,,,,,,,,,,,,,,,,,,,,,"<a href=""https://digital.lib.uiowa.edu/"" target=""_blank"">View this item in its source respository</a>",,,,,,,,,,,,,,,,,,,,,,,,,,,,,https://www.iowaheritage.org/files/original/671d833f0dadf5a9836d1fb384ebc7d0.jpg,"Remote Item","Iowa City Flood",1,0
12053,https://www.iowaheritage.org/items/show/12053,"Clinton Street Music under construction, The University of Iowa, August 15, 2008","Floods|University of Iowa|United States -- Iowa -- Iowa City|2000-2010|Evacuations|Disaster relief|Music education|Building construction|Clinton Street Music (Iowa City, Iowa)","A view from inside Clinton Street Music under construction.","Jorgensen, Tom",,"University of Iowa. University News Services",2008-08-15|2008-08-15,,"Educational use only, no other permissions given. U.S. and international copyright laws may protect this item. Commercial use or distribution of this digital object is not permitted without written permission of the copyright holder.","Iowa City Flood|Flood Images|Clinton Music Construction, Aug. 15, 2008",jpeg,,"Still image|Photographs",https://digital.lib.uiowa.edu/,,,,,,,,,,,,,,,,,,,,,,,,,,,,,,,,,,,,,,,,,,,,,,,,"<a href=""https://digital.lib.uiowa.edu/"" target=""_blank"">View this item in its source respository</a>",,,,,,,,,,,,,,,,,,,,,,,,,,,,,https://www.iowaheritage.org/files/original/3d754532947692dac1294532c9525f50.jpg,"Remote Item","Iowa City Flood",1,0
12056,https://www.iowaheritage.org/items/show/12056,"Studio Arts construction, The University of Iowa, August 15, 2008","Floods|United States -- Iowa -- Iowa City|2000-2010|Evacuations|Disaster relief","Studio Arts construction in former Menards building on Highway 6 West. Electrical, carpentry, flooring, mechanical","Jorgensen, Tom",,,2008-08-15|2008-08-15,,,"080815-1 Studio Arts Construction",jpeg|19|28,,"Still image|photographs",https://digital.lib.uiowa.edu/,,,,,,,,,,,,,,,,,,,,,,,,,,,,,,,,,,,,,,,,,,,,,,,,"<a href=""https://digital.lib.uiowa.edu/"" target=""_blank"">View this item in its source respository</a>",,,,,,,,,,,,,,,,,,,,,,,,,,,,,https://www.iowaheritage.org/files/original/e2248d116d456e541fe5eef858b075fc.jpg,"Remote Item","Iowa City Flood",1,0
12059,https://www.iowaheritage.org/items/show/12059,"Working inside relocated Chemistry Lab, The University of Iowa, July 24, 2008","Floods|University of Iowa|United States -- Iowa -- Iowa City|2000-2010|Evacuations|Disaster relief|Chemists|Chemistry|Experiments|Chemistry Building (Iowa City, Iowa)","Chemistry Lab moved from Iowa Advanced Technology Laboratories to the Chemistry Building because of flooding.","Jorgensen, Tom",,"University of Iowa. University News Services",2008-07-24|2008-07-24,,"Educational use only, no other permissions given. U.S. and international copyright laws may protect this item. Commercial use or distribution of this digital object is not permitted without written permission of the copyright holder.","Iowa City Flood|Flood Images|Chemistry Lab Relocation, July 24, 2008",jpeg,,"Still image|Photographs",https://digital.lib.uiowa.edu/,,,,,,,,,,,,,,,,,,,,,,,,,,,,,,,,,,,,,,,,,,,,,,,,"<a href=""https://digital.lib.uiowa.edu/"" target=""_blank"">View this item in its source respository</a>",,,,,,,,,,,,,,,,,,,,,,,,,,,,,https://www.iowaheritage.org/files/original/3d2e154800ddabda3be7deef17333a6e.jpg,"Remote Item","Iowa City Flood",1,0
12061,https://www.iowaheritage.org/items/show/12061,"Flood recovery efforts at Art Building, The University of Iowa, July 3, 2008","Floods|University of Iowa|United States -- Iowa -- Iowa City|2000-2010|Evacuations|Disaster relief|Educational facilities|Art education|Air pumps|Art Building (Iowa City, Iowa)","Photos show flood recovery efforts at old Art Building. Machines pictured are used to purify air from harmful airborne mold.","Jorgensen, Tom",,"University of Iowa. University News Services",2008-07-03|2008-07-03,,"Educational use only, no other permissions given. U.S. and international copyright laws may protect this item. Commercial use or distribution of this digital object is not permitted without written permission of the copyright holder.","Iowa City Flood|Flood Images|Flood Aftermath Arts, July 3, 2008",jpeg,,"Still image|Photographs",https://digital.lib.uiowa.edu/,,,,,,,,,,,,,,,,,,,,,,,,,,,,,,,,,,,,,,,,,,,,,,,,"<a href=""https://digital.lib.uiowa.edu/"" target=""_blank"">View this item in its source respository</a>",,,,,,,,,,,,,,,,,,,,,,,,,,,,,https://www.iowaheritage.org/files/original/69c3c29581fb8f0539da2d6f647c219f.jpg,"Remote Item","Iowa City Flood",1,0
