 




﻿"Item Id","Item URI","Dublin Core:Title","Dublin Core:Subject","Dublin Core:Description","Dublin Core:Creator","Dublin Core:Source","Dublin Core:Publisher","Dublin Core:Date","Dublin Core:Contributor","Dublin Core:Rights","Dublin Core:Relation","Dublin Core:Format","Dublin Core:Language","Dublin Core:Type","Dublin Core:Identifier","Dublin Core:Coverage","Item Type Metadata:Text","Item Type Metadata:Interviewer","Item Type Metadata:Interviewee","Item Type Metadata:Location","Item Type Metadata:Transcription","Item Type Metadata:Local URL","Item Type Metadata:Original Format","Item Type Metadata:Physical Dimensions","Item Type Metadata:Duration","Item Type Metadata:Compression","Item Type Metadata:Producer","Item Type Metadata:Director","Item Type Metadata:Bit Rate/Frequency","Item Type Metadata:Time Summary","Item Type Metadata:Email Body","Item Type Metadata:Subject Line","Item Type Metadata:From","Item Type Metadata:To","Item Type Metadata:CC","Item Type Metadata:BCC","Item Type Metadata:Number of Attachments","Item Type Metadata:Standards","Item Type Metadata:Objectives","Item Type Metadata:Materials","Item Type Metadata:Lesson Plan Text","Item Type Metadata:URL","Item Type Metadata:Event Type","Item Type Metadata:Participants","Item Type Metadata:Birth Date","Item Type Metadata:Birthplace","Item Type Metadata:Death Date","Item Type Metadata:Occupation","Item Type Metadata:Biographical Text","Item Type Metadata:Bibliography","Item Type Metadata:Digital Reproduction Information","Item Type Metadata:Repository","Item Type Metadata:Repository Collection","Item Type Metadata:Contact information.","Item Type Metadata:File Name","Item Type Metadata:Notes","Item Type Metadata:Digital item created","Item Type Metadata:Digital item modified","Item Type Metadata:Executive Orders","Item Type Metadata:Record Created","Item Type Metadata:Record Modified","Item Type Metadata:Transcription2","Item Type Metadata:Source URL","Omeka Legacy File:Additional Creator","Omeka Legacy File:Transcriber","Omeka Legacy File:Producer","Omeka Legacy File:Render Device","Omeka Legacy File:Render Details","Omeka Legacy File:Capture Date","Omeka Legacy File:Capture Device","Omeka Legacy File:Capture Details","Omeka Legacy File:Change History","Omeka Legacy File:Watermark","Omeka Legacy File:Encryption","Omeka Legacy File:Compression","Omeka Legacy File:Post Processing","Omeka Image File:Width","Omeka Image File:Height","Omeka Image File:Bit Depth","Omeka Image File:Channels","Omeka Image File:Exif String","Omeka Image File:Exif Array","Omeka Image File:IPTC String","Omeka Image File:IPTC Array","Omeka Video File:Bitrate","Omeka Video File:Duration","Omeka Video File:Sample Rate","Omeka Video File:Codec","Omeka Video File:Width","Omeka Video File:Height",tags,file,itemType,collection,public,featured
22301,https://www.iowaheritage.org/items/show/22301,"Governor's Day ceremony, VIPs saluting, The University of Iowa, 1931","Government officials|University of Iowa. Dept. of Military Science|United States -- Iowa -- Iowa City|1930-1940|Military officers|Military parades and ceremonies","Ceremony held on field next to Armory.","Kent, Frederick W. (Frederick Wallace), 1894-1984",,"The University of Iowa. Libraries. University Archives",1931|2008-04-14,,"Educational use only, no other permissions given. U.S. and international copyright laws may protect this digital object. Commercial use or distribution of the object is not permitted without prior permission of the copyright holder.","Iowa City Town and Campus Scenes|Frederick W. Kent collection of photographs, 1866-2000|http://www.lib.uiowa.edu/collguides/?RG30.0001.01|Prints|Colleges and departments|Military|Military|Scanned with Ricoh Aficio 3228C at 600 ppi, full color. Master images saved in tiff format.",8|10,,"Still image|Photographs|jpeg",RG30.0001.01|mil568.jpg|https://digital.lib.uiowa.edu/,,,,,,,,,,,,,,,,,,,,,,,,,,,,,,,,,,,,,,,,,,,,,,,,"<a href=""https://digital.lib.uiowa.edu/"" target=""_blank"">View this item in its source respository</a>",,,,,,,,,,,,,,,,,,,,,,,,,,,,,https://www.iowaheritage.org/files/original/6d7b4824029a893cccf1267a46f96aee.jpg,"Remote Item","Iowa City Town and Campus Scenes",1,0
22182,https://www.iowaheritage.org/items/show/22182,"Governor's Day ceremony, VIPs standing near Armory, The University of Iowa, 1929","Military officers|University of Iowa. Dept. of Military Science|United States -- Iowa -- Iowa City|1920-1930|Military parades and ceremonies|Government officials","Armory on right, General Hospital in background on left.","Kent, Frederick W. (Frederick Wallace), 1894-1984",,"The University of Iowa. Libraries. University Archives",1929|2008-04-11,,"Educational use only, no other permissions given. U.S. and international copyright laws may protect this digital object. Commercial use or distribution of the object is not permitted without prior permission of the copyright holder.","Iowa City Town and Campus Scenes|Frederick W. Kent collection of photographs, 1866-2000|http://www.lib.uiowa.edu/collguides/?RG30.0001.01|Prints|Colleges and departments|Military|Military|Scanned with Ricoh Aficio 3228C at 600 ppi, full color. Master images saved in tiff format.",7|9,,"Still image|Photographs|jpeg",RG30.0001.01|mil506.jpg|https://digital.lib.uiowa.edu/,,,,,,,,,,,,,,,,,,,,,,,,,,,,,,,,,,,,,,,,,,,,,,,,"<a href=""https://digital.lib.uiowa.edu/"" target=""_blank"">View this item in its source respository</a>",,,,,,,,,,,,,,,,,,,,,,,,,,,,,https://www.iowaheritage.org/files/original/3576e689183b79e15b93912eff9ae488.jpg,"Remote Item","Iowa City Town and Campus Scenes",1,0
22296,https://www.iowaheritage.org/items/show/22296,"Governor's Day ceremony, VIPs standing next to Armory, The University of Iowa, 1931","Government officials|University of Iowa. Dept. of Military Science|United States -- Iowa -- Iowa City|1930-1940|Military officers|Military parades and ceremonies","General Hospital in background, left.","Kent, Frederick W. (Frederick Wallace), 1894-1984",,"The University of Iowa. Libraries. University Archives",1931|2008-04-14,,"Educational use only, no other permissions given. U.S. and international copyright laws may protect this digital object. Commercial use or distribution of the object is not permitted without prior permission of the copyright holder.","Iowa City Town and Campus Scenes|Frederick W. Kent collection of photographs, 1866-2000|http://www.lib.uiowa.edu/collguides/?RG30.0001.01|Prints|Colleges and departments|Military|Military|Scanned with Ricoh Aficio 3228C at 600 ppi, full color. Master images saved in tiff format.",8|10,,"Still image|Photographs|jpeg",RG30.0001.01|mil565.jpg|https://digital.lib.uiowa.edu/,,,,,,,,,,,,,,,,,,,,,,,,,,,,,,,,,,,,,,,,,,,,,,,,"<a href=""https://digital.lib.uiowa.edu/"" target=""_blank"">View this item in its source respository</a>",,,,,,,,,,,,,,,,,,,,,,,,,,,,,https://www.iowaheritage.org/files/original/78e38647998dc104b0dc2e0a8243666b.jpg,"Remote Item","Iowa City Town and Campus Scenes",1,0
22154,https://www.iowaheritage.org/items/show/22154,"Governor's Day ceremony, VIPs standing next to awards table, The University of Iowa, 1930","Government officials|Jessup, Walter Albert, 1877-1944|University of Iowa. Dept. of Military Science|United States -- Iowa -- Iowa City|1930-1940|Military officers|Military parades and ceremonies|Hammill, John, 1875-1936","Armory on right, General Hospital in background on left.  Governor Hammill, left, and President Walter A. Jessup right of governor.","Kent, Frederick W. (Frederick Wallace), 1894-1984",,"The University of Iowa. Libraries. University Archives",1930|2008-04-09,,"Educational use only, no other permissions given. U.S. and international copyright laws may protect this digital object. Commercial use or distribution of the object is not permitted without prior permission of the copyright holder.","Iowa City Town and Campus Scenes|Frederick W. Kent collection of photographs, 1866-2000|http://www.lib.uiowa.edu/collguides/?RG30.0001.01|Prints|Colleges and departments|Military|Military|Scanned with Ricoh Aficio 3228C at 600 ppi, full color. Master images saved in tiff format.",12|17,,"Still image|Photographs|jpeg",RG30.0001.01|mil492.jpg|https://digital.lib.uiowa.edu/,,,,,,,,,,,,,,,,,,,,,,,,,,,,,,,,,,,,,,,,,,,,,,,,"<a href=""https://digital.lib.uiowa.edu/"" target=""_blank"">View this item in its source respository</a>",,,,,,,,,,,,,,,,,,,,,,,,,,,,,https://www.iowaheritage.org/files/original/bb4586164cd121d906655338a71b8487.jpg,"Remote Item","Iowa City Town and Campus Scenes",1,0
22372,https://www.iowaheritage.org/items/show/22372,"Governor's Day ceremony, VIPs standing on field next to Armory, The University of Iowa, 1933","Government officials|Jessup, Walter Albert, 1877-1944|University of Iowa. Dept. of Military Science|United States -- Iowa -- Iowa City|1930-1940|Military officers|Military parades and ceremonies","President Walter A. Jessup looking toward photographer.","Kent, Frederick W. (Frederick Wallace), 1894-1984",,"The University of Iowa. Libraries. University Archives",1933|2008-04-16,,"Educational use only, no other permissions given. U.S. and international copyright laws may protect this digital object. Commercial use or distribution of the object is not permitted without prior permission of the copyright holder.","Iowa City Town and Campus Scenes|Frederick W. Kent collection of photographs, 1866-2000|http://www.lib.uiowa.edu/collguides/?RG30.0001.01|Prints|Colleges and departments|Military|Military|Scanned with Ricoh Aficio 3228C at 600 ppi, full color. Master images saved in tiff format.",3|6,,"Still image|Photographs|jpeg",RG30.0001.01|mil604.jpg|https://digital.lib.uiowa.edu/,,,,,,,,,,,,,,,,,,,,,,,,,,,,,,,,,,,,,,,,,,,,,,,,"<a href=""https://digital.lib.uiowa.edu/"" target=""_blank"">View this item in its source respository</a>",,,,,,,,,,,,,,,,,,,,,,,,,,,,,https://www.iowaheritage.org/files/original/6f4575bdc76d3c150db436ec8abbe5d7.jpg,"Remote Item","Iowa City Town and Campus Scenes",1,0
21697,https://www.iowaheritage.org/items/show/21697,"Governor's Day on Iowa Field, Governor George W. Clarke on left, The University of Iowa, 1915","Governors|Clarke, George W., 1852-1936.|University of Iowa. Dept. of Military Science|United States -- Iowa -- Iowa City|1910-1920|Military officers|Military parades and ceremonies",,"Kent, Frederick W. (Frederick Wallace), 1894-1984",,"The University of Iowa. Libraries. University Archives",1915|2008-03-14,,"Educational use only, no other permissions given. U.S. and international copyright laws may protect this digital object. Commercial use or distribution of the object is not permitted without prior permission of the copyright holder.","Iowa City Town and Campus Scenes|Frederick W. Kent collection of photographs, 1866-2000|http://www.lib.uiowa.edu/collguides/?RG30.0001.01|Prints|Colleges and departments|Military|Military|Scanned with Ricoh Aficio 3228C at 600 ppi, full color. Master images saved in tiff format.",8|13,,"Still image|Photographs|jpeg",RG30.0001.01|mil260.jpg|https://digital.lib.uiowa.edu/,,,,,,,,,,,,,,,,,,,,,,,,,,,,,,,,,,,,,,,,,,,,,,,,"<a href=""https://digital.lib.uiowa.edu/"" target=""_blank"">View this item in its source respository</a>",,,,,,,,,,,,,,,,,,,,,,,,,,,,,https://www.iowaheritage.org/files/original/cf60faf3383923a2dee031746002aa15.jpg,"Remote Item","Iowa City Town and Campus Scenes",1,0
21695,https://www.iowaheritage.org/items/show/21695,"Governor's Day on Iowa Field, Governor George W. Clarke wearing derby, The University of Iowa, 1915","Governors|Clarke, George W., 1852-1936.|University of Iowa. Dept. of Military Science|United States -- Iowa -- Iowa City|1910-1920|Military officers|Military parades and ceremonies","VIPs watch pass and review.","Kent, Frederick W. (Frederick Wallace), 1894-1984",,"The University of Iowa. Libraries. University Archives",1915|2008-03-14,,"Educational use only, no other permissions given. U.S. and international copyright laws may protect this digital object. Commercial use or distribution of the object is not permitted without prior permission of the copyright holder.","Iowa City Town and Campus Scenes|Frederick W. Kent collection of photographs, 1866-2000|http://www.lib.uiowa.edu/collguides/?RG30.0001.01|Prints|Colleges and departments|Military|Military|Scanned with Ricoh Aficio 3228C at 600 ppi, full color. Master images saved in tiff format.",8|13,,"Still image|Photographs|jpeg",RG30.0001.01|mil259.jpg|https://digital.lib.uiowa.edu/,,,,,,,,,,,,,,,,,,,,,,,,,,,,,,,,,,,,,,,,,,,,,,,,"<a href=""https://digital.lib.uiowa.edu/"" target=""_blank"">View this item in its source respository</a>",,,,,,,,,,,,,,,,,,,,,,,,,,,,,https://www.iowaheritage.org/files/original/edf4e42402203a2a1741a6ac61999afc.jpg,"Remote Item","Iowa City Town and Campus Scenes",1,0
21705,https://www.iowaheritage.org/items/show/21705,"Governor's Day on Iowa Field, Governor George W. Clarke wearing derby, The University of Iowa, 1916","Cadets|Clarke, George W., 1852-1936.|University of Iowa. Dept. of Military Science|United States -- Iowa -- Iowa City|1910-1920|Governors|Military officers|Military parades and ceremonies",,"Kent, Frederick W. (Frederick Wallace), 1894-1984",,"The University of Iowa. Libraries. University Archives",1916|2008-03-14,,"Educational use only, no other permissions given. U.S. and international copyright laws may protect this digital object. Commercial use or distribution of the object is not permitted without prior permission of the copyright holder.","Iowa City Town and Campus Scenes|Frederick W. Kent collection of photographs, 1866-2000|http://www.lib.uiowa.edu/collguides/?RG30.0001.01|Prints|Colleges and departments|Military|Military|Scanned with Ricoh Aficio 3228C at 600 ppi, full color. Master images saved in tiff format.",8|13,,"Still image|Photographs|jpeg",RG30.0001.01|mil264.jpg|https://digital.lib.uiowa.edu/,,,,,,,,,,,,,,,,,,,,,,,,,,,,,,,,,,,,,,,,,,,,,,,,"<a href=""https://digital.lib.uiowa.edu/"" target=""_blank"">View this item in its source respository</a>",,,,,,,,,,,,,,,,,,,,,,,,,,,,,https://www.iowaheritage.org/files/original/93083b269fc6fa88738107383f304e64.jpg,"Remote Item","Iowa City Town and Campus Scenes",1,0
22088,https://www.iowaheritage.org/items/show/22088,"Governor's Day VIPs cross south on Washington Street, The University of Iowa, May 22, 1926","Government officials|Jessup, Walter Albert, 1877-1944|University of Iowa. Dept. of Military Science|United States -- Iowa -- Iowa City|1920-1930|Military officers|Hammill, John, 1875-1936","Pentacrest in background.","Kent, Frederick W. (Frederick Wallace), 1894-1984",,"The University of Iowa. Libraries. University Archives",1926-05-22|2008-04-09,,"Educational use only, no other permissions given. U.S. and international copyright laws may protect this digital object. Commercial use or distribution of the object is not permitted without prior permission of the copyright holder.","Iowa City Town and Campus Scenes|Frederick W. Kent collection of photographs, 1866-2000|http://www.lib.uiowa.edu/collguides/?RG30.0001.01|Prints|Colleges and departments|Military|Military|Scanned with Ricoh Aficio 3228C at 600 ppi, full color. Master images saved in tiff format.",8|14,,"Still image|Photographs|jpeg",RG30.0001.01|mil459.jpg|https://digital.lib.uiowa.edu/,,,,,,,,,,,,,,,,,,,,,,,,,,,,,,,,,,,,,,,,,,,,,,,,"<a href=""https://digital.lib.uiowa.edu/"" target=""_blank"">View this item in its source respository</a>",,,,,,,,,,,,,,,,,,,,,,,,,,,,,https://www.iowaheritage.org/files/original/7285951da1f4951b0b792c89446e442d.jpg,"Remote Item","Iowa City Town and Campus Scenes",1,0
22086,https://www.iowaheritage.org/items/show/22086,"Governor's Day VIPs on Iowa Field, The University of Iowa, May 22, 1926","Governors|Jessup, Walter Albert, 1877-1944|University of Iowa. Dept. of Military Science|United States -- Iowa -- Iowa City|1920-1930|College presidents|Military officers|Hammill, John, 1875-1936","University of Iowa President Walter A. Jessup, second from left, facing camera.  Iowa Governor John Hammill on right wearing dark hat with arms behind him.","Kent, Frederick W. (Frederick Wallace), 1894-1984",,"The University of Iowa. Libraries. University Archives",1926-05-22|2008-04-09,,"Educational use only, no other permissions given. U.S. and international copyright laws may protect this digital object. Commercial use or distribution of the object is not permitted without prior permission of the copyright holder.","Iowa City Town and Campus Scenes|Frederick W. Kent collection of photographs, 1866-2000|http://www.lib.uiowa.edu/collguides/?RG30.0001.01|Prints|Colleges and departments|Military|Military|Scanned with Ricoh Aficio 3228C at 600 ppi, full color. Master images saved in tiff format.",8|14,,"Still image|Photographs|jpeg",RG30.0001.01|mil458.jpg|https://digital.lib.uiowa.edu/,,,,,,,,,,,,,,,,,,,,,,,,,,,,,,,,,,,,,,,,,,,,,,,,"<a href=""https://digital.lib.uiowa.edu/"" target=""_blank"">View this item in its source respository</a>",,,,,,,,,,,,,,,,,,,,,,,,,,,,,https://www.iowaheritage.org/files/original/7bcedbd124c1b5ed0f24ca0288f8c648.jpg,"Remote Item","Iowa City Town and Campus Scenes",1,0
