 




﻿"Item Id","Item URI","Dublin Core:Title","Dublin Core:Subject","Dublin Core:Description","Dublin Core:Creator","Dublin Core:Source","Dublin Core:Publisher","Dublin Core:Date","Dublin Core:Contributor","Dublin Core:Rights","Dublin Core:Relation","Dublin Core:Format","Dublin Core:Language","Dublin Core:Type","Dublin Core:Identifier","Dublin Core:Coverage","Item Type Metadata:Text","Item Type Metadata:Interviewer","Item Type Metadata:Interviewee","Item Type Metadata:Location","Item Type Metadata:Transcription","Item Type Metadata:Local URL","Item Type Metadata:Original Format","Item Type Metadata:Physical Dimensions","Item Type Metadata:Duration","Item Type Metadata:Compression","Item Type Metadata:Producer","Item Type Metadata:Director","Item Type Metadata:Bit Rate/Frequency","Item Type Metadata:Time Summary","Item Type Metadata:Email Body","Item Type Metadata:Subject Line","Item Type Metadata:From","Item Type Metadata:To","Item Type Metadata:CC","Item Type Metadata:BCC","Item Type Metadata:Number of Attachments","Item Type Metadata:Standards","Item Type Metadata:Objectives","Item Type Metadata:Materials","Item Type Metadata:Lesson Plan Text","Item Type Metadata:URL","Item Type Metadata:Event Type","Item Type Metadata:Participants","Item Type Metadata:Birth Date","Item Type Metadata:Birthplace","Item Type Metadata:Death Date","Item Type Metadata:Occupation","Item Type Metadata:Biographical Text","Item Type Metadata:Bibliography","Item Type Metadata:Digital Reproduction Information","Item Type Metadata:Repository","Item Type Metadata:Repository Collection","Item Type Metadata:Contact information.","Item Type Metadata:File Name","Item Type Metadata:Notes","Item Type Metadata:Digital item created","Item Type Metadata:Digital item modified","Item Type Metadata:Executive Orders","Item Type Metadata:Record Created","Item Type Metadata:Record Modified","Item Type Metadata:Transcription2","Item Type Metadata:Source URL","Omeka Legacy File:Additional Creator","Omeka Legacy File:Transcriber","Omeka Legacy File:Producer","Omeka Legacy File:Render Device","Omeka Legacy File:Render Details","Omeka Legacy File:Capture Date","Omeka Legacy File:Capture Device","Omeka Legacy File:Capture Details","Omeka Legacy File:Change History","Omeka Legacy File:Watermark","Omeka Legacy File:Encryption","Omeka Legacy File:Compression","Omeka Legacy File:Post Processing","Omeka Image File:Width","Omeka Image File:Height","Omeka Image File:Bit Depth","Omeka Image File:Channels","Omeka Image File:Exif String","Omeka Image File:Exif Array","Omeka Image File:IPTC String","Omeka Image File:IPTC Array","Omeka Video File:Bitrate","Omeka Video File:Duration","Omeka Video File:Sample Rate","Omeka Video File:Codec","Omeka Video File:Width","Omeka Video File:Height",tags,file,itemType,collection,public,featured
20113,https://www.iowaheritage.org/items/show/20113,"Friendship train picked up 22 carloads|Democrat (Bloomfield, Iowa)|Friendship train","Reconstruction (1939-1951) –- Iowa|United States -- Iowa|World War II|Friendship food train|Food relief, American –- Europe",,,,"State Historical Society of Iowa, Iowa City","1947-11-20|1941, 1942, 1943, 1944, 1945, 1946, 1947, 1948, 1949, 1950|2006-02-28",,"This digital image may be used for educational purposes, as long as it is not altered in any way. No commercial reproduction or distribution of this file is permitted without written permission of the State Historical Society of Iowa.","World War II Iowa Press Clippings","image/jpeg; Display image: 555,151 bytes|1 clipping : b&w ; 6 x 8 cm.",eng,"Text; Clippings",1947-11-20-4.jpg|173848404|https://digital.lib.uiowa.edu/,,,,,,,,,,,,,,,,,,,,,,,,,,,,,,,,,,,,,,,,,,,,,,,,"<a href=""https://digital.lib.uiowa.edu/"" target=""_blank"">View this item in its source respository</a>",,,,,,,,,,,,,,,,,,,,,,,,,,,,,https://www.iowaheritage.org/files/original/a1c280433f8c21212dd9c4d1ffc27585.jpg,"Remote Item","World War II Iowa Press Clippings",1,0
20111,https://www.iowaheritage.org/items/show/20111,"Friendship train visited Belle Plaine|Union (Belle Plaine, Iowa)|Friendship train","Reconstruction (1939-1951) –- Iowa|United States -- Iowa|World War II|Friendship food train|Food relief, American –- Europe","Image of Friendship train car.",,,"State Historical Society of Iowa, Iowa City","1947-11-20|1941, 1942, 1943, 1944, 1945, 1946, 1947, 1948, 1949, 1950|2006-02-28",,"This digital image may be used for educational purposes, as long as it is not altered in any way. No commercial reproduction or distribution of this file is permitted without written permission of the State Historical Society of Iowa.","World War II Iowa Press Clippings","image/jpeg; Display image: 524,366 bytes|1 clipping : b&w ; 14 x 11 cm.",eng,"Still Image; Text; Clippings",1947-11-20-3.jpg|173848404|https://digital.lib.uiowa.edu/,,,,,,,,,,,,,,,,,,,,,,,,,,,,,,,,,,,,,,,,,,,,,,,,"<a href=""https://digital.lib.uiowa.edu/"" target=""_blank"">View this item in its source respository</a>",,,,,,,,,,,,,,,,,,,,,,,,,,,,,https://www.iowaheritage.org/files/original/f80177d9c98d73daa7fa975972cce66e.jpg,"Remote Item","World War II Iowa Press Clippings",1,0
20099,https://www.iowaheritage.org/items/show/20099,"Many notables to be on food train in city|Times Republican (Marshalltown, Iowa)|Friendship train","Reconstruction (1939-1951) –- Iowa|United States -- Iowa -- Marshall County -- Marshalltown|World War II|Friendship food train|Food relief, American –- Europe",,,,"State Historical Society of Iowa, Iowa City","1947-11-08|1941, 1942, 1943, 1944, 1945, 1946, 1947, 1948, 1949, 1950|2006-02-24",,"This digital image may be used for educational purposes, as long as it is not altered in any way. No commercial reproduction or distribution of this file is permitted without written permission of the State Historical Society of Iowa.","World War II Iowa Press Clippings","image/jpeg; Display image: 442,092 bytes|1 clipping : b&w ; 19 x 11 cm.",eng,"Still Image; Text; Clippings",1947-11-08-4.jpg|173848404|https://digital.lib.uiowa.edu/,,,,,,,,,,,,,,,,,,,,,,,,,,,,,,,,,,,,,,,,,,,,,,,,"<a href=""https://digital.lib.uiowa.edu/"" target=""_blank"">View this item in its source respository</a>",,,,,,,,,,,,,,,,,,,,,,,,,,,,,https://www.iowaheritage.org/files/original/569cdf64a5e70c162a137b60e9e92980.jpg,"Remote Item","World War II Iowa Press Clippings",1,0
20096,https://www.iowaheritage.org/items/show/20096,"Contribute to friendship train drive|News (Newton, Iowa)|Friendship train","Reconstruction (1939-1951) –- Iowa|United States -- Iowa -- Jasper County -- Newton|World War II|Friendship food train|Food relief, American –- Europe",,,,"State Historical Society of Iowa, Iowa City","1947-11-08|1941, 1942, 1943, 1944, 1945, 1946, 1947, 1948, 1949, 1950|2006-02-24",,"This digital image may be used for educational purposes, as long as it is not altered in any way. No commercial reproduction or distribution of this file is permitted without written permission of the State Historical Society of Iowa.","World War II Iowa Press Clippings","image/jpeg; Display image: 435,615 bytes|1 clipping : b&w ; 26 x 5 cm.",eng,"Text; Clippings",1947-11-08-3.jpg|173848404|https://digital.lib.uiowa.edu/,,,,,,,,,,,,,,,,,,,,,,,,,,,,,,,,,,,,,,,,,,,,,,,,"<a href=""https://digital.lib.uiowa.edu/"" target=""_blank"">View this item in its source respository</a>",,,,,,,,,,,,,,,,,,,,,,,,,,,,,https://www.iowaheritage.org/files/original/da99b609f840a525843c62019699d032.jpg,"Remote Item","World War II Iowa Press Clippings",1,0
20094,https://www.iowaheritage.org/items/show/20094,"Minburn sends $1,200; workers report tonight|News Republican (Boone, Iowa)|Friendship train","Reconstruction (1939-1951) –- Iowa|United States -- Iowa -- Boone County -- Boone|World War II|Friendship food train|Food relief, American –- Europe",,,,"State Historical Society of Iowa, Iowa City","1947-11-08|1941, 1942, 1943, 1944, 1945, 1946, 1947, 1948, 1949, 1950|2006-02-24",,"This digital image may be used for educational purposes, as long as it is not altered in any way. No commercial reproduction or distribution of this file is permitted without written permission of the State Historical Society of Iowa.","World War II Iowa Press Clippings","image/jpeg;  Display image: 406,294 bytes|1 clipping : b&w ; 22 x 12 cm.",eng,"Text; Clippings",1947-11-08-2.jpg|173848404|https://digital.lib.uiowa.edu/,,,,,,,,,,,,,,,,,,,,,,,,,,,,,,,,,,,,,,,,,,,,,,,,"<a href=""https://digital.lib.uiowa.edu/"" target=""_blank"">View this item in its source respository</a>",,,,,,,,,,,,,,,,,,,,,,,,,,,,,https://www.iowaheritage.org/files/original/71c8f5568d0d225a5a440d99146fd510.jpg,"Remote Item","World War II Iowa Press Clippings",1,0
20092,https://www.iowaheritage.org/items/show/20092,"Friendship food train leaves Hollywood amid celebrations; is due here Wednesday|Nonpareil (Council Bluffs, Iowa)|Friendship train","Reconstruction (1939-1951) –- Iowa|United States -- Iowa -- Pottawattamie County -- Council Bluffs|World War II|Friendship food train|Food relief, American –- Europe",,,,"State Historical Society of Iowa, Iowa City","1947-11-08|1941, 1942, 1943, 1944, 1945, 1946, 1947, 1948, 1949, 1950|2006-02-24",,"This digital image may be used for educational purposes, as long as it is not altered in any way. No commercial reproduction or distribution of this file is permitted without written permission of the State Historical Society of Iowa.","World War II Iowa Press Clippings","image/jpeg; Display image: 400,605 bytes|1 clipping : b&w ; 19 x 16 cm.",eng,"Text; Clippings",1947-11-08.jpg|173848404|https://digital.lib.uiowa.edu/,,,,,,,,,,,,,,,,,,,,,,,,,,,,,,,,,,,,,,,,,,,,,,,,"<a href=""https://digital.lib.uiowa.edu/"" target=""_blank"">View this item in its source respository</a>",,,,,,,,,,,,,,,,,,,,,,,,,,,,,https://www.iowaheritage.org/files/original/45716d27dd9e391e855968a4342ccf1e.jpg,"Remote Item","World War II Iowa Press Clippings",1,0
20090,https://www.iowaheritage.org/items/show/20090,"Trucks start milk pickup for Europe|Evening Tribune (Des Moines, Iowa)|Friendship train","Reconstruction (1939-1951) –- Iowa|United States -- Iowa -- Polk County -- Des Moines|World War II|Friendship food train|Food relief, American –- Europe",,,,"State Historical Society of Iowa, Iowa City","1947-11-07|1941, 1942, 1943, 1944, 1945, 1946, 1947, 1948, 1949, 1950|2006-02-24",,"This digital image may be used for educational purposes, as long as it is not altered in any way. No commercial reproduction or distribution of this file is permitted without written permission of the State Historical Society of Iowa.","World War II Iowa Press Clippings","image/jpeg; Display image: 359,812bytes|1 clipping : b&w ; 24 x 11 cm.",eng,"Text; Clippings",1947-11-07-9.jpg|173848404|https://digital.lib.uiowa.edu/,,,,,,,,,,,,,,,,,,,,,,,,,,,,,,,,,,,,,,,,,,,,,,,,"<a href=""https://digital.lib.uiowa.edu/"" target=""_blank"">View this item in its source respository</a>",,,,,,,,,,,,,,,,,,,,,,,,,,,,,https://www.iowaheritage.org/files/original/10064318cf5d2e769a284cdfb1052fc1.jpg,"Remote Item","World War II Iowa Press Clippings",1,0
20088,https://www.iowaheritage.org/items/show/20088,"Meeting to discuss ""friendship train"" called tonight|Journal (Nevada, Iowa)|Friendship train","Reconstruction (1939-1951) –- Iowa|World War II|Friendship food train|Food relief, American –- Europe",,,,"State Historical Society of Iowa, Iowa City","1947-11-06|1941, 1942, 1943, 1944, 1945, 1946, 1947, 1948, 1949, 1950|2006-02-22",,"This digital image may be used for educational purposes, as long as it is not altered in any way. No commercial reproduction or distribution of this file is permitted without written permission of the State Historical Society of Iowa.","World War II Iowa Press Clippings","image/jpeg; Display image: 369,546 bytes|1 clipping : b&w ; 22 x 6 cm.",eng,"Text; Clippings",1947-11-06-8.jpg|173848404|https://digital.lib.uiowa.edu/,,,,,,,,,,,,,,,,,,,,,,,,,,,,,,,,,,,,,,,,,,,,,,,,"<a href=""https://digital.lib.uiowa.edu/"" target=""_blank"">View this item in its source respository</a>",,,,,,,,,,,,,,,,,,,,,,,,,,,,,https://www.iowaheritage.org/files/original/8b969483f0ffc7b102ca11358d91d79d.jpg,"Remote Item","World War II Iowa Press Clippings",1,0
20085,https://www.iowaheritage.org/items/show/20085,"Clinton schools to cooperate on friendship train|Herald (Clinton, Iowa)|Friendship train","Reconstruction (1939-1951) –- Iowa|United States -- Iowa -- Clinton County -- Clinton|World War II|Friendship food train|Food relief, American –- Europe",,,,"State Historical Society of Iowa, Iowa City","1947-11-06|1941, 1942, 1943, 1944, 1945, 1946, 1947, 1948, 1949, 1950|2006-02-22",,"This digital image may be used for educational purposes, as long as it is not altered in any way. No commercial reproduction or distribution of this file is permitted without written permission of the State Historical Society of Iowa.","World War II Iowa Press Clippings","image/jpeg; Display image: 351,841 bytes|1 clipping : b&w ; 9 x 5 cm.",eng,"Text; Clippings",1947-11-06-6.jpg|173848404|https://digital.lib.uiowa.edu/,,,,,,,,,,,,,,,,,,,,,,,,,,,,,,,,,,,,,,,,,,,,,,,,"<a href=""https://digital.lib.uiowa.edu/"" target=""_blank"">View this item in its source respository</a>",,,,,,,,,,,,,,,,,,,,,,,,,,,,,https://www.iowaheritage.org/files/original/37b2c33d50d028ef73789f89feb833bb.jpg,"Remote Item","World War II Iowa Press Clippings",1,0
20084,https://www.iowaheritage.org/items/show/20084,"Sponsor tag day in effort to raise $4, 500 needed to buy wheat for friendship train|Nonpareil (Council Bluffs, Iowa)|Friendship train","Reconstruction (1939-1951) –- Iowa|United States -- Iowa -- Pottawattamie County -- Council Bluffs|World War II|Friendship food train|Food relief, American –- Europe",,,,"State Historical Society of Iowa, Iowa City","1947-11-06|1941, 1942, 1943, 1944, 1945, 1946, 1947, 1948, 1949, 1950|2006-02-22",,"This digital image may be used for educational purposes, as long as it is not altered in any way. No commercial reproduction or distribution of this file is permitted without written permission of the State Historical Society of Iowa.","World War II Iowa Press Clippings","image/jpeg; Display image: 819,587 bytes|1 clipping : b&w ; 12 x 16 cm.",eng,"Text; Clippings",1947-11-06-4.jpg|173848404|https://digital.lib.uiowa.edu/,,,,,,,,,,,,,,,,,,,,,,,,,,,,,,,,,,,,,,,,,,,,,,,,"<a href=""https://digital.lib.uiowa.edu/"" target=""_blank"">View this item in its source respository</a>",,,,,,,,,,,,,,,,,,,,,,,,,,,,,https://www.iowaheritage.org/files/original/b7c93012b2a58a17b798bfdefaf1802e.jpg,"Remote Item","World War II Iowa Press Clippings",1,0
