 




﻿"Item Id","Item URI","Dublin Core:Title","Dublin Core:Subject","Dublin Core:Description","Dublin Core:Creator","Dublin Core:Source","Dublin Core:Publisher","Dublin Core:Date","Dublin Core:Contributor","Dublin Core:Rights","Dublin Core:Relation","Dublin Core:Format","Dublin Core:Language","Dublin Core:Type","Dublin Core:Identifier","Dublin Core:Coverage","Item Type Metadata:Text","Item Type Metadata:Interviewer","Item Type Metadata:Interviewee","Item Type Metadata:Location","Item Type Metadata:Transcription","Item Type Metadata:Local URL","Item Type Metadata:Original Format","Item Type Metadata:Physical Dimensions","Item Type Metadata:Duration","Item Type Metadata:Compression","Item Type Metadata:Producer","Item Type Metadata:Director","Item Type Metadata:Bit Rate/Frequency","Item Type Metadata:Time Summary","Item Type Metadata:Email Body","Item Type Metadata:Subject Line","Item Type Metadata:From","Item Type Metadata:To","Item Type Metadata:CC","Item Type Metadata:BCC","Item Type Metadata:Number of Attachments","Item Type Metadata:Standards","Item Type Metadata:Objectives","Item Type Metadata:Materials","Item Type Metadata:Lesson Plan Text","Item Type Metadata:URL","Item Type Metadata:Event Type","Item Type Metadata:Participants","Item Type Metadata:Birth Date","Item Type Metadata:Birthplace","Item Type Metadata:Death Date","Item Type Metadata:Occupation","Item Type Metadata:Biographical Text","Item Type Metadata:Bibliography","Item Type Metadata:Digital Reproduction Information","Item Type Metadata:Repository","Item Type Metadata:Repository Collection","Item Type Metadata:Contact information.","Item Type Metadata:File Name","Item Type Metadata:Notes","Item Type Metadata:Digital item created","Item Type Metadata:Digital item modified","Item Type Metadata:Executive Orders","Item Type Metadata:Record Created","Item Type Metadata:Record Modified","Item Type Metadata:Transcription2","Item Type Metadata:Source URL","Omeka Legacy File:Additional Creator","Omeka Legacy File:Transcriber","Omeka Legacy File:Producer","Omeka Legacy File:Render Device","Omeka Legacy File:Render Details","Omeka Legacy File:Capture Date","Omeka Legacy File:Capture Device","Omeka Legacy File:Capture Details","Omeka Legacy File:Change History","Omeka Legacy File:Watermark","Omeka Legacy File:Encryption","Omeka Legacy File:Compression","Omeka Legacy File:Post Processing","Omeka Image File:Width","Omeka Image File:Height","Omeka Image File:Bit Depth","Omeka Image File:Channels","Omeka Image File:Exif String","Omeka Image File:Exif Array","Omeka Image File:IPTC String","Omeka Image File:IPTC Array","Omeka Video File:Bitrate","Omeka Video File:Duration","Omeka Video File:Sample Rate","Omeka Video File:Codec","Omeka Video File:Width","Omeka Video File:Height",tags,file,itemType,collection,public,featured
10035,https://www.iowaheritage.org/items/show/10035,"Person walking betwen buildings, Yamagishi Kai commune, Mie-ken, Japan, 1965","People|Japanese|Yamagishi Kai|Japan -- Mieken|1960-1970|Collective settlements|Collective farms",,"Plath, David W.",,"University of Iowa. Libraries. University Archives",1965|2008-03-03,,"Educational use only, no other permissions given. U.S. and international copyright laws may protect this item. Commercial use or distribution of this digital object is not permitted without written permission of the University Archives at The University of Iowa Libraries.","Anthropology at Iowa Digital Collection|David Plath Japanese Fieldwork Collection|David Plath Papers|In process",,,"Still image|Photographs|jpeg",YK02.jpg|https://digital.lib.uiowa.edu/,,,,,,,,,,,,,,,,,,,,,,,,,,,,,,,,,,,,,,,,,,,,,,,,"<a href=""https://digital.lib.uiowa.edu/"" target=""_blank"">View this item in its source respository</a>",,,,,,,,,,,,,,,,,,,,,,,,,,,,,https://www.iowaheritage.org/files/original/93a4efb4eb2330d12c99eb9733b4e6e5.jpg,"Remote Item","African American Women in Iowa Collection",1,0
10040,https://www.iowaheritage.org/items/show/10040,"Pro-commune visual aid used in preaching, Yamagishi Kai commune, Mie-ken, Japan, 1965","Collective settlements|Japanese|Yamagishi Kai|Japan -- Mieken|1960-1970|Collective farms|Propaganda","""Path from capitalism [right] to the plum-blossom paradise [left]: visual aid used in preaching""--Notes from D. Plath.","Plath, David W.",,"University of Iowa. Libraries. University Archives",1965|2008-03-03,,"Educational use only, no other permissions given. U.S. and international copyright laws may protect this item. Commercial use or distribution of this digital object is not permitted without written permission of the University Archives at The University of Iowa Libraries.","Anthropology at Iowa Digital Collection|David Plath Japanese Fieldwork Collection|David Plath Papers|In process",,,"Still image|Photographs|jpeg",YK08.jpg|https://digital.lib.uiowa.edu/,,,,,,,,,,,,,,,,,,,,,,,,,,,,,,,,,,,,,,,,,,,,,,,,"<a href=""https://digital.lib.uiowa.edu/"" target=""_blank"">View this item in its source respository</a>",,,,,,,,,,,,,,,,,,,,,,,,,,,,,https://www.iowaheritage.org/files/original/3312983090f2af1bb57c936d8098c1b1.jpg,"Remote Item","African American Women in Iowa Collection",1,0
10010,https://www.iowaheritage.org/items/show/10010,"Processing chichen manure for sale as fertilizer, Atarashiki Mura commune, Saitama-ken, Japan, 1965","Men|Japanese|Atarashiki Mura|Japan -- Hyuga|1960-1970|People|Collective settlements|Collective farms|Furnaces",,"Plath, David W.",,"University of Iowa. Libraries. University Archives",1965|2008-03-03,,"Educational use only, no other permissions given. U.S. and international copyright laws may protect this item. Commercial use or distribution of this digital object is not permitted without written permission of the University Archives at The University of Iowa Libraries.","Anthropology at Iowa Digital Collection|David Plath Japanese Fieldwork Collection|David Plath Papers|In process",,,"Still image|Photographs|jpeg",AM10.jpg|https://digital.lib.uiowa.edu/,,,,,,,,,,,,,,,,,,,,,,,,,,,,,,,,,,,,,,,,,,,,,,,,"<a href=""https://digital.lib.uiowa.edu/"" target=""_blank"">View this item in its source respository</a>",,,,,,,,,,,,,,,,,,,,,,,,,,,,,https://www.iowaheritage.org/files/original/6e66ee3b0e55275e65a8f9f20ab3ab77.jpg,"Remote Item","African American Women in Iowa Collection",1,0
10100,https://www.iowaheritage.org/items/show/10100,"Processing chicken manure for sale as fertilizer, Atarashiki Mura commune, Saitama-ken, Japan, 1965","Collective settlements|Japanese|Atarashiki Mura|Japan -- Saitama-ken|1960-1970|Collective farms|Men|People|Fertilizer industry",,"Plath, David W.",,"University of Iowa. Libraries. University Archives",1965,,"Educational use only, no other permissions given. U.S. and international copyright laws may protect this item. Commercial use or distribution of this digital object is not permitted without written permission of the University Archives at The University of Iowa Libraries.","Anthropology at Iowa Digital Collection|David Plath Japanese Fieldwork Collection|David Plath Papers",5|5,,"Still image|Color slides|jpeg",PLA-slide052.jpg|https://digital.lib.uiowa.edu/,,,,,,,,,,,,,,,,,,,,,,,,,,,,,,,,,,,,,,,,,,,,,,,,"<a href=""https://digital.lib.uiowa.edu/"" target=""_blank"">View this item in its source respository</a>",,,,,,,,,,,,,,,,,,,,,,,,,,,,,https://www.iowaheritage.org/files/original/f3f4b111bd46d1ddd46e7cbb8545ebfc.jpg,"Remote Item","African American Women in Iowa Collection",1,0
10101,https://www.iowaheritage.org/items/show/10101,"Processing chicken manure for sale as fertilizer, Atarashiki Mura commune, Saitama-ken, Japan, 1965","Collective settlements|Japanese|Atarashiki Mura|Japan -- Saitama-ken|1960-1970|Collective farms|Men|People|Fertilizer industry",,"Plath, David W.",,"University of Iowa. Libraries. University Archives",1965,,"Educational use only, no other permissions given. U.S. and international copyright laws may protect this item. Commercial use or distribution of this digital object is not permitted without written permission of the University Archives at The University of Iowa Libraries.","Anthropology at Iowa Digital Collection|David Plath Japanese Fieldwork Collection|David Plath Papers",5|5,,"Still image|Color slides|jpeg",PLA-slide053.jpg|https://digital.lib.uiowa.edu/,,,,,,,,,,,,,,,,,,,,,,,,,,,,,,,,,,,,,,,,,,,,,,,,"<a href=""https://digital.lib.uiowa.edu/"" target=""_blank"">View this item in its source respository</a>",,,,,,,,,,,,,,,,,,,,,,,,,,,,,https://www.iowaheritage.org/files/original/24c6ba7028602382efdd7661e53ed0b0.jpg,"Remote Item","African American Women in Iowa Collection",1,0
10102,https://www.iowaheritage.org/items/show/10102,"Processing chicken manure for sale as fertilizer, Atarashiki Mura commune, Saitama-ken, Japan, 1965","Collective settlements|Japanese|Atarashiki Mura|Japan -- Saitama-ken|1960-1970|Collective farms|Men|People|Fertilizer industry",,"Plath, David W.",,"University of Iowa. Libraries. University Archives",1965,,"Educational use only, no other permissions given. U.S. and international copyright laws may protect this item. Commercial use or distribution of this digital object is not permitted without written permission of the University Archives at The University of Iowa Libraries.","Anthropology at Iowa Digital Collection|David Plath Japanese Fieldwork Collection|David Plath Papers",5|5,,"Still image|Color slides|jpeg",PLA-slide054.jpg|https://digital.lib.uiowa.edu/,,,,,,,,,,,,,,,,,,,,,,,,,,,,,,,,,,,,,,,,,,,,,,,,"<a href=""https://digital.lib.uiowa.edu/"" target=""_blank"">View this item in its source respository</a>",,,,,,,,,,,,,,,,,,,,,,,,,,,,,https://www.iowaheritage.org/files/original/454413eb91ef715b372580091c9a882a.jpg,"Remote Item","African American Women in Iowa Collection",1,0
10129,https://www.iowaheritage.org/items/show/10129,"Prof. David Plath with Prof. Kusakari Zenzo of Hokkaido Kyoiku Daigaku and Yamagishi Kai members, Yamagishi Kai ""Pioneer Farm"", Hokkaido, Japan, 1965","Collective settlements|Japanese|Plath, David W.|Yamagishi Kai|Japan -- Hokkaido|1960-1970|Collective farms|People|Kusakari, Zenzo, 1914-",,"Plath, David W.",,"University of Iowa. Libraries. University Archives",1965,,"Educational use only, no other permissions given. U.S. and international copyright laws may protect this item. Commercial use or distribution of this digital object is not permitted without written permission of the University Archives at The University of Iowa Libraries.","Anthropology at Iowa Digital Collection|David Plath Japanese Fieldwork Collection|David Plath Papers",5|5,,"Still image|Color slides|jpeg",PLA-slide081.jpg|https://digital.lib.uiowa.edu/,,,,,,,,,,,,,,,,,,,,,,,,,,,,,,,,,,,,,,,,,,,,,,,,"<a href=""https://digital.lib.uiowa.edu/"" target=""_blank"">View this item in its source respository</a>",,,,,,,,,,,,,,,,,,,,,,,,,,,,,https://www.iowaheritage.org/files/original/2852d3346094afab84ebe1fd1a79e897.jpg,"Remote Item","African American Women in Iowa Collection",1,0
10096,https://www.iowaheritage.org/items/show/10096,"Raising cows, Atarashiki Mura commune, Saitama-ken, Japan, 1965","Collective settlements|Japanese|Atarashiki Mura|Japan -- Saitama-ken|1960-1970|Collective farms|Cows",,"Plath, David W.",,"University of Iowa. Libraries. University Archives",1965,,"Educational use only, no other permissions given. U.S. and international copyright laws may protect this item. Commercial use or distribution of this digital object is not permitted without written permission of the University Archives at The University of Iowa Libraries.","Anthropology at Iowa Digital Collection|David Plath Japanese Fieldwork Collection|David Plath Papers",5|5,,"Still image|Color slides|jpeg",PLA-slide048.jpg|https://digital.lib.uiowa.edu/,,,,,,,,,,,,,,,,,,,,,,,,,,,,,,,,,,,,,,,,,,,,,,,,"<a href=""https://digital.lib.uiowa.edu/"" target=""_blank"">View this item in its source respository</a>",,,,,,,,,,,,,,,,,,,,,,,,,,,,,https://www.iowaheritage.org/files/original/12f226d2c970809f72fb3784467b2c0d.jpg,"Remote Item","African American Women in Iowa Collection",1,0
10056,https://www.iowaheritage.org/items/show/10056,"Rare bird zoo, Yamagishi Kai, Mie-ken, Japan, 1965","Collective settlements|Japanese|Yamagishi Kai|Japan -- Mie-ken|1960-1970|Collective farms|Men|People|Aviaries|Birds",,"Plath, David W.",,"University of Iowa. Libraries. University Archives",1965,,"Educational use only, no other permissions given. U.S. and international copyright laws may protect this item. Commercial use or distribution of this digital object is not permitted without written permission of the University Archives at The University of Iowa Libraries.","Anthropology at Iowa Digital Collection|David Plath Japanese Fieldwork Collection|David Plath Papers",5|5,,"Still image|Color slides|jpeg",https://digital.lib.uiowa.edu/,,,,,,,,,,,,,,,,,,,,,,,,,,,,,,,,,,,,,,,,,,,,,,,,"<a href=""https://digital.lib.uiowa.edu/"" target=""_blank"">View this item in its source respository</a>",,,,,,,,,,,,,,,,,,,,,,,,,,,,,https://www.iowaheritage.org/files/original/efe8032157895ba54becd951fcccba9d.jpg,"Remote Item","African American Women in Iowa Collection",1,0
9982,https://www.iowaheritage.org/items/show/9982,"Recreation and fire prevention pond, Shinkyo commune, Nara-ken, Japan, 1968","People|Japanese|Shinkyo|Japan -- Nara-ken|1960-1970|Collective settlements|Collective farms","Original artwork, reproduced as illustrations for: Sugihara, Yoshie and David W. Plath. Sensei and his people. (Berkeley, Calif.: University of California Press, 1969). P. 166.","Mizota, Kotoe",,"University of Iowa. Libraries. University Archives",1968|2008-03-03,,"Educational use only, no other permissions given. U.S. and international copyright laws may protect this item. Commercial use or distribution of this digital object is not permitted without written permission of the University Archives at The University of Iowa Libraries.","Anthropology at Iowa Digital Collection|David Plath Japanese Fieldwork Collection|David Plath Papers|In process",,,"Still image|Drawings (Visual works); Illustrations (Layout features); Pen-and-wash drawings|jpeg",https://digital.lib.uiowa.edu/,,,,,,,,,,,,,,,,,,,,,,,,,,,,,,,,,,,,,,,,,,,,,,,,"<a href=""https://digital.lib.uiowa.edu/"" target=""_blank"">View this item in its source respository</a>",,,,,,,,,,,,,,,,,,,,,,,,,,,,,https://www.iowaheritage.org/files/original/d11e63609943f4c0e676e1c8c03a23ef.jpg,"Remote Item","African American Women in Iowa Collection",1,0
