 




﻿"Item Id","Item URI","Dublin Core:Title","Dublin Core:Subject","Dublin Core:Description","Dublin Core:Creator","Dublin Core:Source","Dublin Core:Publisher","Dublin Core:Date","Dublin Core:Contributor","Dublin Core:Rights","Dublin Core:Relation","Dublin Core:Format","Dublin Core:Language","Dublin Core:Type","Dublin Core:Identifier","Dublin Core:Coverage","Item Type Metadata:Text","Item Type Metadata:Interviewer","Item Type Metadata:Interviewee","Item Type Metadata:Location","Item Type Metadata:Transcription","Item Type Metadata:Local URL","Item Type Metadata:Original Format","Item Type Metadata:Physical Dimensions","Item Type Metadata:Duration","Item Type Metadata:Compression","Item Type Metadata:Producer","Item Type Metadata:Director","Item Type Metadata:Bit Rate/Frequency","Item Type Metadata:Time Summary","Item Type Metadata:Email Body","Item Type Metadata:Subject Line","Item Type Metadata:From","Item Type Metadata:To","Item Type Metadata:CC","Item Type Metadata:BCC","Item Type Metadata:Number of Attachments","Item Type Metadata:Standards","Item Type Metadata:Objectives","Item Type Metadata:Materials","Item Type Metadata:Lesson Plan Text","Item Type Metadata:URL","Item Type Metadata:Event Type","Item Type Metadata:Participants","Item Type Metadata:Birth Date","Item Type Metadata:Birthplace","Item Type Metadata:Death Date","Item Type Metadata:Occupation","Item Type Metadata:Biographical Text","Item Type Metadata:Bibliography","Item Type Metadata:Digital Reproduction Information","Item Type Metadata:Repository","Item Type Metadata:Repository Collection","Item Type Metadata:Contact information.","Item Type Metadata:File Name","Item Type Metadata:Notes","Item Type Metadata:Digital item created","Item Type Metadata:Digital item modified","Item Type Metadata:Executive Orders","Item Type Metadata:Record Created","Item Type Metadata:Record Modified","Item Type Metadata:Transcription2","Item Type Metadata:Source URL","Omeka Legacy File:Additional Creator","Omeka Legacy File:Transcriber","Omeka Legacy File:Producer","Omeka Legacy File:Render Device","Omeka Legacy File:Render Details","Omeka Legacy File:Capture Date","Omeka Legacy File:Capture Device","Omeka Legacy File:Capture Details","Omeka Legacy File:Change History","Omeka Legacy File:Watermark","Omeka Legacy File:Encryption","Omeka Legacy File:Compression","Omeka Legacy File:Post Processing","Omeka Image File:Width","Omeka Image File:Height","Omeka Image File:Bit Depth","Omeka Image File:Channels","Omeka Image File:Exif String","Omeka Image File:Exif Array","Omeka Image File:IPTC String","Omeka Image File:IPTC Array","Omeka Video File:Bitrate","Omeka Video File:Duration","Omeka Video File:Sample Rate","Omeka Video File:Codec","Omeka Video File:Width","Omeka Video File:Height",tags,file,itemType,collection,public,featured
64315,http://www.iowaheritage.org/items/show/64315,"Welcome to the G-8 Summit's global food crisis banquet. I hope everyone enjoyed the roasted lamb with black truffles","Summit meetings|Japan|Banquets|2000-2010|Heads of state|Starvation|Food supply|Food|Hypocrisy|Hypocrites|Leadership|Power|Feasts|Men|Women|People, Rich|People|Children|Starvation|Windows|Wine",,"Duffy, Brian, 1955-",,"University of Iowa. Libraries. Special Collections Dept.",2008-07-09|2011-04,,"Educational use only, no other permissions given. Copyright to this digital object is owned by The Des Moines Register; it may not be downloaded, reproduced, or distributed without written permission. For more information, contact the Special Collections Department.","Editorial Cartoons of Brian Duffy; Des Moines Register Cartoonists|Papers of Brian Duffy|Des Moines Register",,English,"Still image|Editorial cartoons",MSC916|duffy-080709|http://digital.lib.uiowa.edu/cdm/ref/collection/duffy/id/153,,,,,,,,,,,,,,,,,,,,,,,,,,,,,,,,,,,,,,,,,,,,,,,,"<a href=""http://digital.lib.uiowa.edu/cdm/ref/collection/duffy/id/153"" target=""_blank"">View this item in its source respository</a>",,,,,,,,,,,,,,,,,,,,,,,,,,,,,http://www.iowaheritage.org/files/original/32317458f81b7a4bb06c0923f8c0efe2.jpg,"Remote Item","Editorial Cartoons of Brian Duffy",1,0
64280,http://www.iowaheritage.org/items/show/64280,"I want to do my part to pay for my education. Gimme a pack of Marlboros","Cigarettes|Iowa|Men|2000-2010|Tobacco|Tobacco industry|Taxes|Taxation|Sales taxes|Children|Cigarettes|Signs|Stores|Counters|Baggage and bundles","We check IDs","Duffy, Brian, 1955-",,"University of Iowa. Libraries. Special Collections Dept.",2004-01-15|2011-04,,"Educational use only, no other permissions given. Copyright to this digital object is owned by The Des Moines Register; it may not be downloaded, reproduced, or distributed without written permission. For more information, contact the Special Collections Department.","Editorial Cartoons of Brian Duffy; Des Moines Register Cartoonists|Papers of Brian Duffy|Des Moines Register",,English,"Still image|Editorial cartoons",MSC916|duffy-040115|http://digital.lib.uiowa.edu/cdm/ref/collection/duffy/id/118,,,,,,,,,,,,,,,,,,,,,,,,,,,,,,,,,,,,,,,,,,,,,,,,"<a href=""http://digital.lib.uiowa.edu/cdm/ref/collection/duffy/id/118"" target=""_blank"">View this item in its source respository</a>",,,,,,,,,,,,,,,,,,,,,,,,,,,,,http://www.iowaheritage.org/files/original/f62820fcbc0024d72ef7a6a64a09e8b3.jpg,"Remote Item","Editorial Cartoons of Brian Duffy",1,0
64266,http://www.iowaheritage.org/items/show/64266,"It helps speed up the process","Security|United States|Men|2000-2010|Airplanes|Airport terminals|Security checkpoints|Terrorism|Frisking|Women|Children|Airplanes|Airport terminals|Security checkpoints|Luggage|Shoes","Airport security","Duffy, Brian, 1955-",,"University of Iowa. Libraries. Special Collections Dept.",2003-12-19|2011-04,,"Educational use only, no other permissions given. Copyright to this digital object is owned by The Des Moines Register; it may not be downloaded, reproduced, or distributed without written permission. For more information, contact the Special Collections Department.","Editorial Cartoons of Brian Duffy; Des Moines Register Cartoonists|Papers of Brian Duffy|Des Moines Register",,English,"Still image|Editorial cartoons",MSC916|duffy-031219|http://digital.lib.uiowa.edu/cdm/ref/collection/duffy/id/104,,,,,,,,,,,,,,,,,,,,,,,,,,,,,,,,,,,,,,,,,,,,,,,,"<a href=""http://digital.lib.uiowa.edu/cdm/ref/collection/duffy/id/104"" target=""_blank"">View this item in its source respository</a>",,,,,,,,,,,,,,,,,,,,,,,,,,,,,http://www.iowaheritage.org/files/original/16fc91b2d63ccb878cd4404f3fb1d8fc.jpg,"Remote Item","Editorial Cartoons of Brian Duffy",1,0
64244,http://www.iowaheritage.org/items/show/64244,"Health news-- Coca Cola to fund pediatric dental research","Corporations|Dentists|2000-2010|Children|Health care|Dentistry|Patients|Boys|Teeth","How do the dentures feel?","Duffy, Brian, 1955-",,"University of Iowa. Libraries. Special Collections Dept.",2003-03-06|2011-04,,"Educational use only, no other permissions given. Copyright to this digital object is owned by The Des Moines Register; it may not be downloaded, reproduced, or distributed without written permission. For more information, contact the Special Collections Department.","Editorial Cartoons of Brian Duffy; Des Moines Register Cartoonists|Papers of Brian Duffy|Des Moines Register",,English,"Still image|Editorial cartoons",MSC916|duffy-030306|http://digital.lib.uiowa.edu/cdm/ref/collection/duffy/id/82,,,,,,,,,,,,,,,,,,,,,,,,,,,,,,,,,,,,,,,,,,,,,,,,"<a href=""http://digital.lib.uiowa.edu/cdm/ref/collection/duffy/id/82"" target=""_blank"">View this item in its source respository</a>",,,,,,,,,,,,,,,,,,,,,,,,,,,,,http://www.iowaheritage.org/files/original/532d2bccec424689342475ffdd019a32.jpg,"Remote Item","Editorial Cartoons of Brian Duffy",1,0
64241,http://www.iowaheritage.org/items/show/64241,"He's coming, I hear the trolley","Children|Rogers, Fred|Angels|2000-2010|Television programs for children|Actors|Sweaters|Shoes|Clouds","Mister Rogers (1928-2003)","Duffy, Brian, 1955-",,"University of Iowa. Libraries. Special Collections Dept.",2003-03-02|2011-04,,"Educational use only, no other permissions given. Copyright to this digital object is owned by The Des Moines Register; it may not be downloaded, reproduced, or distributed without written permission. For more information, contact the Special Collections Department.","Editorial Cartoons of Brian Duffy; Des Moines Register Cartoonists|Papers of Brian Duffy|Des Moines Register",,English,"Still image|Editorial cartoons",MSC916|duffy-030302|http://digital.lib.uiowa.edu/cdm/ref/collection/duffy/id/79,,,,,,,,,,,,,,,,,,,,,,,,,,,,,,,,,,,,,,,,,,,,,,,,"<a href=""http://digital.lib.uiowa.edu/cdm/ref/collection/duffy/id/79"" target=""_blank"">View this item in its source respository</a>",,,,,,,,,,,,,,,,,,,,,,,,,,,,,http://www.iowaheritage.org/files/original/8c51d84267c14a42080133d433a02d05.jpg,"Remote Item","Editorial Cartoons of Brian Duffy",1,0
64235,http://www.iowaheritage.org/items/show/64235,"You can have your Halloween candy back as soon as we run it through an x-ray machine and get the samples back from the toxicology lab","Children|United States|Halloween|2000-2010|Parenthood|Safety|Fear|Bioterrorism|Costumes|Children|Witches|Mothers|Clocks",,"Duffy, Brian, 1955-",,"University of Iowa. Libraries. Special Collections Dept.",2001-10-23|2011-04,,"Educational use only, no other permissions given. Copyright to this digital object is owned by The Des Moines Register; it may not be downloaded, reproduced, or distributed without written permission. For more information, contact the Special Collections Department.","Editorial Cartoons of Brian Duffy; Des Moines Register Cartoonists|Papers of Brian Duffy|Des Moines Register",,English,"Still image|Editorial cartoons",MSC916|duffy-011023|http://digital.lib.uiowa.edu/cdm/ref/collection/duffy/id/73,,,,,,,,,,,,,,,,,,,,,,,,,,,,,,,,,,,,,,,,,,,,,,,,"<a href=""http://digital.lib.uiowa.edu/cdm/ref/collection/duffy/id/73"" target=""_blank"">View this item in its source respository</a>",,,,,,,,,,,,,,,,,,,,,,,,,,,,,http://www.iowaheritage.org/files/original/f51572265e6748714c31f154a5c92785.jpg,"Remote Item","Editorial Cartoons of Brian Duffy",1,0
64234,http://www.iowaheritage.org/items/show/64234,"It is going to be a great weekend with the fall colors at their peak, so get out and enjoy it","Stockpiles|United States|Boxes|2000-2010|Emergency food supply|Fear|Terrorism|Cans|Men|Children|Barrels|Televisions|Light|Basements|Gas masks","Cipro; Batteries; Candles; Spam","Duffy, Brian, 1955-",,"University of Iowa. Libraries. Special Collections Dept.",2001-10-21|2011-04,,"Educational use only, no other permissions given. Copyright to this digital object is owned by The Des Moines Register; it may not be downloaded, reproduced, or distributed without written permission. For more information, contact the Special Collections Department.","Editorial Cartoons of Brian Duffy; Des Moines Register Cartoonists|Papers of Brian Duffy|Des Moines Register",,English,"Still image|Editorial cartoons",MSC916|duffy-011021|http://digital.lib.uiowa.edu/cdm/ref/collection/duffy/id/72,,,,,,,,,,,,,,,,,,,,,,,,,,,,,,,,,,,,,,,,,,,,,,,,"<a href=""http://digital.lib.uiowa.edu/cdm/ref/collection/duffy/id/72"" target=""_blank"">View this item in its source respository</a>",,,,,,,,,,,,,,,,,,,,,,,,,,,,,http://www.iowaheritage.org/files/original/5b97c594fd8c07138d45cbea2e465d18.jpg,"Remote Item","Editorial Cartoons of Brian Duffy",1,0
64232,http://www.iowaheritage.org/items/show/64232,"I know I speak for the entire student body when I say, we'd be willing to accept layoffs","School|Students|2000-2010|School children|School boards|Education|Education and state|Budgets|Dismissal of employees|Children|School children|Schoolrooms|Teachers|Blackboards","School officials","Duffy, Brian, 1955-",,"University of Iowa. Libraries. Special Collections Dept.",2001-10-18|2011-04,,"Educational use only, no other permissions given. Copyright to this digital object is owned by The Des Moines Register; it may not be downloaded, reproduced, or distributed without written permission. For more information, contact the Special Collections Department.","Editorial Cartoons of Brian Duffy; Des Moines Register Cartoonists|Papers of Brian Duffy|Des Moines Register",,English,"Still image|Editorial cartoons",MSC916|duffy-011018|http://digital.lib.uiowa.edu/cdm/ref/collection/duffy/id/70,,,,,,,,,,,,,,,,,,,,,,,,,,,,,,,,,,,,,,,,,,,,,,,,"<a href=""http://digital.lib.uiowa.edu/cdm/ref/collection/duffy/id/70"" target=""_blank"">View this item in its source respository</a>",,,,,,,,,,,,,,,,,,,,,,,,,,,,,http://www.iowaheritage.org/files/original/0c678c96a24711633e4cf1f18a92642c.jpg,"Remote Item","Editorial Cartoons of Brian Duffy",1,0
64212,http://www.iowaheritage.org/items/show/64212,"Taliban missile defense shield","Terrorism|Bin Laden, Osama, 1957-2011|Afghanistan|War on Terrorism, 2001-2009|Terrorists|2000-2010|War|Warfare|Violence|Taliban|Villages|Turbans|Boys|Men|Villages|Shields|Guns|Children",,"Duffy, Brian, 1955-",,"University of Iowa. Libraries. Special Collections Dept.",2001-11-07|2011-04,,"Educational use only, no other permissions given. Copyright to this digital object is owned by The Des Moines Register; it may not be downloaded, reproduced, or distributed without written permission. For more information, contact the Special Collections Department.","Editorial Cartoons of Brian Duffy; Des Moines Register Cartoonists|Papers of Brian Duffy|Des Moines Register",,English,"Still image|Editorial cartoons",MSC916|duffy-011107|http://digital.lib.uiowa.edu/cdm/ref/collection/duffy/id/50,,,,,,,,,,,,,,,,,,,,,,,,,,,,,,,,,,,,,,,,,,,,,,,,"<a href=""http://digital.lib.uiowa.edu/cdm/ref/collection/duffy/id/50"" target=""_blank"">View this item in its source respository</a>",,,,,,,,,,,,,,,,,,,,,,,,,,,,,http://www.iowaheritage.org/files/original/ee8fa05afc41824607f41fe801d0262d.jpg,"Remote Item","Editorial Cartoons of Brian Duffy",1,0
64188,http://www.iowaheritage.org/items/show/64188,"Department of Human Services study","Children|Duis, Shelby|Iowa|Men|2000-2010|Abuse|Murder|Parents|Bureaucracy|Bureaucracy -- United States|Protection|Mandatory Reporting|Spirit Lake (Iowa)|Equipment|Parachutes|Graves|Flowers|Pens|Records","Extensive patching needed ... ; Shelby Duis","Duffy, Brian, 1955-",,"University of Iowa. Libraries. Special Collections Dept.",2000-11-22|2011-04,,"Educational use only, no other permissions given. Copyright to this digital object is owned by The Des Moines Register; it may not be downloaded, reproduced, or distributed without written permission. For more information, contact the Special Collections Department.","Editorial Cartoons of Brian Duffy; Des Moines Register Cartoonists|Papers of Brian Duffy|Des Moines Register",,English,"Still image|Editorial cartoons",MSC916|duffy-001122|http://digital.lib.uiowa.edu/cdm/ref/collection/duffy/id/26,,,,,,,,,,,,,,,,,,,,,,,,,,,,,,,,,,,,,,,,,,,,,,,,"<a href=""http://digital.lib.uiowa.edu/cdm/ref/collection/duffy/id/26"" target=""_blank"">View this item in its source respository</a>",,,,,,,,,,,,,,,,,,,,,,,,,,,,,http://www.iowaheritage.org/files/original/66e8b6b5b7c94e3bf9c20623bc2a6f7f.jpg,"Remote Item","Editorial Cartoons of Brian Duffy",1,0
