 




﻿"Item Id","Item URI","Dublin Core:Title","Dublin Core:Subject","Dublin Core:Description","Dublin Core:Creator","Dublin Core:Source","Dublin Core:Publisher","Dublin Core:Date","Dublin Core:Contributor","Dublin Core:Rights","Dublin Core:Relation","Dublin Core:Format","Dublin Core:Language","Dublin Core:Type","Dublin Core:Identifier","Dublin Core:Coverage","Item Type Metadata:Text","Item Type Metadata:Interviewer","Item Type Metadata:Interviewee","Item Type Metadata:Location","Item Type Metadata:Transcription","Item Type Metadata:Local URL","Item Type Metadata:Original Format","Item Type Metadata:Physical Dimensions","Item Type Metadata:Duration","Item Type Metadata:Compression","Item Type Metadata:Producer","Item Type Metadata:Director","Item Type Metadata:Bit Rate/Frequency","Item Type Metadata:Time Summary","Item Type Metadata:Email Body","Item Type Metadata:Subject Line","Item Type Metadata:From","Item Type Metadata:To","Item Type Metadata:CC","Item Type Metadata:BCC","Item Type Metadata:Number of Attachments","Item Type Metadata:Standards","Item Type Metadata:Objectives","Item Type Metadata:Materials","Item Type Metadata:Lesson Plan Text","Item Type Metadata:URL","Item Type Metadata:Event Type","Item Type Metadata:Participants","Item Type Metadata:Birth Date","Item Type Metadata:Birthplace","Item Type Metadata:Death Date","Item Type Metadata:Occupation","Item Type Metadata:Biographical Text","Item Type Metadata:Bibliography","Item Type Metadata:Digital Reproduction Information","Item Type Metadata:Repository","Item Type Metadata:Repository Collection","Item Type Metadata:Contact information.","Item Type Metadata:File Name","Item Type Metadata:Notes","Item Type Metadata:Digital item created","Item Type Metadata:Digital item modified","Item Type Metadata:Executive Orders","Item Type Metadata:Record Created","Item Type Metadata:Record Modified","Item Type Metadata:Transcription2","Item Type Metadata:Source URL","Omeka Legacy File:Additional Creator","Omeka Legacy File:Transcriber","Omeka Legacy File:Producer","Omeka Legacy File:Render Device","Omeka Legacy File:Render Details","Omeka Legacy File:Capture Date","Omeka Legacy File:Capture Device","Omeka Legacy File:Capture Details","Omeka Legacy File:Change History","Omeka Legacy File:Watermark","Omeka Legacy File:Encryption","Omeka Legacy File:Compression","Omeka Legacy File:Post Processing","Omeka Image File:Width","Omeka Image File:Height","Omeka Image File:Bit Depth","Omeka Image File:Channels","Omeka Image File:Exif String","Omeka Image File:Exif Array","Omeka Image File:IPTC String","Omeka Image File:IPTC Array","Omeka Video File:Bitrate","Omeka Video File:Duration","Omeka Video File:Sample Rate","Omeka Video File:Codec","Omeka Video File:Width","Omeka Video File:Height",tags,file,itemType,collection,public,featured
29486,https://www.iowaheritage.org/items/show/29486,"Plan reunion here for 500 vets of WAC|Morning Register (Des Moines, Iowa)|Women's military activity","Women|United States. Army. Women's Army Corps|United States -- Iowa -- Polk County -- Des Moines|World War II|Soldiers|World War, 1939-1945 -- Particpation, Female|Women soldiers -- Iowa -- Fort Des Moines",,,,"State Historical Society of Iowa, Iowa City",1952-07-27|2009-09-08,,"The digital image may be used for educational purposes, as long as it is not altered in any way.  No commercial reproduction or distribution of this file is permitted without written permission of the State Historical Society of Iowa.","World War II Iowa press clippings","jpeg|image/jpeg|1 clipping : b&w ; 24 x 10 cm|1 clipping : b&w ; 24 x 10 cm",eng,"Text; Clippings|Text|Clippings (Information artifacts)",https://digital.lib.uiowa.edu/,,,,,,,,,,,,,,,,,,,,,,,,,,,,,,,,,,,,,,,,,,,,,,,,"<a href=""https://digital.lib.uiowa.edu/"" target=""_blank"">View this item in its source respository</a>",,,,,,,,,,,,,,,,,,,,,,,,,,,,,https://www.iowaheritage.org/files/original/ffdc721cc7a7dd3fa65e812f0148a685.jpg,"Remote Item","World War II Iowa Press Clippings",1,0
29488,https://www.iowaheritage.org/items/show/29488,"Women chalk up ten years in the armed services|Journal (Sioux City, Iowa)|Women's military activity","Women|United States. Army. Women's Army Corps|United States|World War II|World War, 1939-1945 -- Particpation, Female|Women soldiers|Soldiers","Image of women in armed forces accompanies article.",,,"State Historical Society of Iowa, Iowa City",1952-06-01|2009-09-08,,"The digital image may be used for educational purposes, as long as it is not altered in any way.  No commercial reproduction or distribution of this file is permitted without written permission of the State Historical Society of Iowa.","World War II Iowa press clippings","jpeg|image/jpeg|1 clipping : b&w ; 17 x 24 cm|1 clipping : b&w ; 17 x 24 cm",eng,"Text; Clippings; Still Image|Still image; Text|Clippings (Information artifacts)",https://digital.lib.uiowa.edu/,,,,,,,,,,,,,,,,,,,,,,,,,,,,,,,,,,,,,,,,,,,,,,,,"<a href=""https://digital.lib.uiowa.edu/"" target=""_blank"">View this item in its source respository</a>",,,,,,,,,,,,,,,,,,,,,,,,,,,,,https://www.iowaheritage.org/files/original/81a4d13a56b3a6708ce01604f68f6705.jpg,"Remote Item","World War II Iowa Press Clippings",1,1
29490,https://www.iowaheritage.org/items/show/29490,"10 years ago first WAACs came to d.m.|Morning Register (Des Moines, Iowa)|Women's military activity","Women|United States. Army. Women's Army Corps|United States. Army. Women's Army Auxiliary Corps|United States -- Iowa -- Polk County -- Des Moines|World War II|Soldiers|World War, 1939-1945 -- Particpation, Female|Women soldiers -- Iowa -- Fort Des Moines",,,,"State Historical Society of Iowa, Iowa City",1952-07-13|2009-09-08,,"The digital image may be used for educational purposes, as long as it is not altered in any way.  No commercial reproduction or distribution of this file is permitted without written permission of the State Historical Society of Iowa.",,"jpeg|image/jpeg|1 clipping : b&w ; 26 x 15 cm|1 clipping : b&w ; 26 x 15 cm",eng,"Text; Clippings|Text|Clippings (Information artifacts)",https://digital.lib.uiowa.edu/,,,,,,,,,,,,,,,,,,,,,,,,,,,,,,,,,,,,,,,,,,,,,,,,"<a href=""https://digital.lib.uiowa.edu/"" target=""_blank"">View this item in its source respository</a>",,,,,,,,,,,,,,,,,,,,,,,,,,,,,https://www.iowaheritage.org/files/original/ae203aa3f35b19f613f756c39a0d859b.jpg,"Remote Item","World War II Iowa Press Clippings",1,0
29492,https://www.iowaheritage.org/items/show/29492,"Rebels|WAC making army prove she's mother|Evening Tribune (Des Moines, Iowa)|Women's military activity","Women|United States. Army. Women's Army Corps|United States. Army. Women's Army Corps|United States|World War II|Soldiers|World War, 1939-1945 -- Particpation, Female|Women soldiers","Image of Maj. Alba Thompson accompanies article.",,,"State Historical Society of Iowa, Iowa City",1952-01-24|2009-09-08,,"The digital image may be used for educational purposes, as long as it is not altered in any way.  No commercial reproduction or distribution of this file is permitted without written permission of the State Historical Society of Iowa.","World War II Iowa press clippings","jpeg|image/jpeg|1 clipping : b&w ; 24 x 10 cm|1 clipping : b&w ; 24 x 10 cm",eng,"Text; Clippings; Still Image|Text; Still image|Clippings (Information artifacts)",https://digital.lib.uiowa.edu/,,,,,,,,,,,,,,,,,,,,,,,,,,,,,,,,,,,,,,,,,,,,,,,,"<a href=""https://digital.lib.uiowa.edu/"" target=""_blank"">View this item in its source respository</a>",,,,,,,,,,,,,,,,,,,,,,,,,,,,,https://www.iowaheritage.org/files/original/d361e457696dd85794c7c41467e5e256.jpg,"Remote Item","World War II Iowa Press Clippings",1,0
29494,https://www.iowaheritage.org/items/show/29494,"Marine women recruiter coming|Courier (Ottumwa, Iowa)|Women's military activity","Women|United States. Army. Women's Army Corps|United States -- Iowa -- Wapello County -- Ottumwa|World War II|Soldiers|World War, 1939-1945 -- Particpation, Female|Women soldiers -- Iowa",,,,"State Historical Society of Iowa, Iowa City",1952-01-31|2009-09-08,,"The digital image may be used for educational purposes, as long as it is not altered in any way.  No commercial reproduction or distribution of this file is permitted without written permission of the State Historical Society of Iowa.",,"jpeg|image/jpeg|1 clipping : b&w ; 5 x 5 cm|1 clipping : b&w ; 5 x 5 cm",eng,"Text; Clippings|Text|Clippings (Information artifacts)",https://digital.lib.uiowa.edu/,,,,,,,,,,,,,,,,,,,,,,,,,,,,,,,,,,,,,,,,,,,,,,,,"<a href=""https://digital.lib.uiowa.edu/"" target=""_blank"">View this item in its source respository</a>",,,,,,,,,,,,,,,,,,,,,,,,,,,,,https://www.iowaheritage.org/files/original/2bafcb923bac40c8e9eb429b3b33089d.jpg,"Remote Item","World War II Iowa Press Clippings",1,0
29496,https://www.iowaheritage.org/items/show/29496,"Sgt. Tandeski woman recruiter, coming Tuesday|Journal (Muscatine, Iowa)|Women's military activity","Women|United States. Army. Women's Army Corps|United States -- Iowa -- Muscatine County -- Muscatine|World War II|Soldiers|World War, 1939-1945 -- Particpation, Female|Women soldiers -- Iowa",,,,"State Historical Society of Iowa, Iowa City",1952-02-04|2009-09-08,,"The digital image may be used for educational purposes, as long as it is not altered in any way.  No commercial reproduction or distribution of this file is permitted without written permission of the State Historical Society of Iowa.",,"jpeg|image/jpeg|1 clipping : b&w ; 7 x 5 cm|1 clipping : b&w ; 7 x 5 cm",eng,"Text; Clippings|Text|Clippings (Information artifacts)",https://digital.lib.uiowa.edu/,,,,,,,,,,,,,,,,,,,,,,,,,,,,,,,,,,,,,,,,,,,,,,,,"<a href=""https://digital.lib.uiowa.edu/"" target=""_blank"">View this item in its source respository</a>",,,,,,,,,,,,,,,,,,,,,,,,,,,,,https://www.iowaheritage.org/files/original/5f59bfe0db80034fd80bceebad002508.jpg,"Remote Item","World War II Iowa Press Clippings",1,0
29498,https://www.iowaheritage.org/items/show/29498,"WAC detachment gets service unit|Evening Tribune (Des Moines, Iowa);|Women's millitary activity","Women|World War, 1939-1945|United States. Army. Women's Army Corps|Europe -- Germany|1940-1950|World War II|Soldiers|World War, 1939-1945 -- Particpation, Female|Women soldiers",,,,"State Historical Society of Iowa, Iowa City",1945-11-07|2009-08-24,,"The digital image may be used for educational purposes, as long as it is not altered in any way.  No commercial reproduction or distribution of this file is permitted without written permission of the State Historical Society of Iowa.","World War II Iowa press clippings","image/jpeg|1 clipping : b&w ; 6 x 5 cm|1 clipping : b&w ; 6 x 5 cm",eng,"Text; Clippings|Text|Clippings (Information artifacts)",https://digital.lib.uiowa.edu/,,,,,,,,,,,,,,,,,,,,,,,,,,,,,,,,,,,,,,,,,,,,,,,,"<a href=""https://digital.lib.uiowa.edu/"" target=""_blank"">View this item in its source respository</a>",,,,,,,,,,,,,,,,,,,,,,,,,,,,,https://www.iowaheritage.org/files/original/0bb6024b07e8761446f95a1a5bb16d3c.jpg,"Remote Item","World War II Iowa Press Clippings",1,0
29500,https://www.iowaheritage.org/items/show/29500,"WAVE recruiter here July 12, 13|Hawkeye Gazette (Burlington, Iowa)|Women's military activity","Women|World War, 1939-1945|United States. Naval Reserve. Women's Reserve|United States. Naval Reserve. Women's Reserve|United States -- Iowa -- Des Moines County -- Burlington|World War II|Soldiers|World War, 1939-1945 -- Participation, Female|Women soldiers -- Iowa",,,,"State Historical Society of Iowa, Iowa City",1951-07-07|2009-09-08,,"The digital image may be used for educational purposes, as long as it is not altered in any way.  No commercial reproduction or distribution of this file is permitted without written permission of the State Historical Society of Iowa.",,"jpeg|image/jpeg|1 clipping : b&w ; 6 x 5cm|1 clipping : b&w ; 6 x 5cm",eng,"Text; Clippings|Text|Clippings (Information artifacts)",https://digital.lib.uiowa.edu/,,,,,,,,,,,,,,,,,,,,,,,,,,,,,,,,,,,,,,,,,,,,,,,,"<a href=""https://digital.lib.uiowa.edu/"" target=""_blank"">View this item in its source respository</a>",,,,,,,,,,,,,,,,,,,,,,,,,,,,,https://www.iowaheritage.org/files/original/760257190db5047a23851556d32163eb.jpg,"Remote Item","World War II Iowa Press Clippings",1,0
29502,https://www.iowaheritage.org/items/show/29502,"Carol M. Harding|Free Press (Mount Pleasant, Iowa)|Women's military activity","Women|World War, 1939-1945|United States. Naval Reserve. Women's Reserve|United States. Naval Reserve. Women's Reserve|United States -- Iowa -- Henry County -- Mt. Pleasant|World War II|Soldiers|World War, 1939-1945 -- Participation, Female|Women soldiers -- Iowa",,,,"State Historical Society of Iowa, Iowa City",1951-07-12|2009-09-08,,"The digital image may be used for educational purposes, as long as it is not altered in any way.  No commercial reproduction or distribution of this file is permitted without written permission of the State Historical Society of Iowa.","World War II Iowa press clippings","jpeg|image/jpeg|1 clipping : b&w ; 6 x 5 cm|1 clipping : b&w ; 6 x 5 cm",eng,"Text; Clippings|Text|Clippings (Information artifacts)",https://digital.lib.uiowa.edu/,,,,,,,,,,,,,,,,,,,,,,,,,,,,,,,,,,,,,,,,,,,,,,,,"<a href=""https://digital.lib.uiowa.edu/"" target=""_blank"">View this item in its source respository</a>",,,,,,,,,,,,,,,,,,,,,,,,,,,,,https://www.iowaheritage.org/files/original/32245678d2a5f77d71102fd3e46afbb0.jpg,"Remote Item","World War II Iowa Press Clippings",1,0
29504,https://www.iowaheritage.org/items/show/29504,"Woman recruiter here next week|Gate City (Keokuk, Iowa)|Women's military activity","Women|United States. Women's Air Force Service Pilots|Women Airforce Service Pilots|United States -- Iowa -- Lee County -- Keokuk|World War II|Soldiers|World War, 1939-1945 -- Participation, Female|Womens soldiers -- Iowa",,,,"State Historical Society of Iowa, Iowa City",1951-08-11|2009-09-08,,"The digital image may be used for educational purposes, as long as it is not altered in any way.  No commercial reproduction or distribution of this file is permitted without written permission of the State Historical Society of Iowa.","World War II Iowa press clippings","jpeg|image/jpeg|1 clipping : b&w ; 9 x 5 cm|1 clipping : b&w ; 9 x 5 cm",eng,"Text; Clippings|Text|Clippings (Information artifacts)",https://digital.lib.uiowa.edu/,,,,,,,,,,,,,,,,,,,,,,,,,,,,,,,,,,,,,,,,,,,,,,,,"<a href=""https://digital.lib.uiowa.edu/"" target=""_blank"">View this item in its source respository</a>",,,,,,,,,,,,,,,,,,,,,,,,,,,,,https://www.iowaheritage.org/files/original/f86e05dd2f784e9c20427f3af87546c6.jpg,"Remote Item","World War II Iowa Press Clippings",1,0
