 




﻿"Item Id","Item URI","Dublin Core:Title","Dublin Core:Subject","Dublin Core:Description","Dublin Core:Creator","Dublin Core:Source","Dublin Core:Publisher","Dublin Core:Date","Dublin Core:Contributor","Dublin Core:Rights","Dublin Core:Relation","Dublin Core:Format","Dublin Core:Language","Dublin Core:Type","Dublin Core:Identifier","Dublin Core:Coverage","Item Type Metadata:Text","Item Type Metadata:Interviewer","Item Type Metadata:Interviewee","Item Type Metadata:Location","Item Type Metadata:Transcription","Item Type Metadata:Local URL","Item Type Metadata:Original Format","Item Type Metadata:Physical Dimensions","Item Type Metadata:Duration","Item Type Metadata:Compression","Item Type Metadata:Producer","Item Type Metadata:Director","Item Type Metadata:Bit Rate/Frequency","Item Type Metadata:Time Summary","Item Type Metadata:Email Body","Item Type Metadata:Subject Line","Item Type Metadata:From","Item Type Metadata:To","Item Type Metadata:CC","Item Type Metadata:BCC","Item Type Metadata:Number of Attachments","Item Type Metadata:Standards","Item Type Metadata:Objectives","Item Type Metadata:Materials","Item Type Metadata:Lesson Plan Text","Item Type Metadata:URL","Item Type Metadata:Event Type","Item Type Metadata:Participants","Item Type Metadata:Birth Date","Item Type Metadata:Birthplace","Item Type Metadata:Death Date","Item Type Metadata:Occupation","Item Type Metadata:Biographical Text","Item Type Metadata:Bibliography","Item Type Metadata:Digital Reproduction Information","Item Type Metadata:Repository","Item Type Metadata:Repository Collection","Item Type Metadata:Contact information.","Item Type Metadata:File Name","Item Type Metadata:Notes","Item Type Metadata:Digital item created","Item Type Metadata:Digital item modified","Item Type Metadata:Executive Orders","Item Type Metadata:Record Created","Item Type Metadata:Record Modified","Item Type Metadata:Transcription2","Item Type Metadata:Source URL","Omeka Legacy File:Additional Creator","Omeka Legacy File:Transcriber","Omeka Legacy File:Producer","Omeka Legacy File:Render Device","Omeka Legacy File:Render Details","Omeka Legacy File:Capture Date","Omeka Legacy File:Capture Device","Omeka Legacy File:Capture Details","Omeka Legacy File:Change History","Omeka Legacy File:Watermark","Omeka Legacy File:Encryption","Omeka Legacy File:Compression","Omeka Legacy File:Post Processing","Omeka Image File:Width","Omeka Image File:Height","Omeka Image File:Bit Depth","Omeka Image File:Channels","Omeka Image File:Exif String","Omeka Image File:Exif Array","Omeka Image File:IPTC String","Omeka Image File:IPTC Array","Omeka Video File:Bitrate","Omeka Video File:Duration","Omeka Video File:Sample Rate","Omeka Video File:Codec","Omeka Video File:Width","Omeka Video File:Height",tags,file,itemType,collection,public,featured
19020,https://www.iowaheritage.org/items/show/19020,"""W9XK, first licensed visual station west of Mississippi, to expand program in 1935"" [p. 1], ca. 1934","Television broadcasting|Television -- Equipment and supplies|Kurtz, Edwin Bernard, 1894-|W9XK-TV (Television station: Iowa City, Iowa)|United States -- Iowa -- Iowa City|1930-1940|Television programs|Teachers|Television--Receivers and reception|Television--Transmitters and transmission|Arnold, A. F. (Aden F.), 1901-|Potter, J. L.|University of Iowa","Newspaper article which recounts the first public demonstration of W9XK in early 1933, plans for current and future programming.",,,"Daily Iowan (Iowa City, Iowa)|University of Iowa. University Archives",1934|2008-05-15,,"Educational use only, no other permissions given. U.S. and international copyright laws may protect this digital object. Commercial use or distribution of the object is not permitted without prior permission of the copyright holder.","W9XK Experimental Television at Iowa|Subject Vertical Files: Television|http://www.lib.uiowa.edu/spec-coll/archives/guides|1930s and 1940s, folder 2",jpeg,,"Text; Still image|Clippings; Photographs",RG01.15.05|w9xk021|https://digital.lib.uiowa.edu/,,,,,,,,,,,,,,,,,,,,,,,,,,,,,,,,,,,,,,,,,,,,,,,,"<a href=""https://digital.lib.uiowa.edu/"" target=""_blank"">View this item in its source respository</a>",,,,,,,,,,,,,,,,,,,,,,,,,,,,,https://www.iowaheritage.org/files/original/2665843743912f9dc38df5e797587d69.jpg,"Remote Item","W9XK Experimental Television at Iowa",1,0
19133,https://www.iowaheritage.org/items/show/19133,"E.B. Kurtz, The University of Iowa, ca. 1930s","Television broadcasting|Kurtz, Edwin Bernard, 1894-|W9XK-TV (Television station: Iowa City, Iowa)|United States -- Iowa -- Iowa City|1930-1940|Teachers|University of Iowa","Prof. E.B. Kurtz, head of the Dept. of Electrical Engineering. He, along with radio station WSUI manager Carl Menzer, were largely responsible for the development of experimental television broadcasting during the 1930's at UI.",,,"University of Iowa. University Archives",1935|2008-05-15,,"Educational use only, no other permissions given. U.S. and international copyright laws may protect this digital object. Commercial use or distribution of the object is not permitted without prior permission of the copyright holder.","W9XK Experimental Television at Iowa|F.W. Kent Photographs: Faculty|http://www.lib.uiowa.edu/spec-coll/archives/guides",jpeg,,"Still image|Photographs",RG30.01.01|w9xk020_1954-02-17.jpg|https://digital.lib.uiowa.edu/,,,,,,,,,,,,,,,,,,,,,,,,,,,,,,,,,,,,,,,,,,,,,,,,"<a href=""https://digital.lib.uiowa.edu/"" target=""_blank"">View this item in its source respository</a>",,,,,,,,,,,,,,,,,,,,,,,,,,,,,https://www.iowaheritage.org/files/original/12b644119687eb10c9a531e9ef742d0f.jpg,"Remote Item","W9XK Experimental Television at Iowa",1,0
19151,https://www.iowaheritage.org/items/show/19151,"Edwin B. Kurtz obituary, January 20, 1978","Television broadcasting|Television producers and directors|Kurtz, Edwin Bernard, 1894-|W9XK-TV (Television station: Iowa City, Iowa)|United States -- Iowa -- Iowa City|1970-1980|Teachers|University of Iowa|United States -- Arizona -- Tucson","Edwin B. Kurtz was born 1894, died Jan. 14, 1978.",,,"Iowa City Press Citizen|University of Iowa. University Archives",2008-05-15,,"Educational use only, no other permissions given. U.S. and international copyright laws may protect this digital object. Commercial use or distribution of the object is not permitted without prior permission of the copyright holder.","W9XK Experimental Television at Iowa|Faculty and Staff Vertical Files|http://www.lib.uiowa.edu/spec-coll/archives/guides|""Kurtz, E.B.""",jpeg,,"Text; Still image|Clippings; Photographs; Obituaries",w9xk028_1978-01-20.jpg|https://digital.lib.uiowa.edu/,,,,,,,,,,,,,,,,,,,,,,,,,,,,,,,,,,,,,,,,,,,,,,,,"<a href=""https://digital.lib.uiowa.edu/"" target=""_blank"">View this item in its source respository</a>",,,,,,,,,,,,,,,,,,,,,,,,,,,,,https://www.iowaheritage.org/files/original/a3c60d825738f164b0b2fe40a15f299b.jpg,"Remote Item","W9XK Experimental Television at Iowa",1,0
19166,https://www.iowaheritage.org/items/show/19166,"Ray C. Kent standing behind camera, The University of Iowa, 1941","Television broadcasting|Television -- Equipment and supplies|Kent, Raymond Carroll, 1914-|W9XUI-TV (Television station: Iowa City, Iowa)|United States -- Iowa -- Iowa City|1940-1950|Motion picture cameras|Teachers|University of Iowa","Television camera employing Iconoscope. Electrical engineering instructor Ray C. Kent is focusing W9XUI camera by adjusting large portrait lens, 1941.",,,"University of Iowa. University Archives",1941|2008-05-15,,"Educational use only, no other permissions given. U.S. and international copyright laws may protect this digital object. Commercial use or distribution of the object is not permitted without prior permission of the copyright holder.","W9XK Experimental Television at Iowa|F.W. Kent Photographs: Colleges and Departments|http://www.lib.uiowa.edu/spec-coll/archives/guides|Engineering, miscellaneous view sub-folder",jpeg,,"Still image|Photographs",w9xk033_1941.jpg|https://digital.lib.uiowa.edu/,,,,,,,,,,,,,,,,,,,,,,,,,,,,,,,,,,,,,,,,,,,,,,,,"<a href=""https://digital.lib.uiowa.edu/"" target=""_blank"">View this item in its source respository</a>",,,,,,,,,,,,,,,,,,,,,,,,,,,,,https://www.iowaheritage.org/files/original/8ba397c07d007f4814e39d90228a2557.jpg,"Remote Item","W9XK Experimental Television at Iowa",1,0
19169,https://www.iowaheritage.org/items/show/19169,"Art instructor Aden Arnold of the Plastic and Graphics Arts Department sketches a portrait during the course of his lecture on W9XK television, The University of Iowa, 1933","Television programs|Television -- Equipment and supplies|Arnold, A. F. (Aden F.), 1901-|W9XK-TV (Television station: Iowa City, Iowa)|United States -- Iowa -- Iowa City|1930-1940|Teachers|Art education|University of Iowa","There is a sound microphone in the right corner and photoelectric cells behind him.",,,"University of Iowa. University Archives",2008-05-15,,"Educational use only, no other permissions given. U.S. and international copyright laws may protect this digital object. Commercial use or distribution of the object is not permitted without prior permission of the copyright holder.","W9XK Experimental Television at Iowa|http://www.lib.uiowa.edu/spec-coll/archives/guides|Engineering, miscellaneous view sub-folder",jpeg,,"Still image|Photographs",w9xk034_1933.jpg|https://digital.lib.uiowa.edu/,,,,,,,,,,,,,,,,,,,,,,,,,,,,,,,,,,,,,,,,,,,,,,,,"<a href=""https://digital.lib.uiowa.edu/"" target=""_blank"">View this item in its source respository</a>",,,,,,,,,,,,,,,,,,,,,,,,,,,,,https://www.iowaheritage.org/files/original/d7056c108fc95363d89547e3c0f86fd3.jpg,"Remote Item","W9XK Experimental Television at Iowa",1,0
19186,https://www.iowaheritage.org/items/show/19186,"E.G. Blackstone writing shorthand, The University of Iowa, 1933","Television broadcasting|Shorthand|Blackstone, Earl Glen, 1892-|W9XK-TV (Television station: Iowa City, Iowa)|United States -- Iowa -- Iowa City|1930-1940|Television programs|Teachers|University of Iowa","Prof. E.G. Blackstone of the College of Commerce, giving an illustrated lecture on shorthand, broadcast on W9XK, 1933. Note microphone to pick up sound and photoelectric cells on left to pick up picture.",,,"University of Iowa. University Archives",1933|2008-05-15,,"Educational use only, no other permissions given. U.S. and international copyright laws may protect this digital object. Commercial use or distribution of the object is not permitted without prior permission of the copyright holder.","W9XK Experimental Television at Iowa|F.W. Kent Photographs: Events and Activities|http://www.lib.uiowa.edu/spec-coll/archives/guides|Television",jpeg,,"Still image|Photographs",w9xk040_1933.jpg|https://digital.lib.uiowa.edu/,,,,,,,,,,,,,,,,,,,,,,,,,,,,,,,,,,,,,,,,,,,,,,,,"<a href=""https://digital.lib.uiowa.edu/"" target=""_blank"">View this item in its source respository</a>",,,,,,,,,,,,,,,,,,,,,,,,,,,,,https://www.iowaheritage.org/files/original/3f2a3c8521c1943c3a4e727e3aa97485.jpg,"Remote Item","W9XK Experimental Television at Iowa",1,0
19189,https://www.iowaheritage.org/items/show/19189,"E.B. Kurtz and J.L. Potter in front of television transmitter, The University of Iowa, 1933","Television broadcasting|Television--Transmitters and transmission|Kurtz, Edwin Bernard, 1894-|W9XK-TV (Television station: Iowa City, Iowa)|United States -- Iowa -- Iowa City|1930-1940|University of Iowa|Potter, J. L.|Teachers","View of television transmitter for W9XK. Transmitter operated on 2050 kilocycles or a wave length of 146 meters. Pictured at left is Prof. E.B. Kurtz, head of the Electrical Engineering Department, holding a transmitter tube, and J.L. Potter, adjusting the transmitter.",,,"University of Iowa. University Archives",1933|2008-05-15,,"Educational use only, no other permissions given. U.S. and international copyright laws may protect this digital object. Commercial use or distribution of the object is not permitted without prior permission of the copyright holder.","W9XK Experimental Television at Iowa|F.W. Kent Photographs: Events and Activities|http://www.lib.uiowa.edu/spec-coll/archives/guides|Television",jpeg,,"Still image|Photographs",w9xk041_1933.jpg|https://digital.lib.uiowa.edu/,,,,,,,,,,,,,,,,,,,,,,,,,,,,,,,,,,,,,,,,,,,,,,,,"<a href=""https://digital.lib.uiowa.edu/"" target=""_blank"">View this item in its source respository</a>",,,,,,,,,,,,,,,,,,,,,,,,,,,,,https://www.iowaheritage.org/files/original/45fbd27362a4ab441ee129c8aa623d4b.jpg,"Remote Item","W9XK Experimental Television at Iowa",1,1
19424,https://www.iowaheritage.org/items/show/19424,"Jean Homewood of the US Army Europe Special Services Athletic Program receiving her nameplate, The University of Iowa, November 13, 1957","Women|Homewood, Jean Margaret, b. 1913|University of Iowa. Dept. of Physical Education for Women|United States -- Iowa -- Iowa City|1950-1960|Teachers|Universities & colleges|Coaches (Athletics)|University of Iowa. Dept. of Health and Sport Studies","1957 USAREUP-USAFE Women's Interservice Basketball Clinic.",unknown,,"University of Iowa. Libraries. Iowa Women's Archives",1957-11-13|2008-06-03,,"Educational use only, no other permissions given. U.S. and international copyright laws may protect this item. Commercial use or distribution of this digital object is not permitted without written permission of the Iowa Women's Archives.","University of Iowa Physical Education for Women|The University of Iowa Department of Physical Education for Women Records, 1900-2006|http://www.lib.uiowa.edu/collguides/?IWA0106|Faculty & Staff",jpeg|10|13,,"Still image|Photographs",IWA0106|uipe0671.jpg|https://digital.lib.uiowa.edu/,,,,,,,,,,,,,,,,,,,,,,,,,,,,,,,,,,,,,,,,,,,,,,,,"<a href=""https://digital.lib.uiowa.edu/"" target=""_blank"">View this item in its source respository</a>",,,,,,,,,,,,,,,,,,,,,,,,,,,,,https://www.iowaheritage.org/files/original/aa8273a2b550f2012ae011fceb141af0.jpg,"Remote Item","University of Iowa Physical Education for Women",1,0
19430,https://www.iowaheritage.org/items/show/19430,"M. Gladys Scott, The University of Iowa, 1960s","Women|Scott, M. Gladys (Myrtle Gladys), 1905-|University of Iowa. Dept. of Physical Education for Women|United States -- Iowa -- Iowa City|1960-1970|Teachers|Universities & colleges|University of Iowa. Dept. of Health and Sport Studies",,unknown,,"University of Iowa. Libraries. Iowa Women's Archives",1960/1969|2008-06-03,,"Educational use only, no other permissions given. U.S. and international copyright laws may protect this item. Commercial use or distribution of this digital object is not permitted without written permission of the Iowa Women's Archives.","University of Iowa Physical Education for Women|The University of Iowa Department of Physical Education for Women Records, 1900-2006|http://www.lib.uiowa.edu/collguides/?IWA0106|Faculty & Staff",jpeg|13|9,,"Still image|Photographs; Studio portraits",IWA0106|uipe0663.jpg|https://digital.lib.uiowa.edu/,,,,,,,,,,,,,,,,,,,,,,,,,,,,,,,,,,,,,,,,,,,,,,,,"<a href=""https://digital.lib.uiowa.edu/"" target=""_blank"">View this item in its source respository</a>",,,,,,,,,,,,,,,,,,,,,,,,,,,,,https://www.iowaheritage.org/files/original/da6fd1c0c1e08f6ea54284491927772f.jpg,"Remote Item","University of Iowa Physical Education for Women",1,0
19433,https://www.iowaheritage.org/items/show/19433,"Elizabeth Halsey, The University of Iowa, 1930s","Women|Halsey, Elizabeth, b. 1890|University of Iowa. Dept. of Physical Education for Women|United States -- Iowa -- Iowa City|1930-1940|Teachers|Universities & colleges|University of Iowa. Dept. of Health and Sport Studies",,unknown,,"University of Iowa. Libraries. Iowa Women's Archives",1930/1939|2008-06-03,,"Educational use only, no other permissions given. U.S. and international copyright laws may protect this item. Commercial use or distribution of this digital object is not permitted without written permission of the Iowa Women's Archives.","University of Iowa Physical Education for Women|The University of Iowa Department of Physical Education for Women Records, 1900-2006|http://www.lib.uiowa.edu/collguides/?IWA0106|Faculty & Staff",jpeg|13|8,,"Still image|Photographs; Studio portraits",IWA0106|uipe0667.jpg|https://digital.lib.uiowa.edu/,,,,,,,,,,,,,,,,,,,,,,,,,,,,,,,,,,,,,,,,,,,,,,,,"<a href=""https://digital.lib.uiowa.edu/"" target=""_blank"">View this item in its source respository</a>",,,,,,,,,,,,,,,,,,,,,,,,,,,,,https://www.iowaheritage.org/files/original/59d165a4af351115754acb18e8e749ed.jpg,"Remote Item","University of Iowa Physical Education for Women",1,0
