 




﻿"Item Id","Item URI","Dublin Core:Title","Dublin Core:Subject","Dublin Core:Description","Dublin Core:Creator","Dublin Core:Source","Dublin Core:Publisher","Dublin Core:Date","Dublin Core:Contributor","Dublin Core:Rights","Dublin Core:Relation","Dublin Core:Format","Dublin Core:Language","Dublin Core:Type","Dublin Core:Identifier","Dublin Core:Coverage","Item Type Metadata:Text","Item Type Metadata:Interviewer","Item Type Metadata:Interviewee","Item Type Metadata:Location","Item Type Metadata:Transcription","Item Type Metadata:Local URL","Item Type Metadata:Original Format","Item Type Metadata:Physical Dimensions","Item Type Metadata:Duration","Item Type Metadata:Compression","Item Type Metadata:Producer","Item Type Metadata:Director","Item Type Metadata:Bit Rate/Frequency","Item Type Metadata:Time Summary","Item Type Metadata:Email Body","Item Type Metadata:Subject Line","Item Type Metadata:From","Item Type Metadata:To","Item Type Metadata:CC","Item Type Metadata:BCC","Item Type Metadata:Number of Attachments","Item Type Metadata:Standards","Item Type Metadata:Objectives","Item Type Metadata:Materials","Item Type Metadata:Lesson Plan Text","Item Type Metadata:URL","Item Type Metadata:Event Type","Item Type Metadata:Participants","Item Type Metadata:Birth Date","Item Type Metadata:Birthplace","Item Type Metadata:Death Date","Item Type Metadata:Occupation","Item Type Metadata:Biographical Text","Item Type Metadata:Bibliography","Item Type Metadata:Digital Reproduction Information","Item Type Metadata:Repository","Item Type Metadata:Repository Collection","Item Type Metadata:Contact information.","Item Type Metadata:File Name","Item Type Metadata:Notes","Item Type Metadata:Digital item created","Item Type Metadata:Digital item modified","Item Type Metadata:Executive Orders","Item Type Metadata:Record Created","Item Type Metadata:Record Modified","Item Type Metadata:Transcription2","Item Type Metadata:Source URL","Omeka Legacy File:Additional Creator","Omeka Legacy File:Transcriber","Omeka Legacy File:Producer","Omeka Legacy File:Render Device","Omeka Legacy File:Render Details","Omeka Legacy File:Capture Date","Omeka Legacy File:Capture Device","Omeka Legacy File:Capture Details","Omeka Legacy File:Change History","Omeka Legacy File:Watermark","Omeka Legacy File:Encryption","Omeka Legacy File:Compression","Omeka Legacy File:Post Processing","Omeka Image File:Width","Omeka Image File:Height","Omeka Image File:Bit Depth","Omeka Image File:Channels","Omeka Image File:Exif String","Omeka Image File:Exif Array","Omeka Image File:IPTC String","Omeka Image File:IPTC Array","Omeka Video File:Bitrate","Omeka Video File:Duration","Omeka Video File:Sample Rate","Omeka Video File:Codec","Omeka Video File:Width","Omeka Video File:Height",tags,file,itemType,collection,public,featured
9952,https://www.iowaheritage.org/items/show/9952,"Esther Walls' correspondence with National Book Committee and report on trip to Africa, 1965-1972","Travel|African Americans|Walls, Esther J., 1926-|Columbia University. School of Library Service|United States -- New York -- New York|1960-1970|Women|Librarians|Libraries|Graduate students|Braverman, Miriam|National Book Committee|Committee of Correspondence (New York, N.Y. : 1952-1969)|Senegal|Guinea|Mali|Cote d'Ivoire|1970-1980","Contents: Cover letter to Esther Walls from Miriam Braverman Sept. 12, 1972; Letter to Miriam Braverman Sept. 19, 1972; Report of West Africa trip, June-July 1965","Walls, Esther J., 1926-",,"University of Iowa. Iowa Women's Archives",1965/1972|2007-09-12,,"Educational use only, no other permissions given. U.S. and international copyright laws may protect this item. Commercial use or distribution of this digital object is not permitted without written permission of the Iowa Women's Archives.","African American Women in Iowa Digital Collection|http://digital.lib.uiowa.edu/aaws/|Esther J. Walls papers, 1860s-1996|http://www.lib.uiowa.edu/collguides/?IWA0288|Biographical material: Interviews, Transcript of dissertation research interview with Esther J. Walls conducted by Miriam Braverman|http://www.lib.uiowa.edu/iwa/Topical_holdings_lists/AAhold.html",jpeg,,Text|Correspondence,"IWA0288|Biography - Interviews and Transcripts|166295411|https://digital.lib.uiowa.edu/",,,,,,,,,,,,,,,,,,,,,,,,,,,,,,,,,,,,,,,,,,,,,,,,"<a href=""https://digital.lib.uiowa.edu/"" target=""_blank"">View this item in its source respository</a>",,,,,,,,,,,,,,,,,,,,,,,,,,,,,https://www.iowaheritage.org/files/original/c555bb06d9ab6354800bc88c139099e3.jpg,"Remote Item","African American Women in Iowa Collection",1,0
9956,https://www.iowaheritage.org/items/show/9956,"Esther Walls' general correspondence, 1975-1979","Activists|African Americans|Walls, Esther J., 1926-|State University of New York at Stony Brook|United States -- New York -- Stony Brook|1970-1980|International organizations|Libraries|Librarians|Universities & colleges|Travel|Organizations|Delzell, Robert F.|Toll, John S.|Bear, Charles B.|Smith, Datus Clifford, 1907-|Wadsworth, Elizabeth L.|Deale, H. Vail|Gyongy, Adrienne|Pond, T. A.|Klopf, Gordon John, 1917-|Bailey, C. Lloyd (Charles Lloyd), 1918-|McKeever, Susan|McCaffrey, Austin J.|Gelber, Sidney, 1924-|Smith, John Brewster|Power, Sarah Goddard|Lane, David O.|UNICEF|Unesco|American Library Association|Association of American Publishers|National Endowment for the Humanities. Division of Education Programs|Beloit College|Grinnell College|Time, inc.|University of Illinois at Urbana-Champaign. Library|United States -- New York -- New York|United States -- Iowa","Contents: Acceptance and address correction for jury in awarding Lippincott Award, Oct. 16, 1975; Acceptance and appointment to A.V.P. Equal Opportunity Committee, Mar. 3, 1977; Acceptance to serve on search committee for chairman of Dept. of Art, Mar. 1, 1977; Acceptance to serve on search committee for vice president for liberal studies, Feb. 10, 1976; Charles Bear's invitation for presidency of Grinnell College, Apr. 24, 1979; Cover letter for resume for Grinnell College presidency, May 7, 1979; Datus Smith's letter about reporting contributions to UNICEF, Mar. 26, 1979; Elizabeth Wadsworth's thank you letter, Oct. 22, 1975; H. Vail Deale's letter, International Relations Committee ALA, Dec. 9, 1976; Information for Poetry Center AudioVisual Augmentation, Mar. 28, 1979; Invitation for renomination to corporation of the committee for UNICEF, May 1, 1979; Invitation for renomination to exec. committee UNICEF, Mar. 11, 1975; Invitation to President's committee on Equal Opportunity SUNY","Walls, Esther J., 1926-",,"University of Iowa. Iowa Women's Archives",1975/1979|2007-09-12,,"Educational use only, no other permissions given. U.S. and international copyright laws may protect this item. Commercial use or distribution of this digital object is not permitted without written permission of the Iowa Women's Archives.","African American Women in Iowa Digital Collection|http://digital.lib.uiowa.edu/aaws/|Esther J. Walls papers, 1860s-1996|http://www.lib.uiowa.edu/collguides/?IWA0288|Correspondence: General, 1975-1979|http://www.lib.uiowa.edu/iwa/Topical_holdings_lists/AAhold.html",jpeg,,"Text|Correspondence; Invitations","IWA0288|Correspondence - General 1975-1979|166295411|https://digital.lib.uiowa.edu/",,,,,,,,,,,,,,,,,,,,,,,,,,,,,,,,,,,,,,,,,,,,,,,,"<a href=""https://digital.lib.uiowa.edu/"" target=""_blank"">View this item in its source respository</a>",,,,,,,,,,,,,,,,,,,,,,,,,,,,,https://www.iowaheritage.org/files/original/e6c923f9569ba4b75e44efba57c1ac20.jpg,"Remote Item","African American Women in Iowa Collection",1,0
9959,https://www.iowaheritage.org/items/show/9959,"Esther Walls' general correspondence, 1970-1974","Activists|African Americans|Walls, Esther J., 1926-|Unesco|Washington (D.C.)|1970-1980|International organizations|Literacy|Organizations|Travel|Women|Librarians|Libraries|Scherf, Walter, 1920-|Waller, Theodore|Skiffington, Mary|Crossley, Winifred Moffett|Behrstock, Julian, 1916-|Bailey, C. Lloyd (Charles Lloyd), 1918-|Kalish, Harry I.|Upton, Miller, 1916-2005|Hunter College|International Reading Association|UNICEF|State University of New York at Stony Brook|Internationale Jugendbibliothek (Munich, Germany)|Grolier Educational Corporation|John Wiley & Sons|Franklin Book Programs, inc.|Bermuda Library|International Book Year Secretariat|International Book Year 1972|Council on Library Resources|American Library Association|United States -- New York -- New York|United States -- Iowa -- Mason City|United States -- New York -- Stony Brook|Munich (Germany)|Bermuda -- Hamilton|United States -- Arizona -- Tucson","Contents: Acceptance of commission position ALA to John Upston, Jun. 19, 1974; Acceptance of commission position to Miller Upton, Jun. 19, 1974; Acceptance of invitation to address Cerro Gordo County Council, Aug. 28, 1972; Acceptance of UNICEF board nomination, Mar. 11, 1970; Appointment to associate director of libraries SUNY StonyBrook, Jul. 26, 1974; Asking Walter Scherf to lunch, Feb. 17, 1971; C. Lloyd Bailey's letter welcoming to UNICEF, May 4, 1970; Congratulations from Julian Behrstock UNESCO, Jun. 13, 1973; Congratulations from Theodore Waller, Feb. 12, 1973; Congratulations from Theodore Waller, May 2, 1972; Congratulations from Walter Scherf, Aug. 26, 1971; Good wishes and information from Walter Scherf, Feb. 22, 1972; Letter from Winnifred Crossley IYL, Feb. 16, 1972; Letter of recommendation from Michael Harris, Jul. 22, 1974; Letter to Walter Scherf, Oct. 26, 1972; Memorandum for informal meeting of welcome StonyBrook, Sept. 17, 1974; Now it's a simple task to guide read","Walls, Esther J., 1926-",,"University of Iowa. Iowa Women's Archives",1970/1974|2007-09-12,,"Educational use only, no other permissions given. U.S. and international copyright laws may protect this item. Commercial use or distribution of this digital object is not permitted without written permission of the Iowa Women's Archives.","African American Women in Iowa Digital Collection|http://digital.lib.uiowa.edu/aaws/|Esther J. Walls papers, 1860s-1996|http://www.lib.uiowa.edu/collguides/?IWA0288|Correspondence: General, 1970-1974|http://www.lib.uiowa.edu/iwa/Topical_holdings_lists/AAhold.html",jpeg,,"Text|Correspondence; Pamphlets","IWA0288|Correspondence - General 1970-1974|166295411|https://digital.lib.uiowa.edu/",,,,,,,,,,,,,,,,,,,,,,,,,,,,,,,,,,,,,,,,,,,,,,,,"<a href=""https://digital.lib.uiowa.edu/"" target=""_blank"">View this item in its source respository</a>",,,,,,,,,,,,,,,,,,,,,,,,,,,,,https://www.iowaheritage.org/files/original/e1e3c1574e13f2f710bfcddfc779af58.jpg,"Remote Item","African American Women in Iowa Collection",1,0
9960,https://www.iowaheritage.org/items/show/9960,"Invitations received and programs attended by Esther Walls, 1959-1965","Activists|African Americans|Walls, Esther J., 1926-|Union soudanaise R.D.A.|United States -- New York -- New York|1950-1960|Banquets|International organizations|Librarians|Organizations|Parties|Receptions|Women|Adjei, Ako|Quaison-Sackey, Alex|Ondo, Bonjean-Franc¸ois|American Library Association|United Nations|Milwaukee Public Schools||Mali|Ghana|United States -- Wisconsin -- Milwaukee|United States -- New York -- New Rochelle|1960-1970|1970-1980","Contents: 4eme Semaine de la Jeunesse de l'USRDA, Jul. 3-11, 1965;  ALA Watch for these new books, African Encounter; Buffet luncheon and High Life party invitation, Sept. 30, 1961; Carte d'invite no.49, Semaine de la Jeunesse, Mali; Conference program U.S. and Africa, Apr. 29, 1961; High Life buffet dinner invitation, Mar. 18, 1961; Invitation to 4eme Semaine de la Jeunesse, Mali, Jul. 7, 1965; Invitation to reception Carnegie Endowment Center, Dec. 30, 1959; Invitation to reception U.N., Oct. 2, 1959; Invitation to reception U.N., Sept. 21, 1959; Invitation to reception U.N., Jul. 1, 1961; Invitation to reception U.N., Mar. 7, 1960; Luncheon program, 2nd National Press briefing, Mar. 24, 1972; National Assembly admit bearer, Jul. 2, 1959; U.N. reception invitation, Oct. 2, 1961; UN reception invitation, Sept. 21, 1965; UN reception Republique Gabonaise, Sept. 17, 1965","Walls, Esther J., 1926-",,"University of Iowa. Iowa Women's Archives",1959/1965|2007-09-12,,"Educational use only, no other permissions given. U.S. and international copyright laws may protect this item. Commercial use or distribution of this digital object is not permitted without written permission of the Iowa Women's Archives.","African American Women in Iowa Digital Collection|http://digital.lib.uiowa.edu/aaws/|Esther J. Walls papers, 1860s-1996|http://www.lib.uiowa.edu/collguides/?IWA0288|Correspondence: Invitations and programs, 1959-1965|http://www.lib.uiowa.edu/iwa/Topical_holdings_lists/AAhold.html",jpeg,,"Text|Invitations; Programs","IWA0288|Correspondence - Invitations and Programs 1959-1965|166295411|https://digital.lib.uiowa.edu/",,,,,,,,,,,,,,,,,,,,,,,,,,,,,,,,,,,,,,,,,,,,,,,,"<a href=""https://digital.lib.uiowa.edu/"" target=""_blank"">View this item in its source respository</a>",,,,,,,,,,,,,,,,,,,,,,,,,,,,,https://www.iowaheritage.org/files/original/0cd6dc56d873325cb89eaa386ed9b0a6.jpg,"Remote Item","African American Women in Iowa Collection",1,0
9961,https://www.iowaheritage.org/items/show/9961,"Invitations and programs collected by Esther Walls,  1966-1978","Activists|African Americans|Walls, Esther J., 1926-|New York Public Library|Tanzania|1960-1970|International organizations|Receptions|Parties|Women|Travel|Banquets|Jazz|Music|Librarians|Libraries|Kotoka, Emmanuel Kwasi, 1926-1967|Muila, Unia|Bentley, A. D.|Danieli, D. N. J.|Malecela, Mrs. John W. L.|UNICEF|United Nations|American Society of African Culture|Zambia Library Association|Standing Conference of Eastern, Central and Southern African Librarians|Ghana|Ethiopia -- Addis Ababa|United States -- New York -- New York|Zambia|Zambia -- Lusaka|1970-1980","Contents: Invitation to 1st annual conference banquet, American Society of African Culture, Jun. 14; Invitation to BBQ in Zambia, Oct. 5, 1976; Invitation to conference dinner in Zambia, Oct. 6, 1976; Invitation to conference farewell party Zambia, Sept. 10, 1976; Invitation to dinner, Addis Ababa, Oct. 13; Invitation to informal Gatemouth Brown and Gate's Express concert, Zambia, Oct. 8; Invitation to luncheon at U.N., Sept. 3, 1969; Invitation to reception, Apr. 26, 1966; Invitation to reception, Oct. 12, 1966; Invitation to the Anne Carroll Moore lecture by E. Walls, Apr. 19, 1972; S.C.E.C.S.A.L. 1976 speaker name badge, Zambia; Rights of a Child Concert program, Dec. 12, 1976","Walls, Esther J., 1926-",,"University of Iowa. Iowa Women's Archives",1966/1978|2007-09-12,,"Educational use only, no other permissions given. U.S. and international copyright laws may protect this item. Commercial use or distribution of this digital object is not permitted without written permission of the Iowa Women's Archives.","African American Women in Iowa Digital Collection|http://digital.lib.uiowa.edu/aaws/|Esther J. Walls papers, 1860s-1996|http://www.lib.uiowa.edu/collguides/?IWA0288|Correspondence: Invitations and programs, 1966-1978 and undated|http://www.lib.uiowa.edu/iwa/Topical_holdings_lists/AAhold.html",jpeg,,"Text|Programs; Invitations","IWA0288|Correspondence - Invitations and Programs 1966-1978|166295411|https://digital.lib.uiowa.edu/",,,,,,,,,,,,,,,,,,,,,,,,,,,,,,,,,,,,,,,,,,,,,,,,"<a href=""https://digital.lib.uiowa.edu/"" target=""_blank"">View this item in its source respository</a>",,,,,,,,,,,,,,,,,,,,,,,,,,,,,https://www.iowaheritage.org/files/original/afbef069ff1a64a2c3f3f953afc20a4b.jpg,"Remote Item","African American Women in Iowa Collection",1,0
9962,https://www.iowaheritage.org/items/show/9962,"Esther Walls' correspondence with  prominent figures, 1955-1991","Activists|African Americans|Walls, Esther J., 1926-|Library Journal (Firm)|United States -- New York -- New York|1960-1970|Autographs|Celebrities|Actors|Authors|Books|Travel|Women|Welk, Lawrence, 1903-1992|Miller, Mike|Ives, Burl, 1909-1995|Erlich, Lillian|Hamilton, Antonia|Downs, Hugh|Jeffries, Susan|Lawrence Welk show (Television program)|ABC News|North Dakota State University|University of Iowa Foundation|United States -- Iowa -- Iowa City|United States -- North Dakota -- Fargo|United States -- California -- Santa Monica|1970-1980|1980-1990|1990-2000",,"Walls, Esther J., 1926-",,"University of Iowa. Iowa Women's Archives",1955/1991|2007-09-12,,"Educational use only, no other permissions given. U.S. and international copyright laws may protect this item. Commercial use or distribution of this digital object is not permitted without written permission of the Iowa Women's Archives.","African American Women in Iowa Digital Collection|http://digital.lib.uiowa.edu/aaws/|Esther J. Walls papers, 1860s-1996|http://www.lib.uiowa.edu/collguides/?IWA0288|Correspondence: Prominent figures, 1955-1991|http://www.lib.uiowa.edu/iwa/Topical_holdings_lists/AAhold.html",jpeg,,"Text|Correspondence; Greeting cards; Collages (Visual works)","IWA0288|Correspondence - Prominent Figures 1955-1991|166295411|https://digital.lib.uiowa.edu/",,,,,,,,,,,,,,,,,,,,,,,,,,,,,,,,,,,,,,,,,,,,,,,,"<a href=""https://digital.lib.uiowa.edu/"" target=""_blank"">View this item in its source respository</a>",,,,,,,,,,,,,,,,,,,,,,,,,,,,,https://www.iowaheritage.org/files/original/e33141cb916300044a66644f2a62b9a2.jpg,"Remote Item","African American Women in Iowa Collection",1,0
52038,https://www.iowaheritage.org/items/show/52038,"The ghost of Ladora","United States -- Iowa -- Ladora|1970-1980",,"Wirt, Mildred A. (Mildred Augustine), 1905-2002",,"Friends of the University of Iowa Libraries|University of Iowa. Libraries",1973|2007-05-14,,"Educational use only, no other permissions given. U.S. and international copyright laws may protect this digital object. Commercial use or distribution of the object is not permitted without prior permission of the copyright holder.<br><br>Educational use only, no other permissions given. U.S. and international copyright laws may protect this digital object. Commercial use or distribution of the object is not permitted without prior permission of the copyright holder.","Books at Iowa|Mildred Wirt Benson Collection|http://www.lib.uiowa.edu/spec-coll/resources/BooksatIowa.html",jpeg,,"Text; Still image",mwbbenjpg|169948831|http://digital.lib.uiowa.edu/cdm/ref/collection/mwb/id/1324,,,,,,,,,,,,,,,,,,,,,,,,,,,,,,,,,,,,,,,,,,,,,,,,"<a href=""http://digital.lib.uiowa.edu/cdm/ref/collection/mwb/id/1324"" target=""_blank"">View this item in its source respository</a>",,,,,,,,,,,,,,,,,,,,,,,,,,,,,https://www.iowaheritage.org/files/original/dd631ec700753bb88f4be2c1b6d9e24e.jpg,"Remote Item","Mildred Wirt Benson Collection",1,0
52131,https://www.iowaheritage.org/items/show/52131,"Mildred Wirt Benson correspondence with University of Iowa Libraries staff, 1953-1982","Drew, Nancy (Fictitious character)|Wirt, Mildred A. (Mildred Augustine), 1905-2002|Stratemeyer Syndicate|United States -- Ohio -- Toledo|1950-1960|1960-1970|1970-1980|1980-1990|United States -- Iowa -- Iowa City|University of Iowa. Libraries. Special Collections Dept.|Paluka, Frank|Wormer, Grace|Adams, Harriet Stratemeyer",,"Wirt, Mildred A. (Mildred Augustine), 1905-2002; Paluka, Frank",,"University of Iowa. Libraries. Iowa Women's Archives",1953-1982|2007-07-20,,"Educational use only, no other permissions given. U.S. and international copyright laws may protect this digital object. Commercial use or distribution of the object is not permitted without prior permission of the copyright holder.","Mildred Wirt Benson Collection|Mildred Augustine Wirt Benson Papers, 1915-2002|http://lib.uiowa.edu/collguides/?IWA0054",jpeg,,"Text|Letters (Correspondence); Carbon copies",IWA0054|mwbautocorr|169948831|http://digital.lib.uiowa.edu/cdm/ref/collection/mwb/id/2959,,,,,,,,,,,,,,,,,,,,,,,,,,,,,,,,,,,,,,,,,,,,,,,,"<a href=""http://digital.lib.uiowa.edu/cdm/ref/collection/mwb/id/2959"" target=""_blank"">View this item in its source respository</a>",,,,,,,,,,,,,,,,,,,,,,,,,,,,,https://www.iowaheritage.org/files/original/6c7cdbe017bf9e9fc7b802a52993bbb8.jpg,"Remote Item","Mildred Wirt Benson Collection",1,0
16030,https://www.iowaheritage.org/items/show/16030,"SUI College of Dentistry, class of 1973","Dental education|University of Iowa. College of Dentistry|United States -- Iowa -- Iowa City|1970-1980|Students","Composite class photo board including faculty and students.",,,"University of Iowa. College of Dentistry; University of Iowa Libraries",1973,,"Educational use only, no other permissions given. Copyright to this resource is held by the University of Iowa College of Dentistry, and is provided here for educational purposes only. It may not be reproduced or distributed in any format without written permission of the University of Iowa College of Dentistry.","Dentistry College Class Photographs",jpeg,,"Still image|Photographs","College Dentistry 1973.jpg|173691318|https://digital.lib.uiowa.edu/",,,,,,,,,,,,,,,,,,,,,,,,,,,,,,,,,,,,,,,,,,,,,,,,"<a href=""https://digital.lib.uiowa.edu/"" target=""_blank"">View this item in its source respository</a>",,,,,,,,,,,,,,,,,,,,,,,,,,,,,https://www.iowaheritage.org/files/original/9155a8f14aff41657afc7b6ae766952b.jpg,"Remote Item","Dentistry College Class Photographs",1,0
16155,https://www.iowaheritage.org/items/show/16155,"Correspondence and clippings concerning awards, 1970s-1980s","Artists|Drewelowe, Eve, 1899-1988|1970-1980|Awards|1980-1990",,,,"University of Iowa. Libraries. Iowa Women's Archives",197-|2009-08-11,,"Educational use only, no other permissions given. U.S. and international copyright laws may protect this item. Commercial use or distribution of this digital object is not permitted without written permission of the Iowa Women's Archives and the School of Art and Art History, University of Iowa.","Eve Drewelowe Digital Collection|Eve Drewelowe papers, 1924-1995|http://lib.uiowa.edu/collguides/?IWA0135|Biographical|Grants and awards -- Awards",jpeg,,"Text|Correspondence; Clippings (Information artifacts)",IWA035|01|drewe01-08|https://digital.lib.uiowa.edu/,,,,,,,,,,,,,,,,,,,,,,,,,,,,,,,,,,,,,,,,,,,,,,,,"<a href=""https://digital.lib.uiowa.edu/"" target=""_blank"">View this item in its source respository</a>",,,,,,,,,,,,,,,,,,,,,,,,,,,,,https://www.iowaheritage.org/files/original/0e03c1f29dfea16f9a42f087a746a88b.jpg,"Remote Item","Eve Drewelowe Digital Collection",1,0
