 




﻿"Item Id","Item URI","Dublin Core:Title","Dublin Core:Subject","Dublin Core:Description","Dublin Core:Creator","Dublin Core:Source","Dublin Core:Publisher","Dublin Core:Date","Dublin Core:Contributor","Dublin Core:Rights","Dublin Core:Relation","Dublin Core:Format","Dublin Core:Language","Dublin Core:Type","Dublin Core:Identifier","Dublin Core:Coverage","Item Type Metadata:Text","Item Type Metadata:Interviewer","Item Type Metadata:Interviewee","Item Type Metadata:Location","Item Type Metadata:Transcription","Item Type Metadata:Local URL","Item Type Metadata:Original Format","Item Type Metadata:Physical Dimensions","Item Type Metadata:Duration","Item Type Metadata:Compression","Item Type Metadata:Producer","Item Type Metadata:Director","Item Type Metadata:Bit Rate/Frequency","Item Type Metadata:Time Summary","Item Type Metadata:Email Body","Item Type Metadata:Subject Line","Item Type Metadata:From","Item Type Metadata:To","Item Type Metadata:CC","Item Type Metadata:BCC","Item Type Metadata:Number of Attachments","Item Type Metadata:Standards","Item Type Metadata:Objectives","Item Type Metadata:Materials","Item Type Metadata:Lesson Plan Text","Item Type Metadata:URL","Item Type Metadata:Event Type","Item Type Metadata:Participants","Item Type Metadata:Birth Date","Item Type Metadata:Birthplace","Item Type Metadata:Death Date","Item Type Metadata:Occupation","Item Type Metadata:Biographical Text","Item Type Metadata:Bibliography","Item Type Metadata:Digital Reproduction Information","Item Type Metadata:Repository","Item Type Metadata:Repository Collection","Item Type Metadata:Contact information.","Item Type Metadata:File Name","Item Type Metadata:Notes","Item Type Metadata:Digital item created","Item Type Metadata:Digital item modified","Item Type Metadata:Executive Orders","Item Type Metadata:Record Created","Item Type Metadata:Record Modified","Item Type Metadata:Transcription2","Item Type Metadata:Source URL","Omeka Legacy File:Additional Creator","Omeka Legacy File:Transcriber","Omeka Legacy File:Producer","Omeka Legacy File:Render Device","Omeka Legacy File:Render Details","Omeka Legacy File:Capture Date","Omeka Legacy File:Capture Device","Omeka Legacy File:Capture Details","Omeka Legacy File:Change History","Omeka Legacy File:Watermark","Omeka Legacy File:Encryption","Omeka Legacy File:Compression","Omeka Legacy File:Post Processing","Omeka Image File:Width","Omeka Image File:Height","Omeka Image File:Bit Depth","Omeka Image File:Channels","Omeka Image File:Exif String","Omeka Image File:Exif Array","Omeka Image File:IPTC String","Omeka Image File:IPTC Array","Omeka Video File:Bitrate","Omeka Video File:Duration","Omeka Video File:Sample Rate","Omeka Video File:Codec","Omeka Video File:Width","Omeka Video File:Height",tags,file,itemType,collection,public,featured
64270,https://www.iowaheritage.org/items/show/64270,"Economic Homeland Security advisory","Presidents|Bush, George W. (George Walker), 1946-|United States|Presidents|2000-2010|Economic conditions|Economy|Deficits|Sticks|Graphs|Podiums|Microphones|Signs","We're at ""really, really"" red; Out of sight deficits; High deficits; Elevated spending; Balanced; Surplus","Duffy, Brian, 1955-",,"University of Iowa. Libraries. Special Collections Dept.",2004-01-22|2011-04,,"Educational use only, no other permissions given. Copyright to this digital object is owned by The Des Moines Register; it may not be downloaded, reproduced, or distributed without written permission. For more information, contact the Special Collections Department.","Editorial Cartoons of Brian Duffy; Des Moines Register Cartoonists|Papers of Brian Duffy|Des Moines Register",,English,"Still image|Editorial cartoons",MSC916|duffy-040122|http://digital.lib.uiowa.edu/cdm/ref/collection/duffy/id/108,,,,,,,,,,,,,,,,,,,,,,,,,,,,,,,,,,,,,,,,,,,,,,,,"<a href=""http://digital.lib.uiowa.edu/cdm/ref/collection/duffy/id/108"" target=""_blank"">View this item in its source respository</a>",,,,,,,,,,,,,,,,,,,,,,,,,,,,,https://www.iowaheritage.org/files/original/0a0c82507fc5f3b5eafde1a9fc96bacb.jpg,"Remote Item","Editorial Cartoons of Brian Duffy",1,0
8384,https://www.iowaheritage.org/items/show/8384,"Easier to get in than out.  (Also titled): The bait and the trap.","Government|Animals|politics|spending|budgets|deficits|debt|credit|New Deal|traps|Uncle Sam|ordinary citizen.",,"Darling, Jay N. (Jay Norwood), 1876-1962","The Editorial cartoons of J.N. ""Ding"" Darling [electronic resource] : The Cowles Collection, Drake University, 1912-1962",,1938/08/29|1938,,"Copyright is owned by the ""Ding"" Darling Wildlife Society; it is administered on behalf of the Society by The University of Iowa. While use within the classroom is encouraged without specific authorization, publishing this cartoon in any format requires written permission. See policy and permissions procedure at: http://www.lib.uiowa.edu/spec-coll/services/dingdarling_fees.html","Cowles Library, Drake University, 2507 University Ave., Des Moines, IA 50311-4505.",,,,"380829.jpg|http://ddr.lib.drake.edu/u?/ddarling,5314",,,,,,,,,,,,,,,,,,,,,,,,,,,,,,,,,,,,,,,,,,,,,,,,"<a href=""http://ddr.lib.drake.edu/u?/ddarling,5314"" target=""_blank"">View this item in its source respository</a>",,,,,,,,,,,,,,,,,,,,,,,,,,,,,https://www.iowaheritage.org/files/original/4b6ffa6a32045657dd9b861780f7dcba.jpg,"Remote Item","Editorial Cartoons of J.N. ""Ding"" Darling, Drake University",1,0
8166,https://www.iowaheritage.org/items/show/8166,"Dollars to doughnuts they don't both make the turn.","Government|Roosevelt, Franklin D. (Franklin Delano), 1882-1945|Trucks|budgets|deficits|politics|promises|New Deal|cliff.",,"Darling, Jay N. (Jay Norwood), 1876-1962","The Editorial cartoons of J.N. ""Ding"" Darling [electronic resource] : The Cowles Collection, Drake University, 1912-1962",,1937/10/02|1937,,"Copyright is owned by the ""Ding"" Darling Wildlife Society; it is administered on behalf of the Society by The University of Iowa. While use within the classroom is encouraged without specific authorization, publishing this cartoon in any format requires written permission. See policy and permissions procedure at: http://www.lib.uiowa.edu/spec-coll/services/dingdarling_fees.html","Cowles Library, Drake University, 2507 University Ave., Des Moines, IA 50311-4505.",,,,"371002.jpg|http://ddr.lib.drake.edu/u?/ddarling,5095",,,,,,,,,,,,,,,,,,,,,,,,,,,,,,,,,,,,,,,,,,,,,,,,"<a href=""http://ddr.lib.drake.edu/u?/ddarling,5095"" target=""_blank"">View this item in its source respository</a>",,,,,,,,,,,,,,,,,,,,,,,,,,,,,https://www.iowaheritage.org/files/original/1c847179867b796bf72bbcee7d8b0db0.jpg,"Remote Item","Editorial Cartoons of J.N. ""Ding"" Darling, Drake University",1,0
8451,https://www.iowaheritage.org/items/show/8451,"Disposing of the entire estate.","Government|Uncle Sam|politics|deficits|national debt|New Deal|economics|interest.|hospital.",,"Darling, Jay N. (Jay Norwood), 1876-1962","The Editorial cartoons of J.N. ""Ding"" Darling [electronic resource] : The Cowles Collection, Drake University, 1912-1962",,1939/04/17|1939,,"Copyright is owned by the ""Ding"" Darling Wildlife Society; it is administered on behalf of the Society by The University of Iowa. While use within the classroom is encouraged without specific authorization, publishing this cartoon in any format requires written permission. See policy and permissions procedure at: http://www.lib.uiowa.edu/spec-coll/services/dingdarling_fees.html","Cowles Library, Drake University, 2507 University Ave., Des Moines, IA 50311-4505.",,,,"390417.jpg|http://ddr.lib.drake.edu/u?/ddarling,5381",,,,,,,,,,,,,,,,,,,,,,,,,,,,,,,,,,,,,,,,,,,,,,,,"<a href=""http://ddr.lib.drake.edu/u?/ddarling,5381"" target=""_blank"">View this item in its source respository</a>",,,,,,,,,,,,,,,,,,,,,,,,,,,,,https://www.iowaheritage.org/files/original/7686f013cf1e611d5889c601796ab2ba.jpg,"Remote Item","Editorial Cartoons of J.N. ""Ding"" Darling, Drake University",1,0
64430,https://www.iowaheritage.org/items/show/64430,Deficit,"Deficits|Branstad, Terry E.|Iowa|Governors|1990-2000|Governors|States|State governments|State governments -- Officials and employees|State politics|Legislators|Legislature|Campbell, Bonnie J., 1948-|Miller, Tom|Politicians|Potatoes|Steam|Men","Atty. general; Treasurer; Legislature","Duffy, Brian, 1955-",,"University of Iowa. Libraries. Special Collections Dept.",1991-02-03|2011-04,,"Educational use only, no other permissions given. Copyright to this digital object is owned by The Des Moines Register; it may not be downloaded, reproduced, or distributed without written permission. For more information, contact the Special Collections Department.","Editorial Cartoons of Brian Duffy; Des Moines Register Cartoonists|Papers of Brian Duffy|Des Moines Register",,English,"Still image|Editorial cartoons",MSC916|duffy-910203|http://digital.lib.uiowa.edu/cdm/ref/collection/duffy/id/268,,,,,,,,,,,,,,,,,,,,,,,,,,,,,,,,,,,,,,,,,,,,,,,,"<a href=""http://digital.lib.uiowa.edu/cdm/ref/collection/duffy/id/268"" target=""_blank"">View this item in its source respository</a>",,,,,,,,,,,,,,,,,,,,,,,,,,,,,https://www.iowaheritage.org/files/original/8099ee8cf03d6576d613887f89a45c33.jpg,"Remote Item","Editorial Cartoons of Brian Duffy",1,0
64409,https://www.iowaheritage.org/items/show/64409,Deficit,"Governors|Branstad, Terry E.|Iowa|Kitchens|1990-2000|Budgets|States|State governments|Spending|Government|Government spending|Government spending policy|Deficits|Legislature|Stoves|Pots|Explosions|Governors|Cooks|Cooking|Men|Doors|Windows|Food|Eggs|Spoons|Cookbooks","Cooked book budget recipes; Legislature","Duffy, Brian, 1955-",,"University of Iowa. Libraries. Special Collections Dept.",1991-01-03|2011-04,,"Educational use only, no other permissions given. Copyright to this digital object is owned by The Des Moines Register; it may not be downloaded, reproduced, or distributed without written permission. For more information, contact the Special Collections Department.","Editorial Cartoons of Brian Duffy; Des Moines Register Cartoonists|Papers of Brian Duffy|Des Moines Register",,English,"Still image|Editorial cartoons",MSC916|duffy-910103|http://digital.lib.uiowa.edu/cdm/ref/collection/duffy/id/247,,,,,,,,,,,,,,,,,,,,,,,,,,,,,,,,,,,,,,,,,,,,,,,,"<a href=""http://digital.lib.uiowa.edu/cdm/ref/collection/duffy/id/247"" target=""_blank"">View this item in its source respository</a>",,,,,,,,,,,,,,,,,,,,,,,,,,,,,https://www.iowaheritage.org/files/original/fbb0f5646e988eccf3daa25d958f9861.jpg,"Remote Item","Editorial Cartoons of Brian Duffy",1,0
64536,https://www.iowaheritage.org/items/show/64536,"Dear Ron, I'm off on vacation now. Please water the plants, and don't forget to feed the deficit. Love Congress","Congress|Reagan, Ronald|United States|Presidents|1980-1990|Presidents|Deficits|Recess|Letters|Dogs|Eating & drinking","Munch ... munch","Duffy, Brian, 1955-",,"University of Iowa. Libraries. Special Collections Dept.",1985-03-04|2011-04,,"Educational use only, no other permissions given. Copyright to this digital object is owned by The Des Moines Register; it may not be downloaded, reproduced, or distributed without written permission. For more information, contact the Special Collections Department.","Editorial Cartoons of Brian Duffy; Des Moines Register Cartoonists|Papers of Brian Duffy|Des Moines Register",,English,"Still image|Editorial cartoons",MSC916|duffy-850304|http://digital.lib.uiowa.edu/cdm/ref/collection/duffy/id/374,,,,,,,,,,,,,,,,,,,,,,,,,,,,,,,,,,,,,,,,,,,,,,,,"<a href=""http://digital.lib.uiowa.edu/cdm/ref/collection/duffy/id/374"" target=""_blank"">View this item in its source respository</a>",,,,,,,,,,,,,,,,,,,,,,,,,,,,,https://www.iowaheritage.org/files/original/f84073d602e9698962cfa34cd74dcd38.jpg,"Remote Item","Editorial Cartoons of Brian Duffy",1,0
7503,https://www.iowaheritage.org/items/show/7503,"Congress adjourns.","Government|Washington, D.C.|Uncles Sam|Congress|budgets|deficits|Congress.",,"Darling, Jay N. (Jay Norwood), 1876-1962","The Editorial cartoons of J.N. ""Ding"" Darling [electronic resource] : The Cowles Collection, Drake University, 1912-1962",,1932/07/18|1932,,"Copyright is owned by the ""Ding"" Darling Wildlife Society; it is administered on behalf of the Society by The University of Iowa. While use within the classroom is encouraged without specific authorization, publishing this cartoon in any format requires written permission. See policy and permissions procedure at: http://www.lib.uiowa.edu/spec-coll/services/dingdarling_fees.html","Cowles Library, Drake University, 2507 University Ave., Des Moines, IA 50311-4505.",,,,"320718.jpg|http://ddr.lib.drake.edu/u?/ddarling,4432",,,,,,,,,,,,,,,,,,,,,,,,,,,,,,,,,,,,,,,,,,,,,,,,"<a href=""http://ddr.lib.drake.edu/u?/ddarling,4432"" target=""_blank"">View this item in its source respository</a>",,,,,,,,,,,,,,,,,,,,,,,,,,,,,https://www.iowaheritage.org/files/original/4826dad8d9c7462f7de2f889f7cca350.jpg,"Remote Item","Editorial Cartoons of J.N. ""Ding"" Darling, Drake University",1,0
64227,https://www.iowaheritage.org/items/show/64227,"Budget deficit","Budgets|United States|Trees|2000-2010|Budgets -- United States|Deficits|Leaves|Autumn|Men",,"Duffy, Brian, 1955-",,"University of Iowa. Libraries. Special Collections Dept.",2001-10-11|2011-04,,"Educational use only, no other permissions given. Copyright to this digital object is owned by The Des Moines Register; it may not be downloaded, reproduced, or distributed without written permission. For more information, contact the Special Collections Department.","Editorial Cartoons of Brian Duffy; Des Moines Register Cartoonists|Papers of Brian Duffy|Des Moines Register",,English,"Still image|Editorial cartoons",MSC916|duffy-011011|http://digital.lib.uiowa.edu/cdm/ref/collection/duffy/id/65,,,,,,,,,,,,,,,,,,,,,,,,,,,,,,,,,,,,,,,,,,,,,,,,"<a href=""http://digital.lib.uiowa.edu/cdm/ref/collection/duffy/id/65"" target=""_blank"">View this item in its source respository</a>",,,,,,,,,,,,,,,,,,,,,,,,,,,,,https://www.iowaheritage.org/files/original/6b22a80c39d5fa7dd569c439c972ddcb.jpg,"Remote Item","Editorial Cartoons of Brian Duffy",1,0
64413,https://www.iowaheritage.org/items/show/64413,"Bond funds","Governors|Branstad, Terry E.|Iowa|Governors|1990-2000|Legislators|Legislature|Credit|State governments|State governments -- Officials and employees|States|Budgets|Bonds|Deficits|Men|Clothes, Tattered|Machines","Instant cash; It ate our card!; Legislature; Unacceptable credit risk","Duffy, Brian, 1955-",,"University of Iowa. Libraries. Special Collections Dept.",1991-01-13|2011-04,,"Educational use only, no other permissions given. Copyright to this digital object is owned by The Des Moines Register; it may not be downloaded, reproduced, or distributed without written permission. For more information, contact the Special Collections Department.","Editorial Cartoons of Brian Duffy; Des Moines Register Cartoonists|Papers of Brian Duffy|Des Moines Register",,English,"Still image|Editorial cartoons",MSC916|duffy-910113|http://digital.lib.uiowa.edu/cdm/ref/collection/duffy/id/251,,,,,,,,,,,,,,,,,,,,,,,,,,,,,,,,,,,,,,,,,,,,,,,,"<a href=""http://digital.lib.uiowa.edu/cdm/ref/collection/duffy/id/251"" target=""_blank"">View this item in its source respository</a>",,,,,,,,,,,,,,,,,,,,,,,,,,,,,https://www.iowaheritage.org/files/original/b81fdacf9147f95edc53f4421e606222.jpg,"Remote Item","Editorial Cartoons of Brian Duffy",1,0
