 




﻿"Item Id","Item URI","Dublin Core:Title","Dublin Core:Subject","Dublin Core:Description","Dublin Core:Creator","Dublin Core:Source","Dublin Core:Publisher","Dublin Core:Date","Dublin Core:Contributor","Dublin Core:Rights","Dublin Core:Relation","Dublin Core:Format","Dublin Core:Language","Dublin Core:Type","Dublin Core:Identifier","Dublin Core:Coverage","Item Type Metadata:Text","Item Type Metadata:Interviewer","Item Type Metadata:Interviewee","Item Type Metadata:Location","Item Type Metadata:Transcription","Item Type Metadata:Local URL","Item Type Metadata:Original Format","Item Type Metadata:Physical Dimensions","Item Type Metadata:Duration","Item Type Metadata:Compression","Item Type Metadata:Producer","Item Type Metadata:Director","Item Type Metadata:Bit Rate/Frequency","Item Type Metadata:Time Summary","Item Type Metadata:Email Body","Item Type Metadata:Subject Line","Item Type Metadata:From","Item Type Metadata:To","Item Type Metadata:CC","Item Type Metadata:BCC","Item Type Metadata:Number of Attachments","Item Type Metadata:Standards","Item Type Metadata:Objectives","Item Type Metadata:Materials","Item Type Metadata:Lesson Plan Text","Item Type Metadata:URL","Item Type Metadata:Event Type","Item Type Metadata:Participants","Item Type Metadata:Birth Date","Item Type Metadata:Birthplace","Item Type Metadata:Death Date","Item Type Metadata:Occupation","Item Type Metadata:Biographical Text","Item Type Metadata:Bibliography","Item Type Metadata:Digital Reproduction Information","Item Type Metadata:Repository","Item Type Metadata:Repository Collection","Item Type Metadata:Contact information.","Item Type Metadata:File Name","Item Type Metadata:Notes","Item Type Metadata:Digital item created","Item Type Metadata:Digital item modified","Item Type Metadata:Executive Orders","Item Type Metadata:Record Created","Item Type Metadata:Record Modified","Item Type Metadata:Transcription2","Item Type Metadata:Source URL","Omeka Legacy File:Additional Creator","Omeka Legacy File:Transcriber","Omeka Legacy File:Producer","Omeka Legacy File:Render Device","Omeka Legacy File:Render Details","Omeka Legacy File:Capture Date","Omeka Legacy File:Capture Device","Omeka Legacy File:Capture Details","Omeka Legacy File:Change History","Omeka Legacy File:Watermark","Omeka Legacy File:Encryption","Omeka Legacy File:Compression","Omeka Legacy File:Post Processing","Omeka Image File:Width","Omeka Image File:Height","Omeka Image File:Bit Depth","Omeka Image File:Channels","Omeka Image File:Exif String","Omeka Image File:Exif Array","Omeka Image File:IPTC String","Omeka Image File:IPTC Array","Omeka Video File:Bitrate","Omeka Video File:Duration","Omeka Video File:Sample Rate","Omeka Video File:Codec","Omeka Video File:Width","Omeka Video File:Height",tags,file,itemType,collection,public,featured
35624,https://www.iowaheritage.org/items/show/35624,"Mary Louise Smith with friend in front of trellis at National Women's Republican Club, New York, N.Y., March 22, 1975","Women|Smith, Mary Louise|United States -- New York -- New York|1970-1980|Activists",,unknown,,"Bela Cseh Photographer|University of Iowa. Libraries. Iowa Women's Archives",1975-03-22|2007-09-13,,"Educational use only, no other permissions given. U.S. and international copyright laws may protect this item. Commercial use or distribution of this digital object is not permitted without written permission of the Iowa Women's Archives.","Iowa Women's Archives Founders|Mary Louise Smith Papers, 1914-1997|http://lib.uiowa.edu/collguides/?IWA0027|MLS and others at National Women's Republican Club 3/22/1975",jpeg,,"Still image|Photographs",IWA0027|https://digital.lib.uiowa.edu/,,,,,,,,,,,,,,,,,,,,,,,,,,,,,,,,,,,,,,,,,,,,,,,,"<a href=""https://digital.lib.uiowa.edu/"" target=""_blank"">View this item in its source respository</a>",,,,,,,,,,,,,,,,,,,,,,,,,,,,,https://www.iowaheritage.org/files/original/9610d6b6146f7ce89c77143d390a818e.jpg,"Remote Item","Iowa Women's Archives Founders",1,0
35598,https://www.iowaheritage.org/items/show/35598,"Mary Louise Smith with Federation of Republican Women, 1960s","Women|Smith, Mary Louise|United States|1960-1970|Activists|Politicians","""Fed. of Rep. Women at Gov. mansion""--Verso.",unknown,,"University of Iowa. Libraries. Iowa Women's Archives",1960/1969|2007-09-13,,"Educational use only, no other permissions given. U.S. and international copyright laws may protect this item. Commercial use or distribution of this digital object is not permitted without written permission of the Iowa Women's Archives.","Iowa Women's Archives Founders|Mary Louise Smith Papers, 1914-1997|http://lib.uiowa.edu/collguides/?IWA0027|MLS et al., undated",jpeg,,"Still image|Photographs; Group portraits",IWA0027|https://digital.lib.uiowa.edu/,,,,,,,,,,,,,,,,,,,,,,,,,,,,,,,,,,,,,,,,,,,,,,,,"<a href=""https://digital.lib.uiowa.edu/"" target=""_blank"">View this item in its source respository</a>",,,,,,,,,,,,,,,,,,,,,,,,,,,,,https://www.iowaheritage.org/files/original/d0000a827ebc0861abe349e334e0c502.jpg,"Remote Item","Iowa Women's Archives Founders",1,0
17399,https://www.iowaheritage.org/items/show/17399,"Mary Louise Smith with Emy S. Bruce, August 5, 1991","Women|Smith, Mary Louise|United States|1990-2000|Activists|Politicians|Bruce, Emy S.",,unknown,,"University of Iowa. Libraries. Iowa Women's Archives",1991-08-05|2007-09-13,,"Educational use only, no other permissions given. U.S. and international copyright laws may protect this item. Commercial use or distribution of this digital object is not permitted without written permission of the Iowa Women's Archives.","Iowa Women's Archives Founders|Mary Louise Smith Papers, 1914-1997|http://lib.uiowa.edu/collguides/?IWA0027",jpeg,,"Still image|Photographs",IWA0027|https://digital.lib.uiowa.edu/,,,,,,,,,,,,,,,,,,,,,,,,,,,,,,,,,,,,,,,,,,,,,,,,"<a href=""https://digital.lib.uiowa.edu/"" target=""_blank"">View this item in its source respository</a>",,,,,,,,,,,,,,,,,,,,,,,,,,,,,https://www.iowaheritage.org/files/original/3058dd916a5ef22ee3a34a1ac72975cc.jpg,"Remote Item","Iowa Women's Archives Founders",1,0
17387,https://www.iowaheritage.org/items/show/17387,"Mary Louise Smith with Edward Ginn, Walter Hasty, Jr., and Robert Price, late 1970s","Women|Smith, Mary Louise|Learning Channel (Firm)|United States|1970-1980|Activists|Politicians|Men|Business people|Ginn, Edward, III|Hasty, Walter, Jr.|Price, Robert M.",,unknown,,"University of Iowa. Libraries. Iowa Women's Archives",1970/1979|2007-09-13,,"Educational use only, no other permissions given. U.S. and international copyright laws may protect this item. Commercial use or distribution of this digital object is not permitted without written permission of the Iowa Women's Archives.","Iowa Women's Archives Founders|Mary Louise Smith Papers, 1914-1997|http://lib.uiowa.edu/collguides/?IWA0027",jpeg,,"Still image|Photographs; Studio portraits",IWA0027|mls0018.jpg|https://digital.lib.uiowa.edu/,,,,,,,,,,,,,,,,,,,,,,,,,,,,,,,,,,,,,,,,,,,,,,,,"<a href=""https://digital.lib.uiowa.edu/"" target=""_blank"">View this item in its source respository</a>",,,,,,,,,,,,,,,,,,,,,,,,,,,,,https://www.iowaheritage.org/files/original/bcb352cd7ff4921e193668f051a38a90.jpg,"Remote Item","Iowa Women's Archives Founders",1,0
17414,https://www.iowaheritage.org/items/show/17414,"Mary Louise Smith with David Fisher, February 18, 1988","Women|Smith, Mary Louise|United States|1980-1990|Activists|Politicians|Men|Fisher, David",,unknown,,"University of Iowa. Libraries. Iowa Women's Archives",1988-02-18|2007-09-13,,"Educational use only, no other permissions given. U.S. and international copyright laws may protect this item. Commercial use or distribution of this digital object is not permitted without written permission of the Iowa Women's Archives.","Iowa Women's Archives Founders|Mary Louise Smith Papers, 1914-1997|http://lib.uiowa.edu/collguides/?IWA0027",jpeg,,"Still image|Photographs",IWA0027|https://digital.lib.uiowa.edu/,,,,,,,,,,,,,,,,,,,,,,,,,,,,,,,,,,,,,,,,,,,,,,,,"<a href=""https://digital.lib.uiowa.edu/"" target=""_blank"">View this item in its source respository</a>",,,,,,,,,,,,,,,,,,,,,,,,,,,,,https://www.iowaheritage.org/files/original/e4febc0a24c2ac73169d70a2afc5b523.jpg,"Remote Item","Iowa Women's Archives Founders",1,0
17397,https://www.iowaheritage.org/items/show/17397,"Mary Louise Smith with Darrell Wyrick at The University of Iowa Foundation Meeting, Iowa City, Iowa, October 1991","Women|Smith, Mary Louise|University of Iowa|United States -- Iowa -- Iowa City|1990-2000|Activists|Politicians|Wyrick, Darrell",,unknown,,"University of Iowa. Libraries. Iowa Women's Archives",1991-10|2007-09-13,,"Educational use only, no other permissions given. U.S. and international copyright laws may protect this item. Commercial use or distribution of this digital object is not permitted without written permission of the Iowa Women's Archives.","Iowa Women's Archives Founders|Mary Louise Smith Papers, 1914-1997|http://lib.uiowa.edu/collguides/?IWA0027",jpeg,,"Still image|Photographs",IWA0027|https://digital.lib.uiowa.edu/,,,,,,,,,,,,,,,,,,,,,,,,,,,,,,,,,,,,,,,,,,,,,,,,"<a href=""https://digital.lib.uiowa.edu/"" target=""_blank"">View this item in its source respository</a>",,,,,,,,,,,,,,,,,,,,,,,,,,,,,https://www.iowaheritage.org/files/original/da84c0db3d8299f32d66fbe351e548e9.jpg,"Remote Item","Iowa Women's Archives Founders",1,0
35696,https://www.iowaheritage.org/items/show/35696,"Mary Louise Smith with couple at Republican Women's Conference, 1968","Men|Smith, Mary Louise|United States|1960-1970|Women|Activists",,unknown,,"University of Iowa. Libraries. Iowa Women's Archives",1968|2007-09-13,,"Educational use only, no other permissions given. U.S. and international copyright laws may protect this item. Commercial use or distribution of this digital object is not permitted without written permission of the Iowa Women's Archives.","Iowa Women's Archives Founders|Mary Louise Smith Papers, 1914-1997|http://lib.uiowa.edu/collguides/?IWA0027|MLS et al, 1968-1972- Republican Women's Conference, 1968",jpeg,,"Still image|Photographs",IWA0027|mls0292.jpg|https://digital.lib.uiowa.edu/,,,,,,,,,,,,,,,,,,,,,,,,,,,,,,,,,,,,,,,,,,,,,,,,"<a href=""https://digital.lib.uiowa.edu/"" target=""_blank"">View this item in its source respository</a>",,,,,,,,,,,,,,,,,,,,,,,,,,,,,https://www.iowaheritage.org/files/original/2622c65ba7860e26d9967a7cb9f75af7.jpg,"Remote Item","Iowa Women's Archives Founders",1,0
17404,https://www.iowaheritage.org/items/show/17404,"Mary Louise Smith with Commiteewoman of West Virginia Priscilla Humphreys, Washington, D.C., 1970s","Women|Smith, Mary Louise|United States -- Washington (D.C.)|1970-1980|Activists|Politicians|Humphreys, Priscilla",,unknown,,"University of Iowa. Libraries. Iowa Women's Archives",1970/1979|2007-09-13,,"Educational use only, no other permissions given. U.S. and international copyright laws may protect this item. Commercial use or distribution of this digital object is not permitted without written permission of the Iowa Women's Archives.","Iowa Women's Archives Founders|Mary Louise Smith Papers, 1914-1997|http://lib.uiowa.edu/collguides/?IWA0027",jpeg,,"Still image|Photographs",IWA0027|https://digital.lib.uiowa.edu/,,,,,,,,,,,,,,,,,,,,,,,,,,,,,,,,,,,,,,,,,,,,,,,,"<a href=""https://digital.lib.uiowa.edu/"" target=""_blank"">View this item in its source respository</a>",,,,,,,,,,,,,,,,,,,,,,,,,,,,,https://www.iowaheritage.org/files/original/60ef78a6c2595e5952197c70cffbb2dc.jpg,"Remote Item","Iowa Women's Archives Founders",1,0
17378,https://www.iowaheritage.org/items/show/17378,"Mary Louise Smith with clasped hands, Washington, D.C., 1970s","Women|Smith, Mary Louise|United States -- Washington (D.C.)|1970-1980|Activists|Politicians",,unknown,,"Ankers Capitol Photographers|University of Iowa. Libraries. Iowa Women's Archives",1970/1979|2007-09-13,,"Educational use only, no other permissions given. U.S. and international copyright laws may protect this item. Commercial use or distribution of this digital object is not permitted without written permission of the Iowa Women's Archives.","Iowa Women's Archives Founders|Mary Louise Smith Papers, 1914-1997|http://lib.uiowa.edu/collguides/?IWA0027",jpeg,,"Still image|Photographs",IWA0027|https://digital.lib.uiowa.edu/,,,,,,,,,,,,,,,,,,,,,,,,,,,,,,,,,,,,,,,,,,,,,,,,"<a href=""https://digital.lib.uiowa.edu/"" target=""_blank"">View this item in its source respository</a>",,,,,,,,,,,,,,,,,,,,,,,,,,,,,https://www.iowaheritage.org/files/original/6c3bc18f57ce85eb710b1470e8c1439d.jpg,"Remote Item","Iowa Women's Archives Founders",1,0
35602,https://www.iowaheritage.org/items/show/35602,"Mary Louise Smith with Charles Wittenmeyer, Secretary of Agriculture Earl Butz, and John McDonald, 1970s","Men|Wittenmeyer, Charles E., 1903-|United States|1970-1980|Women|Activists|Cabinet officers|Smith, Mary Louise|Butz, Earl L. (Earl Lauer), 1909-2008|McDonald, John",,unknown,,"University of Iowa. Libraries. Iowa Women's Archives",1970/1979|2007-09-13,,"Educational use only, no other permissions given. U.S. and international copyright laws may protect this item. Commercial use or distribution of this digital object is not permitted without written permission of the Iowa Women's Archives.","Iowa Women's Archives Founders|Mary Louise Smith Papers, 1914-1997|http://lib.uiowa.edu/collguides/?IWA0027|MLS et al., undated",jpeg,,"Still image|Photographs",IWA0027|https://digital.lib.uiowa.edu/,,,,,,,,,,,,,,,,,,,,,,,,,,,,,,,,,,,,,,,,,,,,,,,,"<a href=""https://digital.lib.uiowa.edu/"" target=""_blank"">View this item in its source respository</a>",,,,,,,,,,,,,,,,,,,,,,,,,,,,,https://www.iowaheritage.org/files/original/6fbf4879307396f5723e681f9dd4e2e2.jpg,"Remote Item","Iowa Women's Archives Founders",1,0
