 




﻿"Item Id","Item URI","Dublin Core:Title","Dublin Core:Subject","Dublin Core:Description","Dublin Core:Creator","Dublin Core:Source","Dublin Core:Publisher","Dublin Core:Date","Dublin Core:Contributor","Dublin Core:Rights","Dublin Core:Relation","Dublin Core:Format","Dublin Core:Language","Dublin Core:Type","Dublin Core:Identifier","Dublin Core:Coverage","Item Type Metadata:Text","Item Type Metadata:Interviewer","Item Type Metadata:Interviewee","Item Type Metadata:Location","Item Type Metadata:Transcription","Item Type Metadata:Local URL","Item Type Metadata:Original Format","Item Type Metadata:Physical Dimensions","Item Type Metadata:Duration","Item Type Metadata:Compression","Item Type Metadata:Producer","Item Type Metadata:Director","Item Type Metadata:Bit Rate/Frequency","Item Type Metadata:Time Summary","Item Type Metadata:Email Body","Item Type Metadata:Subject Line","Item Type Metadata:From","Item Type Metadata:To","Item Type Metadata:CC","Item Type Metadata:BCC","Item Type Metadata:Number of Attachments","Item Type Metadata:Standards","Item Type Metadata:Objectives","Item Type Metadata:Materials","Item Type Metadata:Lesson Plan Text","Item Type Metadata:URL","Item Type Metadata:Event Type","Item Type Metadata:Participants","Item Type Metadata:Birth Date","Item Type Metadata:Birthplace","Item Type Metadata:Death Date","Item Type Metadata:Occupation","Item Type Metadata:Biographical Text","Item Type Metadata:Bibliography","Item Type Metadata:Digital Reproduction Information","Item Type Metadata:Repository","Item Type Metadata:Repository Collection","Item Type Metadata:Contact information.","Item Type Metadata:File Name","Item Type Metadata:Notes","Item Type Metadata:Digital item created","Item Type Metadata:Digital item modified","Item Type Metadata:Executive Orders","Item Type Metadata:Record Created","Item Type Metadata:Record Modified","Item Type Metadata:Transcription2","Item Type Metadata:Source URL","Omeka Legacy File:Additional Creator","Omeka Legacy File:Transcriber","Omeka Legacy File:Producer","Omeka Legacy File:Render Device","Omeka Legacy File:Render Details","Omeka Legacy File:Capture Date","Omeka Legacy File:Capture Device","Omeka Legacy File:Capture Details","Omeka Legacy File:Change History","Omeka Legacy File:Watermark","Omeka Legacy File:Encryption","Omeka Legacy File:Compression","Omeka Legacy File:Post Processing","Omeka Image File:Width","Omeka Image File:Height","Omeka Image File:Bit Depth","Omeka Image File:Channels","Omeka Image File:Exif String","Omeka Image File:Exif Array","Omeka Image File:IPTC String","Omeka Image File:IPTC Array","Omeka Video File:Bitrate","Omeka Video File:Duration","Omeka Video File:Sample Rate","Omeka Video File:Codec","Omeka Video File:Width","Omeka Video File:Height",tags,file,itemType,collection,public,featured
12447,https://www.iowaheritage.org/items/show/12447,"Volunteers sandbagging, The University of Iowa, June 14, 2008","Floods|University of Iowa|United States -- Iowa -- Iowa City|2000-2010|Evacuations|Disaster relief|Community service","Volunteers sandbag on The University of Iowa campus in preparation for floods on Saturday, June 14, 2008.","Schoon, Tim",,"University of Iowa. University News Services",2008-06-14|2008-06-14,,"Educational use only, no other permissions given. U.S. and international copyright laws may protect this item. Commercial use or distribution of this digital object is not permitted without written permission of the copyright holder.","Iowa City Flood|Flood Images|Flood preparations, June 14, 2008",jpeg,,"Still image|Photographs",https://digital.lib.uiowa.edu/,,,,,,,,,,,,,,,,,,,,,,,,,,,,,,,,,,,,,,,,,,,,,,,,"<a href=""https://digital.lib.uiowa.edu/"" target=""_blank"">View this item in its source respository</a>",,,,,,,,,,,,,,,,,,,,,,,,,,,,,https://www.iowaheritage.org/files/original/888769cfe5f85291517b80abb90d916d.jpg,"Remote Item","Iowa City Flood",1,1
12459,https://www.iowaheritage.org/items/show/12459,"Volunteers sandbagging, The University of Iowa, June 14, 2008","Floods|University of Iowa|United States -- Iowa -- Iowa City|2000-2010|Evacuations|Disaster relief|Community service|Educational facilities||Lindquist Center (Iowa City, Iowa)","Volunteers sandbag outside the Lindquist Center on Saturday, June 14, 2008.","Schoon, Tim",,"University of Iowa. University News Services",2008-06-14|2008-06-14,,"Educational use only, no other permissions given. U.S. and international copyright laws may protect this item. Commercial use or distribution of this digital object is not permitted without written permission of the copyright holder.","Iowa City Flood|Flood Images|Flood preparations, June 14, 2008",jpeg,,"Still image|Photographs",https://digital.lib.uiowa.edu/,,,,,,,,,,,,,,,,,,,,,,,,,,,,,,,,,,,,,,,,,,,,,,,,"<a href=""https://digital.lib.uiowa.edu/"" target=""_blank"">View this item in its source respository</a>",,,,,,,,,,,,,,,,,,,,,,,,,,,,,https://www.iowaheritage.org/files/original/2189badde0c30762d741cb6dee4acd1e.jpg,"Remote Item","Iowa City Flood",1,0
12371,https://www.iowaheritage.org/items/show/12371,"Volunteers unload sandbags outside Main Library, The University of Iowa, June 14, 2008","Floods|University of Iowa|United States -- Iowa -- Iowa City|2000-2010|Evacuations|Disaster relief|Libraries|Community service||Main Library (Iowa City, Iowa)","Volunteers unload sandbags outside the Main Library on Saturday, June 14, 2008.","Schoon, Tim",,"University of Iowa. University News Services",2008-06-14|2008-06-14,,"Educational use only, no other permissions given. U.S. and international copyright laws may protect this item. Commercial use or distribution of this digital object is not permitted without written permission of the copyright holder.","Iowa City Flood|Flood Images|Flood preparations, June 14, 2008",jpeg,,"Still image|Photographs",https://digital.lib.uiowa.edu/,,,,,,,,,,,,,,,,,,,,,,,,,,,,,,,,,,,,,,,,,,,,,,,,"<a href=""https://digital.lib.uiowa.edu/"" target=""_blank"">View this item in its source respository</a>",,,,,,,,,,,,,,,,,,,,,,,,,,,,,https://www.iowaheritage.org/files/original/e7678af10a4b4295a595d64003e862d7.jpg,"Remote Item","Iowa City Flood",1,0
64283,https://www.iowaheritage.org/items/show/64283,"Voting booth","Elections|United States|Men|2000-2010|Voting|Votes|Voters|Polling places|Machines|Steam|Smoke",,"Duffy, Brian, 1955-",,"University of Iowa. Libraries. Special Collections Dept.",2004-11-04|2011-04,,"Educational use only, no other permissions given. Copyright to this digital object is owned by The Des Moines Register; it may not be downloaded, reproduced, or distributed without written permission. For more information, contact the Special Collections Department.","Editorial Cartoons of Brian Duffy; Des Moines Register Cartoonists|Papers of Brian Duffy|Des Moines Register",,English,"Still image|Editorial cartoons","MSC916|duffy-041104 (2)|http://digital.lib.uiowa.edu/cdm/ref/collection/duffy/id/121",,,,,,,,,,,,,,,,,,,,,,,,,,,,,,,,,,,,,,,,,,,,,,,,"<a href=""http://digital.lib.uiowa.edu/cdm/ref/collection/duffy/id/121"" target=""_blank"">View this item in its source respository</a>",,,,,,,,,,,,,,,,,,,,,,,,,,,,,https://www.iowaheritage.org/files/original/bc750cbffb08104e7f5f31815ee83c2b.jpg,"Remote Item","Editorial Cartoons of Brian Duffy",1,0
11910,https://www.iowaheritage.org/items/show/11910,"Voxman Music Building flooded, The University of Iowa, June 16, 2008","Floods|University of Iowa|United States -- Iowa -- Iowa City|2000-2010|Evacuations|Disaster relief|Concert halls|Auditoriums|Educational facilities|Music education||Voxman Music Building (Iowa City, Iowa)|Clapp Recital Hall (Iowa City, Iowa)|Virgil M. Hancher Auditorium","Images of flooded Voxman Music Building on Monday, June 16, 2008.","Schoon, Tim",,"University of Iowa. University News Services",2008-06-16|2008-06-16,,"Educational use only, no other permissions given. U.S. and international copyright laws may protect this item. Commercial use or distribution of this digital object is not permitted without written permission of the copyright holder.","Iowa City Flood|Flood Images|Flood, June 16, 2008",jpeg,,"Still image|Photographs",https://digital.lib.uiowa.edu/,,,,,,,,,,,,,,,,,,,,,,,,,,,,,,,,,,,,,,,,,,,,,,,,"<a href=""https://digital.lib.uiowa.edu/"" target=""_blank"">View this item in its source respository</a>",,,,,,,,,,,,,,,,,,,,,,,,,,,,,https://www.iowaheritage.org/files/original/4af7631e3fd923d4b4748adbf178f5cb.jpg,"Remote Item","Iowa City Flood",1,0
12393,https://www.iowaheritage.org/items/show/12393,"Walkway flooded, The University of Iowa, June 17, 2008","Floods|University of Iowa|United States -- Iowa -- Iowa City|2000-2010|Evacuations|Disaster relief|Walkways","Traversing campus remains difficult on Tuesday, June 17, 2008.","Schoon, Tim",,"University of Iowa. University News Services",2008-06-17|2008-06-17,,"Educational use only, no other permissions given. U.S. and international copyright laws may protect this item. Commercial use or distribution of this digital object is not permitted without written permission of the copyright holder.","Iowa City Flood|Flood Images|Flood, June 17, 2008",jpeg,,"Still image|Photographs",https://digital.lib.uiowa.edu/,,,,,,,,,,,,,,,,,,,,,,,,,,,,,,,,,,,,,,,,,,,,,,,,"<a href=""https://digital.lib.uiowa.edu/"" target=""_blank"">View this item in its source respository</a>",,,,,,,,,,,,,,,,,,,,,,,,,,,,,https://www.iowaheritage.org/files/original/cc61498601fb31cfe5c3729665a9b8f5.jpg,"Remote Item","Iowa City Flood",1,0
64251,https://www.iowaheritage.org/items/show/64251,"Wall St.","Wall Street|Iraq War, 2003-|Soldiers|2000-2010|Finances|War, Costs of|War|Stock market||Battlefields|Battles|Running|Bullets|Smoke|Guns","Boom; Zing","Duffy, Brian, 1955-",,"University of Iowa. Libraries. Special Collections Dept.",2003-03-24|2011-04,,"Educational use only, no other permissions given. Copyright to this digital object is owned by The Des Moines Register; it may not be downloaded, reproduced, or distributed without written permission. For more information, contact the Special Collections Department.","Editorial Cartoons of Brian Duffy; Des Moines Register Cartoonists|Papers of Brian Duffy|Des Moines Register",,English,"Still image|Editorial cartoons",MSC916|duffy-030324|http://digital.lib.uiowa.edu/cdm/ref/collection/duffy/id/89,,,,,,,,,,,,,,,,,,,,,,,,,,,,,,,,,,,,,,,,,,,,,,,,"<a href=""http://digital.lib.uiowa.edu/cdm/ref/collection/duffy/id/89"" target=""_blank"">View this item in its source respository</a>",,,,,,,,,,,,,,,,,,,,,,,,,,,,,https://www.iowaheritage.org/files/original/cf43c353175eb9512fb2e7c2ad29bd50.jpg,"Remote Item","Editorial Cartoons of Brian Duffy",1,0
64309,https://www.iowaheritage.org/items/show/64309,"Wall St.","Economy|United States|Bears|2000-2010|Economic cycles|Economic conditions|Stocks|Stock market|Bulls|Men|Roller coasters|Teeth",,"Duffy, Brian, 1955-",,"University of Iowa. Libraries. Special Collections Dept.",2008-07-13|2011-04,,"Educational use only, no other permissions given. Copyright to this digital object is owned by The Des Moines Register; it may not be downloaded, reproduced, or distributed without written permission. For more information, contact the Special Collections Department.","Editorial Cartoons of Brian Duffy; Des Moines Register Cartoonists|Papers of Brian Duffy|Des Moines Register",,English,"Still image|Editorial cartoons",MSC916|duffy-080713|http://digital.lib.uiowa.edu/cdm/ref/collection/duffy/id/147,,,,,,,,,,,,,,,,,,,,,,,,,,,,,,,,,,,,,,,,,,,,,,,,"<a href=""http://digital.lib.uiowa.edu/cdm/ref/collection/duffy/id/147"" target=""_blank"">View this item in its source respository</a>",,,,,,,,,,,,,,,,,,,,,,,,,,,,,https://www.iowaheritage.org/files/original/470091cf621babe0906537f9a91bad78.jpg,"Remote Item","Editorial Cartoons of Brian Duffy",1,0
64173,https://www.iowaheritage.org/items/show/64173,"Watch your step","Governors|Vilsack, Thomas J.|Iowa|Men|2000-2010|Public speaking|States|State governments|Budgets|Speeches|Politicians|Politics|Governors|Legislators|Judges|Gavels|Podiums|Microphones|Holes|Papers","State address; Projected budget shortfall","Duffy, Brian, 1955-",,"University of Iowa. Libraries. Special Collections Dept.",2000-01-12|2011-04,,"Educational use only, no other permissions given. Copyright to this digital object is owned by The Des Moines Register; it may not be downloaded, reproduced, or distributed without written permission. For more information, contact the Special Collections Department.","Editorial Cartoons of Brian Duffy; Des Moines Register Cartoonists|Papers of Brian Duffy|Des Moines Register",,English,"Still image|Editorial cartoons",MSC916|duffy-000112|http://digital.lib.uiowa.edu/cdm/ref/collection/duffy/id/11,,,,,,,,,,,,,,,,,,,,,,,,,,,,,,,,,,,,,,,,,,,,,,,,"<a href=""http://digital.lib.uiowa.edu/cdm/ref/collection/duffy/id/11"" target=""_blank"">View this item in its source respository</a>",,,,,,,,,,,,,,,,,,,,,,,,,,,,,https://www.iowaheritage.org/files/original/2896cc2d38f396f76fa78c4f7605c8dc.jpg,"Remote Item","Editorial Cartoons of Brian Duffy",1,0
12403,https://www.iowaheritage.org/items/show/12403,"Water pump installation near Iowa Advanced Technology Laboratories, The University of Iowa, June 14, 2008","Floods|University of Iowa|United States -- Iowa -- Iowa City|2000-2010|Evacuations|Disaster relief|Community service|Educational facilities|Water pumps|Iowa Advanced Technology Laboratories (Iowa City, Iowa)","A water pump is installed near Iowa Advanced Technology Laboratories on Saturday, June 14, 2008.","Schoon, Tim",,"University of Iowa. University News Services",2008-06-14|2008-06-14,,"Educational use only, no other permissions given. U.S. and international copyright laws may protect this item. Commercial use or distribution of this digital object is not permitted without written permission of the copyright holder.","Iowa City Flood|Flood Images|Flood preparations, June 14, 2008",jpeg,,"Still image|Photographs",https://digital.lib.uiowa.edu/,,,,,,,,,,,,,,,,,,,,,,,,,,,,,,,,,,,,,,,,,,,,,,,,"<a href=""https://digital.lib.uiowa.edu/"" target=""_blank"">View this item in its source respository</a>",,,,,,,,,,,,,,,,,,,,,,,,,,,,,https://www.iowaheritage.org/files/original/a0cf2d945fd693eed5b2fcf715a0c5a4.jpg,"Remote Item","Iowa City Flood",1,0
