 




﻿"Item Id","Item URI","Dublin Core:Title","Dublin Core:Subject","Dublin Core:Description","Dublin Core:Creator","Dublin Core:Source","Dublin Core:Publisher","Dublin Core:Date","Dublin Core:Contributor","Dublin Core:Rights","Dublin Core:Relation","Dublin Core:Format","Dublin Core:Language","Dublin Core:Type","Dublin Core:Identifier","Dublin Core:Coverage","Item Type Metadata:Text","Item Type Metadata:Interviewer","Item Type Metadata:Interviewee","Item Type Metadata:Location","Item Type Metadata:Transcription","Item Type Metadata:Local URL","Item Type Metadata:Original Format","Item Type Metadata:Physical Dimensions","Item Type Metadata:Duration","Item Type Metadata:Compression","Item Type Metadata:Producer","Item Type Metadata:Director","Item Type Metadata:Bit Rate/Frequency","Item Type Metadata:Time Summary","Item Type Metadata:Email Body","Item Type Metadata:Subject Line","Item Type Metadata:From","Item Type Metadata:To","Item Type Metadata:CC","Item Type Metadata:BCC","Item Type Metadata:Number of Attachments","Item Type Metadata:Standards","Item Type Metadata:Objectives","Item Type Metadata:Materials","Item Type Metadata:Lesson Plan Text","Item Type Metadata:URL","Item Type Metadata:Event Type","Item Type Metadata:Participants","Item Type Metadata:Birth Date","Item Type Metadata:Birthplace","Item Type Metadata:Death Date","Item Type Metadata:Occupation","Item Type Metadata:Biographical Text","Item Type Metadata:Bibliography","Item Type Metadata:Digital Reproduction Information","Item Type Metadata:Repository","Item Type Metadata:Repository Collection","Item Type Metadata:Contact information.","Item Type Metadata:File Name","Item Type Metadata:Notes","Item Type Metadata:Digital item created","Item Type Metadata:Digital item modified","Item Type Metadata:Executive Orders","Item Type Metadata:Record Created","Item Type Metadata:Record Modified","Item Type Metadata:Transcription2","Item Type Metadata:Source URL","Omeka Legacy File:Additional Creator","Omeka Legacy File:Transcriber","Omeka Legacy File:Producer","Omeka Legacy File:Render Device","Omeka Legacy File:Render Details","Omeka Legacy File:Capture Date","Omeka Legacy File:Capture Device","Omeka Legacy File:Capture Details","Omeka Legacy File:Change History","Omeka Legacy File:Watermark","Omeka Legacy File:Encryption","Omeka Legacy File:Compression","Omeka Legacy File:Post Processing","Omeka Image File:Width","Omeka Image File:Height","Omeka Image File:Bit Depth","Omeka Image File:Channels","Omeka Image File:Exif String","Omeka Image File:Exif Array","Omeka Image File:IPTC String","Omeka Image File:IPTC Array","Omeka Video File:Bitrate","Omeka Video File:Duration","Omeka Video File:Sample Rate","Omeka Video File:Codec","Omeka Video File:Width","Omeka Video File:Height",tags,file,itemType,collection,public,featured
2152,https://www.iowaheritage.org/items/show/2152,"Drake Relays, 1975","Track athletics--Iowa--Des Moines|Relay racing--Iowa--Des Moines|Athletes--Kansas","Runners compete in the One-Mile Relay at the 1975 Drake Relays. Kansas won the event with a time of 3:06.3","Clinton, John D.","Special Collections, Cowles Library -- Drake University.",,1975,,"U.S. and International copyright laws protect this digital image. Commercial use or distribution of the image is not permitted without prior permission of the copyright holder. For permission to use the digital image, please contact: bart.schmidt@drake.edu","Drake Relays Digital Archive","35 mm color slide",,Image,"dr00325|http://ddr.lib.drake.edu/u?/du-relays,225",,,,,,,,,,,,,,,,,,,,,,,,,,,,,,,,,,,,,,,,,,,,,,,,"<a href=""http://ddr.lib.drake.edu/u?/du-relays,225"" target=""_blank"">View this item in its source respository</a>",,,,,,,,,,,,,,,,,,,,,,,,,,,,,https://www.iowaheritage.org/files/original/5b899be6b952af058279c1844d95deff.jpg,"Remote Item","Drake Relays Digital Archive",1,0
2151,https://www.iowaheritage.org/items/show/2151,"Drake Relays, 1980s","Track athletics--Iowa--Des Moines|Sports spectators--Iowa--Des Moines","An unknown spectator enjoys the Drake Relays in the early 1980s.","Clinton, John D.","Special Collections, Cowles Library -- Drake University.",,,,"U.S. and International copyright laws protect this digital image. Commercial use or distribution of the image is not permitted without prior permission of the copyright holder. For permission to use the digital image, please contact: bart.schmidt@drake.edu","Drake Relays Digital Archive","35 mm color slide",,Image,"dr00323|http://ddr.lib.drake.edu/u?/du-relays,224",,,,,,,,,,,,,,,,,,,,,,,,,,,,,,,,,,,,,,,,,,,,,,,,"<a href=""http://ddr.lib.drake.edu/u?/du-relays,224"" target=""_blank"">View this item in its source respository</a>",,,,,,,,,,,,,,,,,,,,,,,,,,,,,https://www.iowaheritage.org/files/original/142ac505090420c27199dd5706687bce.jpg,"Remote Item","Drake Relays Digital Archive",1,0
2150,https://www.iowaheritage.org/items/show/2150,"Drake Relays, 1981","Track athletics--Iowa--Des Moines|Relay racing--Iowa--Des Moines|Athletes--Iowa","Runners from Northern Iowa University and North Dakota State University compete in the 4 x 1,600-Meter Relay at the 1981 Drake Relays.","Clinton, John D.","Special Collections, Cowles Library -- Drake University.",,1981,,"U.S. and International copyright laws protect this digital image. Commercial use or distribution of the image is not permitted without prior permission of the copyright holder. For permission to use the digital image, please contact: bart.schmidt@drake.edu","Drake Relays Digital Archive","35 mm color slide",,Image,"dr00320|http://ddr.lib.drake.edu/u?/du-relays,222",,,,,,,,,,,,,,,,,,,,,,,,,,,,,,,,,,,,,,,,,,,,,,,,"<a href=""http://ddr.lib.drake.edu/u?/du-relays,222"" target=""_blank"">View this item in its source respository</a>",,,,,,,,,,,,,,,,,,,,,,,,,,,,,https://www.iowaheritage.org/files/original/d1cd7696a49e5fffc2b5ebf3adf4dfe0.jpg,"Remote Item","Drake Relays Digital Archive",1,0
2149,https://www.iowaheritage.org/items/show/2149,"Drake Relays, 1981, Darryl Simmons","Track athletics--Iowa--Des Moines|Jumping--Iowa--Des Moines|Athletes--Georgia","Darryl Simmons of the University of Georgia won the long jump with a distance of 25-0 at the 1981 Drake Relays.","Clinton, John D.","Special Collections, Cowles Library -- Drake University.",,1981,,"U.S. and International copyright laws protect this digital image. Commercial use or distribution of the image is not permitted without prior permission of the copyright holder. For permission to use the digital image, please contact: bart.schmidt@drake.edu","Drake Relays Digital Archive","35 mm color slide",,Image,"dr00319|http://ddr.lib.drake.edu/u?/du-relays,221",,,,,,,,,,,,,,,,,,,,,,,,,,,,,,,,,,,,,,,,,,,,,,,,"<a href=""http://ddr.lib.drake.edu/u?/du-relays,221"" target=""_blank"">View this item in its source respository</a>",,,,,,,,,,,,,,,,,,,,,,,,,,,,,https://www.iowaheritage.org/files/original/df66df46c3e4bf6ba6d05966f8083c58.jpg,"Remote Item","Drake Relays Digital Archive",1,0
2148,https://www.iowaheritage.org/items/show/2148,"Drake Relays, 1980s, Relay Race","Track athletics--Iowa--Des Moines|Relay racing--Iowa--Des Moines","Runners in an unidentified distance relay.","Clinton, John D.","Special Collections, Cowles Library -- Drake University.",,,,"U.S. and International copyright laws protect this digital image. Commercial use or distribution of the image is not permitted without prior permission of the copyright holder. For permission to use the digital image, please contact: bart.schmidt@drake.edu","Drake Relays Digital Archive","35 mm color slide",,Image,"dr00318|http://ddr.lib.drake.edu/u?/du-relays,220",,,,,,,,,,,,,,,,,,,,,,,,,,,,,,,,,,,,,,,,,,,,,,,,"<a href=""http://ddr.lib.drake.edu/u?/du-relays,220"" target=""_blank"">View this item in its source respository</a>",,,,,,,,,,,,,,,,,,,,,,,,,,,,,https://www.iowaheritage.org/files/original/fb6eb23d7ed2d57f99693a090cccd930.jpg,"Remote Item","Drake Relays Digital Archive",1,0
2147,https://www.iowaheritage.org/items/show/2147,"Drake Relays, 1970s, Relay Race","Track athletics--Iowa--Des Moines|Relay racing--Iowa--Des Moines","Women running in an unidentified relay race.","Clinton, John D.","Special Collections, Cowles Library -- Drake University.",,,,"U.S. and International copyright laws protect this digital image. Commercial use or distribution of the image is not permitted without prior permission of the copyright holder. For permission to use the digital image, please contact: bart.schmidt@drake.edu","Drake Relays Digital Archive","35 mm color slide",,Image,"dr00317|http://ddr.lib.drake.edu/u?/du-relays,219",,,,,,,,,,,,,,,,,,,,,,,,,,,,,,,,,,,,,,,,,,,,,,,,"<a href=""http://ddr.lib.drake.edu/u?/du-relays,219"" target=""_blank"">View this item in its source respository</a>",,,,,,,,,,,,,,,,,,,,,,,,,,,,,https://www.iowaheritage.org/files/original/6cb8cc4397d1aa25db16e8f146d02173.jpg,"Remote Item","Drake Relays Digital Archive",1,0
2146,https://www.iowaheritage.org/items/show/2146,"Drake Relays, 1970s, Randy Jackson","Track athletics--Iowa--Des Moines|Athletes--Wisconsin|","Randy Jackson of Wisconsin lands in water pit of steeplechase. Jackson won the steeplechase in 1979 with a time of 8:42.43 and in 1980 with a time of 8:42.17.","Clinton, John D.","Special Collections, Cowles Library -- Drake University.",,,,"U.S. and International copyright laws protect this digital image. Commercial use or distribution of the image is not permitted without prior permission of the copyright holder. For permission to use the digital image, please contact: bart.schmidt@drake.edu","Drake Relays Digital Archive","35 mm color slide",,Image,"dr00316|http://ddr.lib.drake.edu/u?/du-relays,218",,,,,,,,,,,,,,,,,,,,,,,,,,,,,,,,,,,,,,,,,,,,,,,,"<a href=""http://ddr.lib.drake.edu/u?/du-relays,218"" target=""_blank"">View this item in its source respository</a>",,,,,,,,,,,,,,,,,,,,,,,,,,,,,https://www.iowaheritage.org/files/original/9969c8b2f0f1ad48e9d1be9779006d41.jpg,"Remote Item","Drake Relays Digital Archive",1,0
2145,https://www.iowaheritage.org/items/show/2145,"Drake Relays, 1980s, Beautiful Bulldog","Track athletics--Iowa--Des Moines|Bulldogs--Iowa--Des Moines","Winner of the Beautiful Bulldog Contest, who also makes an appearance on the cover of the 75th anniversary book of the Drake Relays.","Clinton, John D.","Special Collections, Cowles Library -- Drake University.",,,,"U.S. and International copyright laws protect this digital image. Commercial use or distribution of the image is not permitted without prior permission of the copyright holder. For permission to use the digital image, please contact: bart.schmidt@drake.edu","Drake Relays Digital Archive","35 mm color slide|2005/7/21",,Image,"dr00312|http://ddr.lib.drake.edu/u?/du-relays,217",,,,,,,,,,,,,,,,,,,,,,,,,,,,,,,,,,,,,,,,,,,,,,,,"<a href=""http://ddr.lib.drake.edu/u?/du-relays,217"" target=""_blank"">View this item in its source respository</a>",,,,,,,,,,,,,,,,,,,,,,,,,,,,,https://www.iowaheritage.org/files/original/c57336a71f481fd27775b79a683f2c20.jpg,"Remote Item","Drake Relays Digital Archive",1,0
2144,https://www.iowaheritage.org/items/show/2144,"Drake Relays, Cindy Bremser","Track athletics--Iowa--Des Moines|Athletes--Wisconsin","Cindy Bremser competed in the 1984 Summer Olympics and finished fourth in the women's 3,000-meter run. She went to the University of Wisconsin and in 1985 had been competing in the Relays for 10 consecutive years.","Clinton, John D.","Special Collections, Cowles Library -- Drake University.",,,,"U.S. and International copyright laws protect this digital image. Commercial use or distribution of the image is not permitted without prior permission of the copyright holder. For permission to use the digital image, please contact: bart.schmidt@drake.edu","Drake Relays Digital Archive","35 mm color slide",,Image,"dr00311|http://ddr.lib.drake.edu/u?/du-relays,216",,,,,,,,,,,,,,,,,,,,,,,,,,,,,,,,,,,,,,,,,,,,,,,,"<a href=""http://ddr.lib.drake.edu/u?/du-relays,216"" target=""_blank"">View this item in its source respository</a>",,,,,,,,,,,,,,,,,,,,,,,,,,,,,https://www.iowaheritage.org/files/original/2ab445c12d8d69436e2e35a93951366c.jpg,"Remote Item","Drake Relays Digital Archive",1,0
2143,https://www.iowaheritage.org/items/show/2143,"Drake Relays, 1959, Alex Henderson","Track athletics--Iowa--Des Moines|Athletes--Arizona","Alex Henderson of Arizona State University in the Two-Mile Run. Henderson won the event in 1959 with a time of 8:57.4. He also won in 1958 with a time of 8:51.3, a Drake Relays record. Henderson held the American Collegiate Record with a time of 8:46.3.","Clinton, John D.","Special Collections, Cowles Library -- Drake University.",,1959,,"U.S. and International copyright laws protect this digital image. Commercial use or distribution of the image is not permitted without prior permission of the copyright holder. For permission to use the digital image, please contact: bart.schmidt@drake.edu","Drake Relays Digital Archive","35 mm color slide",,Image,"dr00309|http://ddr.lib.drake.edu/u?/du-relays,214",,,,,,,,,,,,,,,,,,,,,,,,,,,,,,,,,,,,,,,,,,,,,,,,"<a href=""http://ddr.lib.drake.edu/u?/du-relays,214"" target=""_blank"">View this item in its source respository</a>",,,,,,,,,,,,,,,,,,,,,,,,,,,,,https://www.iowaheritage.org/files/original/2e24df43fd5e9d3894329cc79ebaa0c4.jpg,"Remote Item","Drake Relays Digital Archive",1,0
