 




﻿"Item Id","Item URI","Dublin Core:Title","Dublin Core:Subject","Dublin Core:Description","Dublin Core:Creator","Dublin Core:Source","Dublin Core:Publisher","Dublin Core:Date","Dublin Core:Contributor","Dublin Core:Rights","Dublin Core:Relation","Dublin Core:Format","Dublin Core:Language","Dublin Core:Type","Dublin Core:Identifier","Dublin Core:Coverage","Item Type Metadata:Text","Item Type Metadata:Interviewer","Item Type Metadata:Interviewee","Item Type Metadata:Location","Item Type Metadata:Transcription","Item Type Metadata:Local URL","Item Type Metadata:Original Format","Item Type Metadata:Physical Dimensions","Item Type Metadata:Duration","Item Type Metadata:Compression","Item Type Metadata:Producer","Item Type Metadata:Director","Item Type Metadata:Bit Rate/Frequency","Item Type Metadata:Time Summary","Item Type Metadata:Email Body","Item Type Metadata:Subject Line","Item Type Metadata:From","Item Type Metadata:To","Item Type Metadata:CC","Item Type Metadata:BCC","Item Type Metadata:Number of Attachments","Item Type Metadata:Standards","Item Type Metadata:Objectives","Item Type Metadata:Materials","Item Type Metadata:Lesson Plan Text","Item Type Metadata:URL","Item Type Metadata:Event Type","Item Type Metadata:Participants","Item Type Metadata:Birth Date","Item Type Metadata:Birthplace","Item Type Metadata:Death Date","Item Type Metadata:Occupation","Item Type Metadata:Biographical Text","Item Type Metadata:Bibliography","Item Type Metadata:Digital Reproduction Information","Item Type Metadata:Repository","Item Type Metadata:Repository Collection","Item Type Metadata:Contact information.","Item Type Metadata:File Name","Item Type Metadata:Notes","Item Type Metadata:Digital item created","Item Type Metadata:Digital item modified","Item Type Metadata:Executive Orders","Item Type Metadata:Record Created","Item Type Metadata:Record Modified","Item Type Metadata:Transcription2","Item Type Metadata:Source URL","Omeka Legacy File:Additional Creator","Omeka Legacy File:Transcriber","Omeka Legacy File:Producer","Omeka Legacy File:Render Device","Omeka Legacy File:Render Details","Omeka Legacy File:Capture Date","Omeka Legacy File:Capture Device","Omeka Legacy File:Capture Details","Omeka Legacy File:Change History","Omeka Legacy File:Watermark","Omeka Legacy File:Encryption","Omeka Legacy File:Compression","Omeka Legacy File:Post Processing","Omeka Image File:Width","Omeka Image File:Height","Omeka Image File:Bit Depth","Omeka Image File:Channels","Omeka Image File:Exif String","Omeka Image File:Exif Array","Omeka Image File:IPTC String","Omeka Image File:IPTC Array","Omeka Video File:Bitrate","Omeka Video File:Duration","Omeka Video File:Sample Rate","Omeka Video File:Codec","Omeka Video File:Width","Omeka Video File:Height",tags,file,itemType,collection,public,featured
2252,https://www.iowaheritage.org/items/show/2252,"Drake Relays, 1980, Steve Scott","Track athletics--Iowa--Des Moines|Athletes","Steve Scott wins the 800-Meter Run with a time of 1:46.79. Other runners are: Evans White (in green), Randy Wilson (Athletic Attic), Peter Lemashon (orange shorts) and Mike Boit (behind Lemashon).",,"Special Collections, Cowles Library -- Drake University.",,1980,,"U.S. and International copyright laws protect this digital image. Commercial use or distribution of the image is not permitted without prior permission of the copyright holder. For permission to use the digital image, please contact: bart.schmidt@drake.edu","Drake Relays Digital Archive","35 mm color slide",,Image,"dr00450|http://ddr.lib.drake.edu/u?/du-relays,361",,,,,,,,,,,,,,,,,,,,,,,,,,,,,,,,,,,,,,,,,,,,,,,,"<a href=""http://ddr.lib.drake.edu/u?/du-relays,361"" target=""_blank"">View this item in its source respository</a>",,,,,,,,,,,,,,,,,,,,,,,,,,,,,https://www.iowaheritage.org/files/original/05fe7da473f0c092a4c8eb63251a5be8.jpg,"Remote Item","Drake Relays Digital Archive",1,0
2251,https://www.iowaheritage.org/items/show/2251,"Drake Relays, 1980, Steve Scott","Track athletics--Iowa--Des Moines|Athletes","Steve Scott after winning the 800-Meter Run in 1:46.79. In the background, wearing No. 102, is Mike Boit.","Clinton, John D.","Special Collections, Cowles Library -- Drake University.",,1980,,"U.S. and International copyright laws protect this digital image. Commercial use or distribution of the image is not permitted without prior permission of the copyright holder. For permission to use the digital image, please contact: bart.schmidt@drake.edu","Drake Relays Digital Archive","35 mm color slide",,Image,"dr00451|http://ddr.lib.drake.edu/u?/du-relays,360",,,,,,,,,,,,,,,,,,,,,,,,,,,,,,,,,,,,,,,,,,,,,,,,"<a href=""http://ddr.lib.drake.edu/u?/du-relays,360"" target=""_blank"">View this item in its source respository</a>",,,,,,,,,,,,,,,,,,,,,,,,,,,,,https://www.iowaheritage.org/files/original/b88f0d97fdd1cc8fe68a53cb50b52d74.jpg,"Remote Item","Drake Relays Digital Archive",1,0
2250,https://www.iowaheritage.org/items/show/2250,"Drake Relays, 1962","Track athletics--Iowa--Des Moines|Relay racing--Iowa--Des Moines|Athletes--Kansas","Kansas' Ted Riesinger hands off to Bill Dotson in the Four-Mile Relay.  Kansas won the event with a time of 16:57.0. Team members were Mike Fulghum, Bill Thornton, Riesinger and Dotson.",,"Special Collections, Cowles Library -- Drake University.",,1962,,"U.S. and International copyright laws protect this digital image. Commercial use or distribution of the image is not permitted without prior permission of the copyright holder. For permission to use the digital image, please contact: bart.schmidt@drake.edu","Drake Relays Digital Archive","Photographic print, 8 x 10 in.",,Image,"dr00453|http://ddr.lib.drake.edu/u?/du-relays,358",,,,,,,,,,,,,,,,,,,,,,,,,,,,,,,,,,,,,,,,,,,,,,,,"<a href=""http://ddr.lib.drake.edu/u?/du-relays,358"" target=""_blank"">View this item in its source respository</a>",,,,,,,,,,,,,,,,,,,,,,,,,,,,,https://www.iowaheritage.org/files/original/53d283090a9b1db19b54bd79e40708a9.jpg,"Remote Item","Drake Relays Digital Archive",1,0
2249,https://www.iowaheritage.org/items/show/2249,"Drake Relays, 1962","Track athletics--Iowa--Des Moines|Relay racing--Iowa--Des Moines|Athletes--Texas","Baylor leads Missouri, Drake, and other schools at the first handoff of the 1962 Mile Relay. The University of Missouri team, made up of David Stormer, Bill Rawson, Greg Pelster and Jim Baker won the event with a time of  3:11.6.",,"Special Collections, Cowles Library -- Drake University.",,1962,,"U.S. and International copyright laws protect this digital image. Commercial use or distribution of the image is not permitted without prior permission of the copyright holder. For permission to use the digital image, please contact: bart.schmidt@drake.edu","Drake Relays Digital Archive","Photographic print, 8 x 10 in.",,Image,"dr00454|http://ddr.lib.drake.edu/u?/du-relays,357",,,,,,,,,,,,,,,,,,,,,,,,,,,,,,,,,,,,,,,,,,,,,,,,"<a href=""http://ddr.lib.drake.edu/u?/du-relays,357"" target=""_blank"">View this item in its source respository</a>",,,,,,,,,,,,,,,,,,,,,,,,,,,,,https://www.iowaheritage.org/files/original/ecbe9cff1d3fde2e68f4c9559f9951e7.jpg,"Remote Item","Drake Relays Digital Archive",1,0
2248,https://www.iowaheritage.org/items/show/2248,"Drake Relays, 1956, Dave Sime","Track athletics--Iowa--Des Moines|Athletes--North Carolina|Athletes--Michigan","Duke's Dave Sime beats Michigan State's Ed Brabham in the 100-Yard Dash with a time of :09.4.",,"Special Collections, Cowles Library -- Drake University.",,1956,,"U.S. and International copyright laws protect this digital image. Commercial use or distribution of the image is not permitted without prior permission of the copyright holder. For permission to use the digital image, please contact: bart.schmidt@drake.edu","Drake Relays Digital Archive","Photographic print, 8 x 10 in.",,Image,"dr00455|http://ddr.lib.drake.edu/u?/du-relays,356",,,,,,,,,,,,,,,,,,,,,,,,,,,,,,,,,,,,,,,,,,,,,,,,"<a href=""http://ddr.lib.drake.edu/u?/du-relays,356"" target=""_blank"">View this item in its source respository</a>",,,,,,,,,,,,,,,,,,,,,,,,,,,,,https://www.iowaheritage.org/files/original/5121f5049befbdabc1b2c05d944ac2f2.jpg,"Remote Item","Drake Relays Digital Archive",1,0
2247,https://www.iowaheritage.org/items/show/2247,"Drake Relays, 1953, Distance Medley Relay","Track athletics--Iowa--Des Moines|Athletes--Washington (D.C.)","Georgetown gets their awards after winning the Distance Medley Relay with a time of 10:06. Charles J. Capozzoli, far right, ran the anchor leg with a time of 4:17. Other team members are Vincent Kelly, Carl Joyce, Joe LaPierre. As the mud, towels and empty stands imply, the 1953 Relays were on the soggy side.",,"Special Collections, Cowles Library -- Drake University.",,1953,,"U.S. and International copyright laws protect this digital image. Commercial use or distribution of the image is not permitted without prior permission of the copyright holder. For permission to use the digital image, please contact: bart.schmidt@drake.edu","Drake Relays Digital Archive","Photographic print, 8 x 10 in.",,Image,"dr00458|http://ddr.lib.drake.edu/u?/du-relays,353",,,,,,,,,,,,,,,,,,,,,,,,,,,,,,,,,,,,,,,,,,,,,,,,"<a href=""http://ddr.lib.drake.edu/u?/du-relays,353"" target=""_blank"">View this item in its source respository</a>",,,,,,,,,,,,,,,,,,,,,,,,,,,,,https://www.iowaheritage.org/files/original/516dde5f88b401a2344994ab8fef9778.jpg,"Remote Item","Drake Relays Digital Archive",1,0
2246,https://www.iowaheritage.org/items/show/2246,"Drake Relays, 1962","Track athletics--Iowa--Des Moines|Relay racing--Iowa--Des Moines|Athletes--Iowa","Runners from Adel and Pella Christian on the handoff in the High School Sprint Medley Relay during the 1962 Drake Relays.",,"Special Collections, Cowles Library -- Drake University.",,1962,,"U.S. and International copyright laws protect this digital image. Commercial use or distribution of the image is not permitted without prior permission of the copyright holder. For permission to use the digital image, please contact: bart.schmidt@drake.edu","Drake Relays Digital Archive","Photographic print, 8 x 10 in.",,Image,"dr00459|http://ddr.lib.drake.edu/u?/du-relays,352",,,,,,,,,,,,,,,,,,,,,,,,,,,,,,,,,,,,,,,,,,,,,,,,"<a href=""http://ddr.lib.drake.edu/u?/du-relays,352"" target=""_blank"">View this item in its source respository</a>",,,,,,,,,,,,,,,,,,,,,,,,,,,,,https://www.iowaheritage.org/files/original/f79e54cb21a0bc6eab03fc0f511cab4e.jpg,"Remote Item","Drake Relays Digital Archive",1,0
2245,https://www.iowaheritage.org/items/show/2245,"Drake Relays, 1934, Martha Stull","Track athletics--Iowa--Des Moines|Queens--Drake Relays","Drake Relays Queen Martha Stull, center, with two of her Drake Attendees. Ms. Stull was from Northwestern University.  The attendees that year were Frances Ewing, Joe Loe, Nadine Ingleman, Lois Demmon, Josephine Peterson and Gladys Accola.",,"Special Collections, Cowles Library -- Drake University.",,1934,,"U.S. and International copyright laws protect this digital image. Commercial use or distribution of the image is not permitted without prior permission of the copyright holder. For permission to use the digital image, please contact: bart.schmidt@drake.edu","Drake Relays Digital Archive","Photographic print, 8x 10 in.",,Image,"dr00460|http://ddr.lib.drake.edu/u?/du-relays,350",,,,,,,,,,,,,,,,,,,,,,,,,,,,,,,,,,,,,,,,,,,,,,,,"<a href=""http://ddr.lib.drake.edu/u?/du-relays,350"" target=""_blank"">View this item in its source respository</a>",,,,,,,,,,,,,,,,,,,,,,,,,,,,,https://www.iowaheritage.org/files/original/2e2c5b12e640bbc7e36603992fb587d6.jpg,"Remote Item","Drake Relays Digital Archive",1,0
2244,https://www.iowaheritage.org/items/show/2244,"Drake Relays, 1962, Colin Ridgway","Track athletics--Iowa--Des Moines|Jumping--Iowa--Des Moines|Athletes--Texas","Colin Ridgway of Lamar Tech (Texas) wins the high jump with a height of 6'-7.75"".",,"Special Collections, Cowles Library -- Drake University.",,1962,,"U.S. and International copyright laws protect this digital image. Commercial use or distribution of the image is not permitted without prior permission of the copyright holder. For permission to use the digital image, please contact: bart.schmidt@drake.edu","Drake Relays Digital Archive","Photographic print, 8 x 10 in.",,Image,"dr00462|http://ddr.lib.drake.edu/u?/du-relays,349",,,,,,,,,,,,,,,,,,,,,,,,,,,,,,,,,,,,,,,,,,,,,,,,"<a href=""http://ddr.lib.drake.edu/u?/du-relays,349"" target=""_blank"">View this item in its source respository</a>",,,,,,,,,,,,,,,,,,,,,,,,,,,,,https://www.iowaheritage.org/files/original/b0b5c702a56b64dc2cb00ea4b5acd6b4.jpg,"Remote Item","Drake Relays Digital Archive",1,0
2243,https://www.iowaheritage.org/items/show/2243,"Drake Relays, 1947","Track athletics--Iowa--Des Moines|Relay racing--Iowa--Des Moines|Athletes--Texas","Texas won the 440-Yard Relay with a time of :41.2. These same runners also won the 880-Yard Relay with a time of 1:25.9. Runners on both teams were Perry Samuels, Charles Tatom, Allen Lawler and Charles Parker.",,"Special Collections, Cowles Library -- Drake University.",,1947,,"U.S. and International copyright laws protect this digital image. Commercial use or distribution of the image is not permitted without prior permission of the copyright holder. For permission to use the digital image, please contact: bart.schmidt@drake.edu","Drake Relays Digital Archive","B&W photographic print, 14 x 11 in.|450",,Image,"dr00465|http://ddr.lib.drake.edu/u?/du-relays,346",,,,,,,,,,,,,,,,,,,,,,,,,,,,,,,,,,,,,,,,,,,,,,,,"<a href=""http://ddr.lib.drake.edu/u?/du-relays,346"" target=""_blank"">View this item in its source respository</a>",,,,,,,,,,,,,,,,,,,,,,,,,,,,,https://www.iowaheritage.org/files/original/facaf0f5b3924fdba66b405ad5dc8b08.jpg,"Remote Item","Drake Relays Digital Archive",1,0
