 




﻿"Item Id","Item URI","Dublin Core:Title","Dublin Core:Subject","Dublin Core:Description","Dublin Core:Creator","Dublin Core:Source","Dublin Core:Publisher","Dublin Core:Date","Dublin Core:Contributor","Dublin Core:Rights","Dublin Core:Relation","Dublin Core:Format","Dublin Core:Language","Dublin Core:Type","Dublin Core:Identifier","Dublin Core:Coverage","Item Type Metadata:Text","Item Type Metadata:Interviewer","Item Type Metadata:Interviewee","Item Type Metadata:Location","Item Type Metadata:Transcription","Item Type Metadata:Local URL","Item Type Metadata:Original Format","Item Type Metadata:Physical Dimensions","Item Type Metadata:Duration","Item Type Metadata:Compression","Item Type Metadata:Producer","Item Type Metadata:Director","Item Type Metadata:Bit Rate/Frequency","Item Type Metadata:Time Summary","Item Type Metadata:Email Body","Item Type Metadata:Subject Line","Item Type Metadata:From","Item Type Metadata:To","Item Type Metadata:CC","Item Type Metadata:BCC","Item Type Metadata:Number of Attachments","Item Type Metadata:Standards","Item Type Metadata:Objectives","Item Type Metadata:Materials","Item Type Metadata:Lesson Plan Text","Item Type Metadata:URL","Item Type Metadata:Event Type","Item Type Metadata:Participants","Item Type Metadata:Birth Date","Item Type Metadata:Birthplace","Item Type Metadata:Death Date","Item Type Metadata:Occupation","Item Type Metadata:Biographical Text","Item Type Metadata:Bibliography","Item Type Metadata:Digital Reproduction Information","Item Type Metadata:Repository","Item Type Metadata:Repository Collection","Item Type Metadata:Contact information.","Item Type Metadata:File Name","Item Type Metadata:Notes","Item Type Metadata:Digital item created","Item Type Metadata:Digital item modified","Item Type Metadata:Executive Orders","Item Type Metadata:Record Created","Item Type Metadata:Record Modified","Item Type Metadata:Transcription2","Item Type Metadata:Source URL","Omeka Legacy File:Additional Creator","Omeka Legacy File:Transcriber","Omeka Legacy File:Producer","Omeka Legacy File:Render Device","Omeka Legacy File:Render Details","Omeka Legacy File:Capture Date","Omeka Legacy File:Capture Device","Omeka Legacy File:Capture Details","Omeka Legacy File:Change History","Omeka Legacy File:Watermark","Omeka Legacy File:Encryption","Omeka Legacy File:Compression","Omeka Legacy File:Post Processing","Omeka Image File:Width","Omeka Image File:Height","Omeka Image File:Bit Depth","Omeka Image File:Channels","Omeka Image File:Exif String","Omeka Image File:Exif Array","Omeka Image File:IPTC String","Omeka Image File:IPTC Array","Omeka Video File:Bitrate","Omeka Video File:Duration","Omeka Video File:Sample Rate","Omeka Video File:Codec","Omeka Video File:Width","Omeka Video File:Height",tags,file,itemType,collection,public,featured
96938,https://www.iowaheritage.org/items/show/96938,"  Clarke County Soil and Water Conservation District Scrapbook, 1978 - 1983","Clarke County Soil and Water Conservation District |Whitebreast Watershed |No-Till|Soil Survey |Newsletter - 1979","Scrapbook contains clippings from the Osceola Tribune & Sentinel gathered by the district office from 1978-1983. Articles focus on various soil and water conservation activities within Clarke County including Whitebreast Watershed, No-Till efforts, Soil Survey, and district newsletter from 1979.","Clarke County Soil and Water Conservation District|Osceola Tribune |Osceola Sentinel ",,"State Library of Iowa","1978-06 to 1983-08","Clarke County Soil and Water Conservation District of Iowa. For questions about copyright, contact the State Library of Iowa at  <a href=""http://www.statelibraryofiowa.org"">http://www.statelibraryofiowa.org</a>.","This item is protected by copyright and/or related rights. Your are free to use this Item in any way that is permitted by the copyright and related rights legislation that applies to your use. For other uses you need to obtain permission from the rights-holder(s). <a href=""http://rightsstatements.org/"">http://rightsstatements.org</a>",,pdf,eng,"Text; Scrapbook ",,,,,,,,,,,,,,,,,,,,,,,,,,,,,,,,,,,,,,,,,OCRJune_1978_August_1983,,,,,,,,,,,,,,,,,,,,,,,,,,,,,,,,,,,,"12-Mile Creek Watershed,Adrian Fuller,Allen Weeda,Ashgar Chowdhery,Byron Bay,Cecil Marquis,Clarke County Soil and Water Conservation District,Conservation Education,Corey Quayle,East Lake Park,Ed Ratashak,Enquist-Murray Farm,Ervin Koss,Herman Gracey,Interseeder,J. Kirkpatrick,Jim Nelson,John Klein,Justin Tindle,Keith Davis,Keith Edwards,Lavern Hildreth,Louis Boeckman,Melvin Moe,Mr. and Mrs. Brad Shipman,News Clipping,Newsletter,No Till,No-Till Tours,R,Redfern Timber Reserve,Robert Toland,Ron Kuehl,Sally Gearhart,Scrapbook,Soil Conservation Week,Soil Erosion,Soil Survey,Steve Ernst,Steve Shaw,Steve Squier,Switchgrass,Tom Carson,Tree Planting,W.W. Reynoldson,Wendal Saunders,Wendell Christensen,West Lake,West Lake Dam Project,Whitebreast Watershed Project,Windbreaks",https://www.iowaheritage.org/files/original/98097f0c3cb6d6042a5ab17080cc5782.pdf,Document,"Clarke County Soil and Water Conservation District Historical Collection",1,0
96929,https://www.iowaheritage.org/items/show/96929,"  Clarke County Soil and Water Conservation District Scrapbook, 1975-1978","Clarke County Soil and Water Conservation District |Whitebreast Watershed|West Lake Reservoir|East Lake Dam Project |Seven-County Rural Water System ","Scrapbook containing news clippings gathered by the district office from 1975 to 1978. Articles from Osceola Tribune and Osceola Sentinel feature Seven-County Rural Water System, Whitebreast Watershed, East Lake Dam Project, and the 'Practice Conservation' series. ","Clarke County Soil and Water Conservation District","Osceola Tribune |Osceola Sentinel ","State Library of Iowa","1975 to 1978","Clarke County Soil and Water Conservation District of Iowa. For questions about copyright, contact the State Library of Iowa at  <a href=""http://www.statelibraryofiowa.org"">http://www.statelibraryofiowa.org</a>.","This item is protected by copyright and/or related rights. Your are free to use this Item in any way that is permitted by the copyright and related rights legislation that applies to your use. For other uses you need to obtain permission from the rights-holder(s). <a href=""http://rightsstatements.org/"">http://rightsstatements.org</a>",,pdf,eng,"Text; Scrapbook ",,,,,,,,,,,,,,,,,,,,,,,,,,,,,,,,,,,,,,,,,OCR1975_1978_,,,,,,,,,,,,,,,,,,,,,,,,,,,,,,,,,,,,"""Practice Conservation"" Keith Ticknor,Adrian Fuller,Alan Teel,Arlene Garner,Belinda Wickham,Clarke County Soil and Water Conservation District,Conservation Awards,Doyce Miller,East Lake Dam Project,Frank Riley,Greg Kent,Herbert Kayser,Herman Gracey,Jim Calhoun,Keith Edwards,Keith Ticknor,Kenneth Henry,Kirk Ticknor,Laura Lewis,Little River Watershed,Ralph Squier,Red Stamand,Richard Gonseth,Seven-County Rural Water System,Soil Erosion,Soil Survey,Southern Iowa Basin,Steve Squier,Tree Planting,West Lake Reservoir,Whitebreast Creek,Whitebreast Watershed Project",https://www.iowaheritage.org/files/original/a5bb203785a0929189cae510d41b731b.pdf,Document,"Clarke County Soil and Water Conservation District Historical Collection",1,0
96751,https://www.iowaheritage.org/items/show/96751,"  Clarke County Soil and Water Conservation District Scrapbook, 1972 - 1973","Clarke County Soil and Water Conservation District|Watersheds|Soil and Water Conservation |Annual Report, 1972|""New Ideas for Pasture"" series","Scrapbook contains news clippings gathered by the district office from June 1963 to August 1967. Articles focus on watershed, conservation projects, district elections, ""New Ideas for Pasture"" series, and conservation news.","Clarke County Soil and Water Conservation District",,"State Library of Iowa","1972-01 to 1973-07","Clarke County Soil and Water Conservation District of Iowa. For questions about copyright, contact the State Library of Iowa at  <a href=""http://www.statelibraryofiowa.org"">http://www.statelibraryofiowa.org</a>.","This item is protected by copyright and/or related rights. Your are free to use this Item in any way that is permitted by the copyright and related rights legislation that applies to your use. For other uses you need to obtain permission from the rights-holder(s). <a href=""http://rightsstatements.org/"">http://rightsstatements.org</a>",,pdf,eng,"Text: Document ",,,,,,,,,,,,,,,,,,,,,,,,,,,,,,,,,,,,,,,,,OCRJanuary_1972_June_1973_,,,,,,,,,,,,,,,,,,,,,,,,,,,,,,,,,,,,"""New Ideas For Pasture"",Annual Report,Annual Report - 1971,Bruce Wight,Charles Morgan,Clarke County Soil and Water Conservation District,Commissioner,Conservation Education,David Johannes,Elections,Father John McRaith,Flood Damage,Flooding,Garland McCay,Gary Pool,Helen Henry,Jim Fluke,Keith Richard,Kenneth Henry,Long Creek Watershed,Mark Cooper,News Clipping,Outdoor Classrooms,Pond,Ray LeFebvre Family,Richard Gonseth,Rural Water System,Soil and Conservation Stewardship Week,Soil Erosion,Soil Survey,Switchgrass,Watershed,Whitebreast Creek Watershed Project",https://www.iowaheritage.org/files/original/fc175d1a2eb7bf9f5e26a23fa1434f29.pdf,Document,"Clarke County Soil and Water Conservation District Historical Collection",1,0
96745,https://www.iowaheritage.org/items/show/96745,"Clarke County Soil and Water Conservation District Scrapbook, 1970 - 1973","Clarke County Soil and Water Conservation District|Whitebreast Watershed Project|Soil and Water Conservation|Annual Report, 1971|Long Creek Watershed|Scrapbook ","Scrapbook contains news clippings gathered by the district office from December 1970 to August 1973. Articles feature Whitebreast Watershed Project, Long Creek Watershed, 1971 annual report, and other district specific news.","Clarke County Soil and Water Conservation District",,"State Library of Iowa","1970-12 to 1973-08","Clarek County Soil and Water Conservation District of Iowa. For questions about copyright, contact the State Library of Iowa at  <a href=""http://www.statelibraryofiowa.org"">http://www.statelibraryofiowa.org</a>.","This item is protected by copyright and/or related rights. Your are free to use this Item in any way that is permitted by the copyright and related rights legislation that applies to your use. For other uses you need to obtain permission from the rights-holder(s). <a href=""http://rightsstatements.org/"">http://rightsstatements.org</a>",,pdf,eng,"Text: Document ",,,,,,,,,,,,,,,,,,,,,,,,,,,,,,,,,,,,,,,,,OCRDecember_1970_August_1973_,,,,,,,,,,,,,,,,,,,,,,,,,,,,,,,,,,,,"Annual Report,Catfish,Chuck Jackson,Clarke County Soil and Water Conservation District,Commissioner Elections,Contour Farming,Delmer Bryant,Don Miller,Doyce Miller,Earl Mateer,Farm Pond,Farm Safety,Frank Townsend,Gerald Garner,Governor Ray,Grass Waterway,Grassed Waterways,Jack Ames,Jack Miller,Jerry Kelly,John Audlehelm,Keith Ticknor,Livestock,Long Creek Watershed,Merrill Dean,Mrs. Van Gundy,Needle Blight,News Clipping,Nick Saunders,Paul Audlehelm,Powell Farm,RC&D,Richard Barr,Richard Gonseth,Roger Gilbert,Soil Erosion,Soil Stewardship Week,Steve Roberts,Stocking Ponds,Strip Cropping,T. J,T.J. Laing,TOT - Tile Outlet Terrace,Tree Planting,Watershed Law,Whitebreast Watershed Project,Wildlife,Wilma Carson,Windbreaks",https://www.iowaheritage.org/files/original/81310cccc643d952c872f0c222ff2b6f.pdf,Document,"Clarke County Soil and Water Conservation District Historical Collection",1,0
96743,https://www.iowaheritage.org/items/show/96743,"  Clarke County Soil and Water Conservation District Scrapbook, 1965 - 1968","Clarke County Soil and Water Conservation District|Whitebreast Watershed Project|Soil Conservation and Water Conservation |Scrapbook ","Scrapbook contains news clippings gathered by the district office from June 1965 to August 1968. Articles focus on the Whitebreast Watershed Project, conservation projects, district progress, and other district specific news.","Clarke County Soil and Water Conservation District",,"State Library of Iowa","1965-07 to 1968-05","Clarke County Soil and Water Conservation District of Iowa. For questions about copyright, contact the State Library of Iowa at  <a href=""http://www.statelibraryofiowa.org"">http://www.statelibraryofiowa.org</a>.","This item is protected by copyright and/or related rights. Your are free to use this Item in any way that is permitted by the copyright and related rights legislation that applies to your use. For other uses you need to obtain permission from the rights-holder(s). <a href=""http://rightsstatements.org/"">http://rightsstatements.org</a>",,pdf,eng,"Text: Document ",,,,,,,,,,,,,,,,,,,,,,,,,,,,,,,,,,,,,,,,,OCRJuly_1965_May_1968,,,,,,,,,,,,,,,,,,,,,,,,,,,,,,,,,,,,"Adrian Fuller,Arlene Garner,Bonnie Goodman,Christmas Tree Farm,Clarke County Soil and Water Conservation District,Commissioner,Cynthia Jones,Doyce Miller,Dr. Fred Wood,Farm-City Week,FFA,Field Day,Flooding - 1967,Gary Gonseth,Goodyear Conservation Award Program,Jack Ames,Janice Stearns,John Camp,Joyce Marts,Livestock,Mr. and Mrs. Frank H. Mendell,Mrs. Darrel Platt,Orval Hartman,Queen of Conservation,Richard Gonseth,Robert Cooley,Roland Sargent,Scrapbook,Soil Erosion,Soil Stewardship Week,Speech Contest,Terraces,Whitebreast Lake,Whitebreast Watershed Project,William Swan,Winona Naylor",https://www.iowaheritage.org/files/original/a3d6461147f883700977aaf57e4d42f7.pdf,Document,"Clarke County Soil and Water Conservation District Historical Collection",1,0
96621,https://www.iowaheritage.org/items/show/96621,"Iowa Soil and Water, 1956","Soil and Water Conservation|Black Hawk County Soil and Water Conservation District ","Publication honoring Iowa soil and water conservation efforts. This issue recognized Black Hawk County SWCD.","Iowa Association of Soil District Commissioners",,"State Library of Iowa ",1956-08,"Black Hawk County Soil and Water Conservation District, Black Hawk County, Iowa.For questions about copyright, contact the State Library of Iowa at <a>http://www.statelibraryofiowa.org.&gt;</a>","This item is protected by copyright and/or related rights. Your are free to use this Item in any way that is permitted by the copyright and related rights legislation that applies to your use. For other uses you need to obtain permission from the rights-holder(s). <a href=""http://rightsstatements.org/"">http://rightsstatements.org</a>",,pdf,eng,"Text; Journal",,,,,,,,,,,,,,,,,,,,,,,,,,,,,,,,,,,,,,,,,1956_Soil_Water_Magazine_001,,,,,,,,,,,,,,,,,,,,,,,,,,,,,,,,,,,,"Albert Reiter,Alfred Schneider,Black Hawk County Soil and Water Conservation District,C.H. Stephens,C.L. Hoffman,Carl Theirman,Carol Bennett,Commissioners,Contour Farming,Crop Rotation,Dick Bowers,Elmer Helm,Ernest Mueller,Evan Sage Farm,Farm Plan,Gene Rodeske,Gerald Bedard,Glenn Mastain,Grass Waterway,Gully,Harold Bauer,Harold Huck,Harold Huck Farm,Herb Fasse,J.J. Kelley,Joseph Entz,Journal,Kay Beinke,Lawrence STocker,Livestock,Marilyn Costlan,Marilyn Schuchhardt,Marilynn Grooters,Merl Jacobsen,Mildred Kruger,Milo Dlouhy,Mrs. Harry Brown,Mrs. Robert Linde,National Plowing Match and Field Day,O.L. Skattum,Pasture Improvement,Paul Barger,Paul Heiple,Paul Morgan,Queen of the Furrow,Rath Packing Co,Robert Sieglaff,Robert Walker,Roger Bruene,Shirley McLaurey,Soil and Water Conservation District,Soil Erosion,Surface Drainage,Three Rivers Watershed,Tile Drainage,Toe Wall,Vernon Miller,WArren Weltge,Wayne Mark,Wendell Glasener,Wilbert Loeb,Wildlife,Wyane Mark Farm",https://www.iowaheritage.org/files/original/772644fe74de68d8451cc6041e4b4624.pdf,Document,"Black Hawk County Soil and Water Conservation District Historical Collection",1,0
96565,https://www.iowaheritage.org/items/show/96565,"Farmers Turn to Colleagues for Assistance","Soil Erosion|Farmers","Survey shows that farmers turn to colleagues for soil assistance.","Waterloo Courier",,"State Library of Iowa ",1991-12-29,"Black Hawk County Soil and Water Conservation District, Black Hawk County, Iowa.For questions about copyright, contact the State Library of Iowa at <a>http://www.statelibraryofiowa.org.&gt;</a>","This item is protected by copyright and/or related rights. Your are free to use this Item in any way that is permitted by the copyright and related rights legislation that applies to your use. For other uses you need to obtain permission from the rights-holder(s). <a href=""http://rightsstatements.org/"">http://rightsstatements.org</a>",,pdf,eng,"Text; Clipping",,,,,,,,,,,,,,,,,,,,,,,,,,,,,,,,,,,,,,,,,OCRBlack_Hawk_SWCD_Newspaper_Clippings_Binder_2136,,,,,,,,,,,,,,,,,,,,,,,,,,,,,,,,,,,,"Farming Practices,Soil Erosion",https://www.iowaheritage.org/files/original/724e7a18bb0710396a0a68738d08325d.pdf,Document,"Black Hawk County Soil and Water Conservation District Historical Collection",1,0
96555,https://www.iowaheritage.org/items/show/96555,"Violators Go Free","Black Hawk County, Iowa|Soil Erosion |U.S. Agricultural Stabilization and Conservation Service ","Anti-erosion issues are not well enforced by ASCS.","The Des Moines Register",,"State Library of Iowa ",1992-07-20,"Black Hawk County Soil and Water Conservation District, Black Hawk County, Iowa.For questions about copyright, contact the State Library of Iowa at <a>http://www.statelibraryofiowa.org.&gt;</a>","This item is protected by copyright and/or related rights. Your are free to use this Item in any way that is permitted by the copyright and related rights legislation that applies to your use. For other uses you need to obtain permission from the rights-holder(s). <a href=""http://rightsstatements.org/"">http://rightsstatements.org</a>",,pdf,eng,"Text; Clipping",,,,,,,,,,,,,,,,,,,,,,,,,,,,,,,,,,,,,,,,,OCRBlack_Hawk_SWCD_Newspaper_Clippings_Binder_2121,,,,,,,,,,,,,,,,,,,,,,,,,,,,,,,,,,,,"Soil Erosion,U.S. Agricultural Stabilization and Conservation Service",https://www.iowaheritage.org/files/original/0d65922dc755a5ab33257bd9245fed40.pdf,Document,"Black Hawk County Soil and Water Conservation District Historical Collection",1,0
96550,https://www.iowaheritage.org/items/show/96550,"Critics: Many Farmers Let Soil Slip Away","Black Hawk County, Iowa|Soil Erosion |Farming Practices ","Article questioning farmers conservation practices or lack there of.","The Des Moines Register",,"State Library of Iowa ",1992-09-07,"Black Hawk County Soil and Water Conservation District, Black Hawk County, Iowa.For questions about copyright, contact the State Library of Iowa at <a>http://www.statelibraryofiowa.org.&gt;</a>","This item is protected by copyright and/or related rights. Your are free to use this Item in any way that is permitted by the copyright and related rights legislation that applies to your use. For other uses you need to obtain permission from the rights-holder(s). <a href=""http://rightsstatements.org/"">http://rightsstatements.org</a>",,pdf,eng,"Text; Clipping",,,,,,,,,,,,,,,,,,,,,,,,,,,,,,,,,,,,,,,,,OCRBlack_Hawk_SWCD_Newspaper_Clippings_Binder_2116,,,,,,,,,,,,,,,,,,,,,,,,,,,,,,,,,,,,"Black Hawk County Soil and Water Conservation District,Farming Practices,Soil Erosion",https://www.iowaheritage.org/files/original/aa297021bd6d006947c5beefa80b4a31.pdf,Document,"Black Hawk County Soil and Water Conservation District Historical Collection",1,0
96549,https://www.iowaheritage.org/items/show/96549,"Farmers Weigh Conservation Rules","Black Hawk County, Iowa|Soil and Water Conservation |Regulations ","Farmers speak out on conservation regulations.","The Des Moines Register",,"State Library of Iowa ",1992-09-06,"Black Hawk County Soil and Water Conservation District, Black Hawk County, Iowa.For questions about copyright, contact the State Library of Iowa at <a>http://www.statelibraryofiowa.org.&gt;</a>","This item is protected by copyright and/or related rights. Your are free to use this Item in any way that is permitted by the copyright and related rights legislation that applies to your use. For other uses you need to obtain permission from the rights-holder(s). <a href=""http://rightsstatements.org/"">http://rightsstatements.org</a>",,pdf,eng,"Text; Clipping",,,,,,,,,,,,,,,,,,,,,,,,,,,,,,,,,,,,,,,,,OCRBlack_Hawk_SWCD_Newspaper_Clippings_Binder_2115,,,,,,,,,,,,,,,,,,,,,,,,,,,,,,,,,,,,"Black Hawk County Soil and Water Conservation District,Soil Erosion",https://www.iowaheritage.org/files/original/aec97b7326f02f7d4ee8df11dd000ff1.pdf,Document,"Black Hawk County Soil and Water Conservation District Historical Collection",1,0
