 




﻿"Item Id","Item URI","Dublin Core:Title","Dublin Core:Subject","Dublin Core:Description","Dublin Core:Creator","Dublin Core:Source","Dublin Core:Publisher","Dublin Core:Date","Dublin Core:Contributor","Dublin Core:Rights","Dublin Core:Relation","Dublin Core:Format","Dublin Core:Language","Dublin Core:Type","Dublin Core:Identifier","Dublin Core:Coverage","Item Type Metadata:Text","Item Type Metadata:Interviewer","Item Type Metadata:Interviewee","Item Type Metadata:Location","Item Type Metadata:Transcription","Item Type Metadata:Local URL","Item Type Metadata:Original Format","Item Type Metadata:Physical Dimensions","Item Type Metadata:Duration","Item Type Metadata:Compression","Item Type Metadata:Producer","Item Type Metadata:Director","Item Type Metadata:Bit Rate/Frequency","Item Type Metadata:Time Summary","Item Type Metadata:Email Body","Item Type Metadata:Subject Line","Item Type Metadata:From","Item Type Metadata:To","Item Type Metadata:CC","Item Type Metadata:BCC","Item Type Metadata:Number of Attachments","Item Type Metadata:Standards","Item Type Metadata:Objectives","Item Type Metadata:Materials","Item Type Metadata:Lesson Plan Text","Item Type Metadata:URL","Item Type Metadata:Event Type","Item Type Metadata:Participants","Item Type Metadata:Birth Date","Item Type Metadata:Birthplace","Item Type Metadata:Death Date","Item Type Metadata:Occupation","Item Type Metadata:Biographical Text","Item Type Metadata:Bibliography","Item Type Metadata:Digital Reproduction Information","Item Type Metadata:Repository","Item Type Metadata:Repository Collection","Item Type Metadata:Contact information.","Item Type Metadata:File Name","Item Type Metadata:Notes","Item Type Metadata:Digital item created","Item Type Metadata:Digital item modified","Item Type Metadata:Executive Orders","Item Type Metadata:Record Created","Item Type Metadata:Record Modified","Item Type Metadata:Transcription2","Item Type Metadata:Source URL","Omeka Legacy File:Additional Creator","Omeka Legacy File:Transcriber","Omeka Legacy File:Producer","Omeka Legacy File:Render Device","Omeka Legacy File:Render Details","Omeka Legacy File:Capture Date","Omeka Legacy File:Capture Device","Omeka Legacy File:Capture Details","Omeka Legacy File:Change History","Omeka Legacy File:Watermark","Omeka Legacy File:Encryption","Omeka Legacy File:Compression","Omeka Legacy File:Post Processing","Omeka Image File:Width","Omeka Image File:Height","Omeka Image File:Bit Depth","Omeka Image File:Channels","Omeka Image File:Exif String","Omeka Image File:Exif Array","Omeka Image File:IPTC String","Omeka Image File:IPTC Array","Omeka Video File:Bitrate","Omeka Video File:Duration","Omeka Video File:Sample Rate","Omeka Video File:Codec","Omeka Video File:Width","Omeka Video File:Height",tags,file,itemType,collection,public,featured
4816,https://www.iowaheritage.org/items/show/4816,"Married life is bound to be confusing to an old bachelor who has had his own closet all his life.  (Optional line): Having a hard time locating his comfortable old carpet slippers.","Women Suffrage|Elections 1922|Elephants|politics|elections|Republican Party|voting|19th Amendment|closets|clothes.",,"Darling, Jay N. (Jay Norwood), 1876-1962","The Editorial cartoons of J.N. ""Ding"" Darling [electronic resource] : The Cowles Collection, Drake University, 1912-1962",,1922/06/02|1922,,"Copyright is owned by the ""Ding"" Darling Wildlife Society; it is administered on behalf of the Society by The University of Iowa. While use within the classroom is encouraged without specific authorization, publishing this cartoon in any format requires written permission. See policy and permissions procedure at: http://www.lib.uiowa.edu/spec-coll/services/dingdarling_fees.html","Cowles Library, Drake University, 2507 University Ave., Des Moines, IA 50311-4505.",,,,"220602.jpg|http://ddr.lib.drake.edu/u?/ddarling,1945",,,,,,,,,,,,,,,,,,,,,,,,,,,,,,,,,,,,,,,,,,,,,,,,"<a href=""http://ddr.lib.drake.edu/u?/ddarling,1945"" target=""_blank"">View this item in its source respository</a>",,,,,,,,,,,,,,,,,,,,,,,,,,,,,https://www.iowaheritage.org/files/original/0e04f6d6e4ab3b064f54f7fc40f94397.jpg,"Remote Item","Editorial Cartoons of J.N. ""Ding"" Darling, Drake University",1,0
4411,https://www.iowaheritage.org/items/show/4411,"Anyway,the income tax has aroused the interest of a lot of stagnant voters.","Taxes|Bat.|taxation|voters|voting|complacency|human nature",,"Darling, Jay N. (Jay Norwood), 1876-1962","The Editorial cartoons of J.N. ""Ding"" Darling [electronic resource] : The Cowles Collection, Drake University, 1912-1962",,1921/01/23|1921,,"Copyright is owned by the ""Ding"" Darling Wildlife Society; it is administered on behalf of the Society by The University of Iowa. While use within the classroom is encouraged without specific authorization, publishing this cartoon in any format requires written permission. See policy and permissions procedure at: http://www.lib.uiowa.edu/spec-coll/services/dingdarling_fees.html","Cowles Library, Drake University, 2507 University Ave., Des Moines, IA 50311-4505.",,,,"210123.jpg|http://ddr.lib.drake.edu/u?/ddarling,1540",,,,,,,,,,,,,,,,,,,,,,,,,,,,,,,,,,,,,,,,,,,,,,,,"<a href=""http://ddr.lib.drake.edu/u?/ddarling,1540"" target=""_blank"">View this item in its source respository</a>",,,,,,,,,,,,,,,,,,,,,,,,,,,,,https://www.iowaheritage.org/files/original/68697c33098523a3c69ebe19bbba14b2.jpg,"Remote Item","Editorial Cartoons of J.N. ""Ding"" Darling, Drake University",1,0
68582,https://www.iowaheritage.org/items/show/68582,"Speeches written by Jennifer Riggs Cosson, 1910s","Women's suffrage|United States -- Iowa|1910-1920|Political participation|Politics & government|Voting|Women","Jennifer Riggs attended Simpson College and graduated in 1899. After her marriage to George Cosson, she became a teacher and a suffragist, and was in demand as a speaker.","Cosson, Jennifer Riggs",,"Iowa Women's Archives",191-|2010-11-16,,"Educational use only, no other permissions given. U.S. and International copyright laws may protect this item. Commercial use or distribution of this digital object is not permitted without written permission of the Iowa Women's Archives.","Iowa Women's Suffrage|Jennifer Riggs Cosson papers|http://lib.uiowa.edu/collguides/?IWA0431|Speeches, undated",jpeg|28|22,,Text|Speeches,IWA0431|index.cpd|http://digital.lib.uiowa.edu/cdm/ref/collection/suffrage/id/1859,,,,,,,,,,,,,,,,,,,,,,,,,,,,,,,,,,,,,,,,,,,,,,,,"<a href=""http://digital.lib.uiowa.edu/cdm/ref/collection/suffrage/id/1859"" target=""_blank"">View this item in its source respository</a>",,,,,,,,,,,,,,,,,,,,,,,,,,,,,https://www.iowaheritage.org/files/original/8da245c2d5405a06a75e5dfa1f0ea481.jpg,"Remote Item",,1,0
68633,https://www.iowaheritage.org/items/show/68633,"Abstract of vote on woman suffrage constitutional amendment election, June 5, 1916","Women's suffrage|United States -- Iowa|1910-1920|Voting|Ballots|Political elections|Vote counting|Equal rights amendments",,"Catt, Carrie Chapman, 1859-1947",,"State Historical Society of Iowa, Des Moines",1916-06-05|2011-03-24,,"Educational use only, no other permissions given. U.S. and International copyright laws may protect this item. Commercial use or distribution of this digital object is not permitted without written permission of the State Historical Society of Iowa.","Iowa Women's Suffrage|Iowa Women's Suffrage Collection|http://infohawk.uiowa.edu/F?func=direct&doc_number=003490481&local_base=iow06|Carrie Chapman Catt scrapbook",jpeg,,"Still image; Text|Maps","SHSDM071|suf-SHSDM071-12; 003490481|http://digital.lib.uiowa.edu/cdm/ref/collection/suffrage/id/3110",,,,,,,,,,,,,,,,,,,,,,,,,,,,,,,,,,,,,,,,,,,,,,,,"<a href=""http://digital.lib.uiowa.edu/cdm/ref/collection/suffrage/id/3110"" target=""_blank"">View this item in its source respository</a>",,,,,,,,,,,,,,,,,,,,,,,,,,,,,https://www.iowaheritage.org/files/original/2225bef6424258fba301f11de99892b2.jpg,"Remote Item",,1,0
68570,https://www.iowaheritage.org/items/show/68570,"Writings by and about Carrie Chapman Catt, 1912-1982","Women's suffrage|Catt, Carrie Chapman, 1859-1947|National American Woman Suffrage Association|United States -- New York -- New York|League of Women Voters (U.S.)|Library of Congress|United States|United States -- Iowa|Women|Political participation|Politics & government|Voting|Organizations|History",,"Catt, Carrie Chapman, 1859-1947",,"Iowa City Press-Citizen (Iowa City, Iowa); Des Moines Register (Des Moines, Iowa)|Iowa Women's Archives",19--|2010-10-20,,"Educational use only, no other permissions given. U.S. and International copyright laws may protect this item. Commercial use or distribution of this digital object is not permitted without written permission of the Iowa Women's Archives.","Iowa Women's Suffrage|Iowa Suffrage Memorial Commission records|http://lib.uiowa.edu/collguides/?IWA0398|Catt, Carrie Chapman, Iowa author",jpeg|46|36,,"Text; Still image|Brochures; Clippings (information artifacts); Postage stamps",IWA0398|index.cpd|http://digital.lib.uiowa.edu/cdm/ref/collection/suffrage/id/1774,,,,,,,,,,,,,,,,,,,,,,,,,,,,,,,,,,,,,,,,,,,,,,,,"<a href=""http://digital.lib.uiowa.edu/cdm/ref/collection/suffrage/id/1774"" target=""_blank"">View this item in its source respository</a>",,,,,,,,,,,,,,,,,,,,,,,,,,,,,https://www.iowaheritage.org/files/original/35fac693c3077b364be9676f924eff1d.jpg,"Remote Item",,1,0
68506,https://www.iowaheritage.org/items/show/68506,"Essays by Lucille Ketchum Carter, 1958-2000","Women's suffrage|Carter, Lucille Ketchum|United States -- Iowa -- Iowa City|Voting|Women|Organizations|Political participation","Carter was a 1936 graduate of the School of Nursing at the State University of Iowa who was active in Democratic politics and whose correspondence includes round robin letters.","Carter, Lucille Ketchum",,"Iowa Women's Archives",19--|2010-10-20,,"Educational use only, no other permissions given. U.S. and International copyright laws may protect this item. Commercial use or distribution of this digital object is not permitted without written permission of the Iowa Women's Archives.","Iowa Women's Suffrage|Lucille Ketchum Carter papers|http://lib.uiowa.edu/collguides/?IWA0131|Writings, 1958-2000",jpeg|28|22,,Text|Essays,IWA0131|index.cpd|http://digital.lib.uiowa.edu/cdm/ref/collection/suffrage/id/1110,,,,,,,,,,,,,,,,,,,,,,,,,,,,,,,,,,,,,,,,,,,,,,,,"<a href=""http://digital.lib.uiowa.edu/cdm/ref/collection/suffrage/id/1110"" target=""_blank"">View this item in its source respository</a>",,,,,,,,,,,,,,,,,,,,,,,,,,,,,https://www.iowaheritage.org/files/original/3ba9cb395da98ab3ea663b442aed6de0.jpg,"Remote Item",,1,0
15525,https://www.iowaheritage.org/items/show/15525,"Charles Cady letters, 1862-1864","Campaigns & battles|United States -- History -- Civil War, 1861-1865|Cady, Charles|United States. Army. Iowa Infantry Regiment, 15th (1861-1865). Company E|United States -- Illinois -- Cairo|1860-1870|Guards|Military camps|Sick persons|Slaves|Soldiers|War casualties|Military officers|Political elections|Voting|Farms|Farmers|Farming|Harvesting|Blockades|Forts & fortifications|Orchards|Rivers|Recruiting & enlistment|Patriotism|Revenge|Religious services|Military retreats|Tents|Carts & wagons|Postal service|Plantations|Prisoners of war|Sawmills|Blacksmiths|Stables|Mud|Inflation|Shooting|Digging|Berries|Nuts|Vicksburg (Miss.) -- History -- Siege, 1863|Copperhead movement|Corinth, Battle of, Corinth, Miss., 1862|Military promotions|Cady, Ebenezer|Sanders, Meredith|Dolittle, Albert Columbus|Hall, Bill|Davis, Ben|Brown, Alexander|Pierce, J. W.|Bonner, Frank|Davis, John|Crocker, Marcellus Monroe, 1830-1865|Hunter, Dave|Foster, Recllus|United States. Army. Crocker's Brigade|Burlington hawk-eye|United States -- Iowa -- Danville|United States -- Iowa -- Des Moines County|United States -- Tennessee -- Bolivar|United States -- Tennessee -- Hardeman County|United States -- Mississippi -- Corinth|United States -- Louisiana -- Holmes Plantation|United States -- Mississippi -- Vicksburg|United States -- Mississippi -- Grand Gulf|Chattahoochee River|United States -- Georgia -- Atlanta","The Charles Cady letters were written during his service in the Civil War. Included are the letters he wrote to his parents, brother, and sister living at home in Danville, Des Moines County, Iowa. He discussed army life, talked of casualties and illnesses in the regiment, and deplored Copperhead politcs.","Cady, Charles",,"University of Iowa. Libraries. Special Collections Dept.",1862/1864|2008-11-17,,"Educational use only, no other permissions given. U.S. and international copyright laws may protect this digital image. Commercial use or distribution of the image is not permitted without prior permission of the copyright holder.","Civil War Diaries and Letters; Abraham Lincoln Collection|Charles Cady papers|http://lib.uiowa.edu/collguides/?MSC0017|1",,,"Text|Correspondence; Envelopes|jpeg",MSC0017|31858055128155|https://digital.lib.uiowa.edu/,,,,,,,,,,,,,,,,,,,,,,,,,,,,,,,,,,,,,,,,,,,,,,,,"<a href=""https://digital.lib.uiowa.edu/"" target=""_blank"">View this item in its source respository</a>",,,,,,,,,,,,,,,,,,,,,,,,,,,,,https://www.iowaheritage.org/files/original/7c0f3095aace6e2a7344609e46ab8f5d.jpg,"Remote Item","Civil War Diaries and Letters",1,0
11009,https://www.iowaheritage.org/items/show/11009,"Charles Cady letters, 1862-1864","Campaigns & battles|United States -- History -- Civil War, 1861-1865|Cady, Charles|United States. Army. Iowa Infantry Regiment, 15th (1861-1865). Company E|United States -- Illinois -- Cairo|1860-1870|Guards|Military camps|Sick persons|Slaves|Soldiers|War casualties|Military officers|Political elections|Voting|Farms|Farmers|Farming|Harvesting|Blockades|Forts & fortifications|Orchards|Rivers|Recruiting & enlistment|Patriotism|Revenge|Religious services|Military retreats|Tents|Carts & wagons|Postal service|Plantations|Prisoners of war|Sawmills|Blacksmiths|Stables|Mud|Inflation|Shooting|Digging|Berries|Nuts|Vicksburg (Miss.) -- History -- Siege, 1863|Copperhead movement|Corinth, Battle of, Corinth, Miss., 1862|Military promotions|Cady, Ebenezer|Sanders, Meredith|Dolittle, Albert Columbus|Hall, Bill|Davis, Ben|Brown, Alexander|Pierce, J. W.|Bonner, Frank|Davis, John|Crocker, Marcellus Monroe, 1830-1865|Hunter, Dave|Foster, Recllus|United States. Army. Crocker's Brigade|Burlington hawk-eye|United States -- Iowa -- Danville|United States -- Iowa -- Des Moines County|United States -- Tennessee -- Bolivar|United States -- Tennessee -- Hardeman County|United States -- Mississippi -- Corinth|United States -- Louisiana -- Holmes Plantation|United States -- Mississippi -- Vicksburg|United States -- Mississippi -- Grand Gulf|Chattahoochee River|United States -- Georgia -- Atlanta","The Charles Cady letters were written during his service in the Civil War. Included are the letters he wrote to his parents, brother, and sister living at home in Danville, Des Moines County, Iowa. He discussed army life, talked of casualties and illnesses in the regiment, and deplored Copperhead politcs.","Cady, Charles",,"University of Iowa. Libraries. Special Collections Dept.",1862/1864|2008-11-17,,"Educational use only, no other permissions given. U.S. and international copyright laws may protect this digital image. Commercial use or distribution of the image is not permitted without prior permission of the copyright holder.","Civil War Diaries and Letters; Abraham Lincoln Collection|Charles Cady papers|http://lib.uiowa.edu/collguides/?MSC0017|1",,,"Text|Correspondence; Envelopes|jpeg",MSC0017|31858055128155|https://digital.lib.uiowa.edu/,,,,,,,,,,,,,,,,,,,,,,,,,,,,,,,,,,,,,,,,,,,,,,,,"<a href=""https://digital.lib.uiowa.edu/"" target=""_blank"">View this item in its source respository</a>",,,,,,,,,,,,,,,,,,,,,,,,,,,,,https://www.iowaheritage.org/files/original/082da877ea9ad1bc2d2d5a42860bc8d9.jpg,"Remote Item","African American Women in Iowa Collection",1,0
68503,https://www.iowaheritage.org/items/show/68503,"Outline of argument for suffrage written by Dorothy Mills Buess as a student at Iowa State Teachers College, March 24, 1916","Women's suffrage|Iowa State Teachers College|United States -- Iowa -- Cedar Falls|1910-1920|Voting|Political participation|Politics & government",,"Buess, Dorothy Mills",,"Iowa Women's Archives",1916-03-24|2010-11-16,,"Educational use only, no other permissions given. U.S. and International copyright laws may protect this item. Commercial use or distribution of this digital object is not permitted without written permission of the Iowa Women's Archives.","Iowa Women's Suffrage|Taylor, Genevieve Buess|http://lib.uiowa.edu/collguides/?IWA0098|Taylor, Genevieve Buess",jpeg|28|22,,"Text|Essays; Outlines (documents)",IWA0099|index.cpd|http://digital.lib.uiowa.edu/cdm/ref/collection/suffrage/id/1073,,,,,,,,,,,,,,,,,,,,,,,,,,,,,,,,,,,,,,,,,,,,,,,,"<a href=""http://digital.lib.uiowa.edu/cdm/ref/collection/suffrage/id/1073"" target=""_blank"">View this item in its source respository</a>",,,,,,,,,,,,,,,,,,,,,,,,,,,,,https://www.iowaheritage.org/files/original/8c7ed3cb39746b86a07e41e0d5d592c5.jpg,"Remote Item",,1,0
