 




﻿"Item Id","Item URI","Dublin Core:Title","Dublin Core:Subject","Dublin Core:Description","Dublin Core:Creator","Dublin Core:Source","Dublin Core:Publisher","Dublin Core:Date","Dublin Core:Contributor","Dublin Core:Rights","Dublin Core:Relation","Dublin Core:Format","Dublin Core:Language","Dublin Core:Type","Dublin Core:Identifier","Dublin Core:Coverage","Item Type Metadata:Text","Item Type Metadata:Interviewer","Item Type Metadata:Interviewee","Item Type Metadata:Location","Item Type Metadata:Transcription","Item Type Metadata:Local URL","Item Type Metadata:Original Format","Item Type Metadata:Physical Dimensions","Item Type Metadata:Duration","Item Type Metadata:Compression","Item Type Metadata:Producer","Item Type Metadata:Director","Item Type Metadata:Bit Rate/Frequency","Item Type Metadata:Time Summary","Item Type Metadata:Email Body","Item Type Metadata:Subject Line","Item Type Metadata:From","Item Type Metadata:To","Item Type Metadata:CC","Item Type Metadata:BCC","Item Type Metadata:Number of Attachments","Item Type Metadata:Standards","Item Type Metadata:Objectives","Item Type Metadata:Materials","Item Type Metadata:Lesson Plan Text","Item Type Metadata:URL","Item Type Metadata:Event Type","Item Type Metadata:Participants","Item Type Metadata:Birth Date","Item Type Metadata:Birthplace","Item Type Metadata:Death Date","Item Type Metadata:Occupation","Item Type Metadata:Biographical Text","Item Type Metadata:Bibliography","Item Type Metadata:Digital Reproduction Information","Item Type Metadata:Repository","Item Type Metadata:Repository Collection","Item Type Metadata:Contact information.","Item Type Metadata:File Name","Item Type Metadata:Notes","Item Type Metadata:Digital item created","Item Type Metadata:Digital item modified","Item Type Metadata:Executive Orders","Item Type Metadata:Record Created","Item Type Metadata:Record Modified","Item Type Metadata:Transcription2","Item Type Metadata:Source URL","Omeka Legacy File:Additional Creator","Omeka Legacy File:Transcriber","Omeka Legacy File:Producer","Omeka Legacy File:Render Device","Omeka Legacy File:Render Details","Omeka Legacy File:Capture Date","Omeka Legacy File:Capture Device","Omeka Legacy File:Capture Details","Omeka Legacy File:Change History","Omeka Legacy File:Watermark","Omeka Legacy File:Encryption","Omeka Legacy File:Compression","Omeka Legacy File:Post Processing","Omeka Image File:Width","Omeka Image File:Height","Omeka Image File:Bit Depth","Omeka Image File:Channels","Omeka Image File:Exif String","Omeka Image File:Exif Array","Omeka Image File:IPTC String","Omeka Image File:IPTC Array","Omeka Video File:Bitrate","Omeka Video File:Duration","Omeka Video File:Sample Rate","Omeka Video File:Codec","Omeka Video File:Width","Omeka Video File:Height",tags,file,itemType,collection,public,featured
64411,https://www.iowaheritage.org/items/show/64411,"War powers","Presidents|Bush, George, 1924-|United States|Presidents|1990-2000|Presidents -- United States|War|Wars|Aggression|Aggression (International law)|Congress|Power|Politicians|Politics|Men|Arrows|Eagles|Ruts",Congress,"Duffy, Brian, 1955-",,"University of Iowa. Libraries. Special Collections Dept.",1991-01-08|2011-04,,"Educational use only, no other permissions given. Copyright to this digital object is owned by The Des Moines Register; it may not be downloaded, reproduced, or distributed without written permission. For more information, contact the Special Collections Department.","Editorial Cartoons of Brian Duffy; Des Moines Register Cartoonists|Papers of Brian Duffy|Des Moines Register",,English,"Still image|Editorial cartoons",MSC916|duffy-910108|http://digital.lib.uiowa.edu/cdm/ref/collection/duffy/id/249,,,,,,,,,,,,,,,,,,,,,,,,,,,,,,,,,,,,,,,,,,,,,,,,"<a href=""http://digital.lib.uiowa.edu/cdm/ref/collection/duffy/id/249"" target=""_blank"">View this item in its source respository</a>",,,,,,,,,,,,,,,,,,,,,,,,,,,,,https://www.iowaheritage.org/files/original/672b201b00b6814fcf9d806cc4860ca3.jpg,"Remote Item","Editorial Cartoons of Brian Duffy",1,0
64405,https://www.iowaheritage.org/items/show/64405,Stuffing,"Congress|Washington (D.C.)|Turkeys|1980-1990|Congressional Appropriations|Money|Payscales|Salaries|Politics|Politicians|Plates|Tables|Steam|Money","Congress; Pay raise","Duffy, Brian, 1955-",,"University of Iowa. Libraries. Special Collections Dept.",1989-11-23|2011-04,,"Educational use only, no other permissions given. Copyright to this digital object is owned by The Des Moines Register; it may not be downloaded, reproduced, or distributed without written permission. For more information, contact the Special Collections Department.","Editorial Cartoons of Brian Duffy; Des Moines Register Cartoonists|Papers of Brian Duffy|Des Moines Register",,English,"Still image|Editorial cartoons",MSC916|duffy-891123|http://digital.lib.uiowa.edu/cdm/ref/collection/duffy/id/243,,,,,,,,,,,,,,,,,,,,,,,,,,,,,,,,,,,,,,,,,,,,,,,,"<a href=""http://digital.lib.uiowa.edu/cdm/ref/collection/duffy/id/243"" target=""_blank"">View this item in its source respository</a>",,,,,,,,,,,,,,,,,,,,,,,,,,,,,https://www.iowaheritage.org/files/original/9f2c8f5b253016cf3086a5081dae0230.jpg,"Remote Item","Editorial Cartoons of Brian Duffy",1,0
64393,https://www.iowaheritage.org/items/show/64393,"George Bush as a withered, heat-exhausted sunflower","Presidency|Bush, George, 1924-|United States|Sun|1980-1990|Presidents -- United States|Presidents|Public opinion|Politicians|Politics|Sunflowers|Presidents|Heat|Droughts",,"Duffy, Brian, 1955-",,"University of Iowa. Libraries. Special Collections Dept.",1988-05|2011-04,,"Educational use only, no other permissions given. Copyright to this digital object is owned by The Des Moines Register; it may not be downloaded, reproduced, or distributed without written permission. For more information, contact the Special Collections Department.","Editorial Cartoons of Brian Duffy; Des Moines Register Cartoonists|Papers of Brian Duffy|Des Moines Register",,English,"Still image|Editorial cartoons","MSC916|duffy-8805xx-undated 5|http://digital.lib.uiowa.edu/cdm/ref/collection/duffy/id/231",,,,,,,,,,,,,,,,,,,,,,,,,,,,,,,,,,,,,,,,,,,,,,,,"<a href=""http://digital.lib.uiowa.edu/cdm/ref/collection/duffy/id/231"" target=""_blank"">View this item in its source respository</a>",,,,,,,,,,,,,,,,,,,,,,,,,,,,,https://www.iowaheritage.org/files/original/884e762dfbb7ac6072343e769f339991.jpg,"Remote Item","Editorial Cartoons of Brian Duffy",1,0
64388,https://www.iowaheritage.org/items/show/64388,"I'm not going to pick on an invalid","Presidents|Reagan, Ronald|United States|Presidents|1980-1990|Presidency|Lame ducks|Politics|Politicians|Ducks|Crutches|Fractures (Bones)|Medical equipment & suppplies",,"Duffy, Brian, 1955-",,"University of Iowa. Libraries. Special Collections Dept.",1988-05|2011-04,,"Educational use only, no other permissions given. Copyright to this digital object is owned by The Des Moines Register; it may not be downloaded, reproduced, or distributed without written permission. For more information, contact the Special Collections Department.","Editorial Cartoons of Brian Duffy; Des Moines Register Cartoonists|Papers of Brian Duffy|Des Moines Register",,English,"Still image|Editorial cartoons","MSC916|duffy-8805xx-undated 1|http://digital.lib.uiowa.edu/cdm/ref/collection/duffy/id/226",,,,,,,,,,,,,,,,,,,,,,,,,,,,,,,,,,,,,,,,,,,,,,,,"<a href=""http://digital.lib.uiowa.edu/cdm/ref/collection/duffy/id/226"" target=""_blank"">View this item in its source respository</a>",,,,,,,,,,,,,,,,,,,,,,,,,,,,,https://www.iowaheritage.org/files/original/ba334fab1a02321db129e255f190b744.jpg,"Remote Item","Editorial Cartoons of Brian Duffy",1,0
64384,https://www.iowaheritage.org/items/show/64384,"Duke & the right stuff","Campaigns|Dukakis, Michael S. (Michael Stanley), 1933-|United States|Men|1980-1990|Politicians|Politics|Presidency|Candidates|Bradley, Bill, 1943-|Jackson, Jesse, 1941-|Glenn, John, 1921-|Politicians|Stars|Papers|Athletes|Preachers|Astronauts|Governors|Candidates","Too tall; Bill Bradley; V.P. list; Too charismatic; Jesse; Just right; John Glenn","Duffy, Brian, 1955-",,"University of Iowa. Libraries. Special Collections Dept.",1988-05-24|2011-04,,"Educational use only, no other permissions given. Copyright to this digital object is owned by The Des Moines Register; it may not be downloaded, reproduced, or distributed without written permission. For more information, contact the Special Collections Department.","Editorial Cartoons of Brian Duffy; Des Moines Register Cartoonists|Papers of Brian Duffy|Des Moines Register",,English,"Still image|Editorial cartoons",MSC916|duffy-880524|http://digital.lib.uiowa.edu/cdm/ref/collection/duffy/id/222,,,,,,,,,,,,,,,,,,,,,,,,,,,,,,,,,,,,,,,,,,,,,,,,"<a href=""http://digital.lib.uiowa.edu/cdm/ref/collection/duffy/id/222"" target=""_blank"">View this item in its source respository</a>",,,,,,,,,,,,,,,,,,,,,,,,,,,,,https://www.iowaheritage.org/files/original/0106103b36bf0304cb2e9fc8b0b1c0ba.jpg,"Remote Item","Editorial Cartoons of Brian Duffy",1,0
64377,https://www.iowaheritage.org/items/show/64377,"George, I'll give you my endorsement on one condition ...","Presidents|Reagan, Ronald|United States|Presidents|1980-1990|Politicians|Candidates|Campaigns|Campaigning|Endorsements|Bush, George, 1924-|Men|Armchairs|Neckties","What's that?; ... promise you won't write a book!","Duffy, Brian, 1955-",,"University of Iowa. Libraries. Special Collections Dept.",1988-05-12|2011-04,,"Educational use only, no other permissions given. Copyright to this digital object is owned by The Des Moines Register; it may not be downloaded, reproduced, or distributed without written permission. For more information, contact the Special Collections Department.","Editorial Cartoons of Brian Duffy; Des Moines Register Cartoonists|Papers of Brian Duffy|Des Moines Register",,English,"Still image|Editorial cartoons",MSC916|duffy-880512|http://digital.lib.uiowa.edu/cdm/ref/collection/duffy/id/215,,,,,,,,,,,,,,,,,,,,,,,,,,,,,,,,,,,,,,,,,,,,,,,,"<a href=""http://digital.lib.uiowa.edu/cdm/ref/collection/duffy/id/215"" target=""_blank"">View this item in its source respository</a>",,,,,,,,,,,,,,,,,,,,,,,,,,,,,https://www.iowaheritage.org/files/original/33d2fa6ba21d30ab7b6ca2a2a697c270.jpg,"Remote Item","Editorial Cartoons of Brian Duffy",1,0
64369,https://www.iowaheritage.org/items/show/64369,"Re-organization minefield","Democrats|United States|Signs|1980-1990|Political parties|Politicians|Politics|Reorganization|Power|Arrows|Donkeys","You are here!","Duffy, Brian, 1955-",,"University of Iowa. Libraries. Special Collections Dept.",1986-01|2011-04,,"Educational use only, no other permissions given. Copyright to this digital object is owned by The Des Moines Register; it may not be downloaded, reproduced, or distributed without written permission. For more information, contact the Special Collections Department.","Editorial Cartoons of Brian Duffy; Des Moines Register Cartoonists|Papers of Brian Duffy|Des Moines Register",,English,"Still image|Editorial cartoons","MSC916|duffy-8601xx-undated 1|http://digital.lib.uiowa.edu/cdm/ref/collection/duffy/id/207",,,,,,,,,,,,,,,,,,,,,,,,,,,,,,,,,,,,,,,,,,,,,,,,"<a href=""http://digital.lib.uiowa.edu/cdm/ref/collection/duffy/id/207"" target=""_blank"">View this item in its source respository</a>",,,,,,,,,,,,,,,,,,,,,,,,,,,,,https://www.iowaheritage.org/files/original/6cb270c0aa509ecdc52b585374929ff3.jpg,"Remote Item","Editorial Cartoons of Brian Duffy",1,0
64364,https://www.iowaheritage.org/items/show/64364,"I will be able to meet the Gramm-Rudman cuts, while not touching defense, or raising taxes, and still have $100 million leftover for the Contras!","Presidents|Reagan, Ronald|United States|Presidents|1980-1990|Politicians|Politics|Political promises|Honesty|Taxes|Deficits|Assistance|Arms|United States -- Economic conditions|Equipment|Electrical apparatus|Explosions|Smoke","Wow!; Lie detector; Boom; Would you believe?","Duffy, Brian, 1955-",,"University of Iowa. Libraries. Special Collections Dept.",1986-01-23|2011-04,,"Educational use only, no other permissions given. Copyright to this digital object is owned by The Des Moines Register; it may not be downloaded, reproduced, or distributed without written permission. For more information, contact the Special Collections Department.","Editorial Cartoons of Brian Duffy; Des Moines Register Cartoonists|Papers of Brian Duffy|Des Moines Register",,English,"Still image|Editorial cartoons",MSC916|duffy-860123|http://digital.lib.uiowa.edu/cdm/ref/collection/duffy/id/202,,,,,,,,,,,,,,,,,,,,,,,,,,,,,,,,,,,,,,,,,,,,,,,,"<a href=""http://digital.lib.uiowa.edu/cdm/ref/collection/duffy/id/202"" target=""_blank"">View this item in its source respository</a>",,,,,,,,,,,,,,,,,,,,,,,,,,,,,https://www.iowaheritage.org/files/original/28e9bd332bc4965f6d124a770e62c92c.jpg,"Remote Item","Editorial Cartoons of Brian Duffy",1,0
64359,https://www.iowaheritage.org/items/show/64359,"The state of the state","Governors|Branstad, Terry E.|Iowa|Governors|1980-1990|States|State governments|Democrats|Republicans|Partisanship|Parties|Party lines|Political parties|Politicians|Politics|Podiums|Speeches|Men|Fingers|Portraits|Papers",Democrats,"Duffy, Brian, 1955-",,"University of Iowa. Libraries. Special Collections Dept.",1986-01-14|2011-04,,"Educational use only, no other permissions given. Copyright to this digital object is owned by The Des Moines Register; it may not be downloaded, reproduced, or distributed without written permission. For more information, contact the Special Collections Department.","Editorial Cartoons of Brian Duffy; Des Moines Register Cartoonists|Papers of Brian Duffy|Des Moines Register",,English,"Still image|Editorial cartoons",MSC916|duffy-860114|http://digital.lib.uiowa.edu/cdm/ref/collection/duffy/id/197,,,,,,,,,,,,,,,,,,,,,,,,,,,,,,,,,,,,,,,,,,,,,,,,"<a href=""http://digital.lib.uiowa.edu/cdm/ref/collection/duffy/id/197"" target=""_blank"">View this item in its source respository</a>",,,,,,,,,,,,,,,,,,,,,,,,,,,,,https://www.iowaheritage.org/files/original/236cda54b518618dd3cbe26d25bf1637.jpg,"Remote Item","Editorial Cartoons of Brian Duffy",1,0
64334,https://www.iowaheritage.org/items/show/64334,"View of Russia from Sarah Palin's window","Politicians|Palin, Sarah, 1964-|United States|Land|2000-2010|Politics|Media|Foreign relations|Secrecy|Oceans|Signs|Men|Women|Politicians","View of Sarah Palin from the press bus window; No questions; Do not cross; Just because you can see something doesn't mean you know anything about it ... or her","Duffy, Brian, 1955-",,"University of Iowa. Libraries. Special Collections Dept.",2008-09-25|2011-04,,"Educational use only, no other permissions given. Copyright to this digital object is owned by The Des Moines Register; it may not be downloaded, reproduced, or distributed without written permission. For more information, contact the Special Collections Department.","Editorial Cartoons of Brian Duffy; Des Moines Register Cartoonists|Papers of Brian Duffy|Des Moines Register",,English,"Still image|Editorial cartoons",MSC916|duffy-080925|http://digital.lib.uiowa.edu/cdm/ref/collection/duffy/id/172,,,,,,,,,,,,,,,,,,,,,,,,,,,,,,,,,,,,,,,,,,,,,,,,"<a href=""http://digital.lib.uiowa.edu/cdm/ref/collection/duffy/id/172"" target=""_blank"">View this item in its source respository</a>",,,,,,,,,,,,,,,,,,,,,,,,,,,,,https://www.iowaheritage.org/files/original/4f4b83735502177e4834af001e472b85.jpg,"Remote Item","Editorial Cartoons of Brian Duffy",1,0
