 




﻿"Item Id","Item URI","Dublin Core:Title","Dublin Core:Subject","Dublin Core:Description","Dublin Core:Creator","Dublin Core:Source","Dublin Core:Publisher","Dublin Core:Date","Dublin Core:Contributor","Dublin Core:Rights","Dublin Core:Relation","Dublin Core:Format","Dublin Core:Language","Dublin Core:Type","Dublin Core:Identifier","Dublin Core:Coverage","Item Type Metadata:Text","Item Type Metadata:Interviewer","Item Type Metadata:Interviewee","Item Type Metadata:Location","Item Type Metadata:Transcription","Item Type Metadata:Local URL","Item Type Metadata:Original Format","Item Type Metadata:Physical Dimensions","Item Type Metadata:Duration","Item Type Metadata:Compression","Item Type Metadata:Producer","Item Type Metadata:Director","Item Type Metadata:Bit Rate/Frequency","Item Type Metadata:Time Summary","Item Type Metadata:Email Body","Item Type Metadata:Subject Line","Item Type Metadata:From","Item Type Metadata:To","Item Type Metadata:CC","Item Type Metadata:BCC","Item Type Metadata:Number of Attachments","Item Type Metadata:Standards","Item Type Metadata:Objectives","Item Type Metadata:Materials","Item Type Metadata:Lesson Plan Text","Item Type Metadata:URL","Item Type Metadata:Event Type","Item Type Metadata:Participants","Item Type Metadata:Birth Date","Item Type Metadata:Birthplace","Item Type Metadata:Death Date","Item Type Metadata:Occupation","Item Type Metadata:Biographical Text","Item Type Metadata:Bibliography","Item Type Metadata:Digital Reproduction Information","Item Type Metadata:Repository","Item Type Metadata:Repository Collection","Item Type Metadata:Contact information.","Item Type Metadata:File Name","Item Type Metadata:Notes","Item Type Metadata:Digital item created","Item Type Metadata:Digital item modified","Item Type Metadata:Executive Orders","Item Type Metadata:Record Created","Item Type Metadata:Record Modified","Item Type Metadata:Transcription2","Item Type Metadata:Source URL","Omeka Legacy File:Additional Creator","Omeka Legacy File:Transcriber","Omeka Legacy File:Producer","Omeka Legacy File:Render Device","Omeka Legacy File:Render Details","Omeka Legacy File:Capture Date","Omeka Legacy File:Capture Device","Omeka Legacy File:Capture Details","Omeka Legacy File:Change History","Omeka Legacy File:Watermark","Omeka Legacy File:Encryption","Omeka Legacy File:Compression","Omeka Legacy File:Post Processing","Omeka Image File:Width","Omeka Image File:Height","Omeka Image File:Bit Depth","Omeka Image File:Channels","Omeka Image File:Exif String","Omeka Image File:Exif Array","Omeka Image File:IPTC String","Omeka Image File:IPTC Array","Omeka Video File:Bitrate","Omeka Video File:Duration","Omeka Video File:Sample Rate","Omeka Video File:Codec","Omeka Video File:Width","Omeka Video File:Height",tags,file,itemType,collection,public,featured
23029,https://www.iowaheritage.org/items/show/23029,"Women in Greek costume posed with horse in front of mock Greek temple at City Park, The University of Iowa, 1915","Costumes|University of Iowa|United States -- Iowa -- Iowa City|1910-1920|Temples|Stage props|Parks|Women|Horses|Universities & colleges|City Park (Iowa City, Iowa)",,"Kent, Frederick W. (Frederick Wallace), 1894-1984",,"University of Iowa. Libraries. University Archives",1915|2008-05,,"Educational use only, no other permissions given. U.S. and international copyright laws may protect this digital object. Commercial use or distribution of the object is not permitted without prior permission of the copyright holder.","Iowa City Town and Campus Scenes|Frederick W. Kent Collection of Photographs, 1866-2000|http://www.lib.uiowa.edu/collguides/?RG30.0001.01|Prints|Events and activities|Fetes|Fetes|Scanned with Ricoh Aficio 3228C at 600 ppi, full color. Master images saved in tiff format.",9|14,,"Still image|Photographs; Postcards|jpeg",RG30.0001.01|https://digital.lib.uiowa.edu/,,,,,,,,,,,,,,,,,,,,,,,,,,,,,,,,,,,,,,,,,,,,,,,,"<a href=""https://digital.lib.uiowa.edu/"" target=""_blank"">View this item in its source respository</a>",,,,,,,,,,,,,,,,,,,,,,,,,,,,,https://www.iowaheritage.org/files/original/f26465f6f49bf59f72fea61bd0c21b61.jpg,"Remote Item","Iowa City Town and Campus Scenes",1,0
23031,https://www.iowaheritage.org/items/show/23031,"May Day festivities on Iowa Field, The University of Iowa, May 1915","May poles|May Day|University of Iowa|United States -- Iowa -- Iowa City|1910-1920|Dance|Women|Athletic fields|Costumes|Universities & colleges|Iowa Field (Iowa City, Iowa)",,"Kent, Frederick W. (Frederick Wallace), 1894-1984",,"University of Iowa. Libraries. University Archives",1915-05|2008-05,,"Educational use only, no other permissions given. U.S. and international copyright laws may protect this digital object. Commercial use or distribution of the object is not permitted without prior permission of the copyright holder.","Iowa City Town and Campus Scenes|Frederick W. Kent Collection of Photographs, 1866-2000|http://www.lib.uiowa.edu/collguides/?RG30.0001.01|Prints|Events and activities|Fetes|Fetes|Scanned with Ricoh Aficio 3228C at 600 ppi, full color. Master images saved in tiff format.",9|14,,"Still image|Photographs; Postcards|jpeg",RG30.0001.01|https://digital.lib.uiowa.edu/,,,,,,,,,,,,,,,,,,,,,,,,,,,,,,,,,,,,,,,,,,,,,,,,"<a href=""https://digital.lib.uiowa.edu/"" target=""_blank"">View this item in its source respository</a>",,,,,,,,,,,,,,,,,,,,,,,,,,,,,https://www.iowaheritage.org/files/original/20d0a4ca0995e126c56191f8ef83f4c7.jpg,"Remote Item","Iowa City Town and Campus Scenes",1,0
23035,https://www.iowaheritage.org/items/show/23035,"Women in Greek costume by mock Greek temple, City Park, The University of Iowa, 1915","Parks|University of Iowa|United States -- Iowa -- Iowa City|1910-1920|Women|Costumes|Stage props|Temples|Universities & colleges|City Park (Iowa City, Iowa)",,"Kent, Frederick W. (Frederick Wallace), 1894-1984",,"University of Iowa. Libraries. University Archives",1915|2008-05,,"Educational use only, no other permissions given. U.S. and international copyright laws may protect this digital object. Commercial use or distribution of the object is not permitted without prior permission of the copyright holder.","Iowa City Town and Campus Scenes|Frederick W. Kent Collection of Photographs, 1866-2000|http://www.lib.uiowa.edu/collguides/?RG30.0001.01|Prints|Events and activities|Fetes|Fetes|Scanned with Ricoh Aficio 3228C at 600 ppi, full color. Master images saved in tiff format.",9|14,,"Still image|Photographs; Postcards|jpeg",RG30.0001.01|https://digital.lib.uiowa.edu/,,,,,,,,,,,,,,,,,,,,,,,,,,,,,,,,,,,,,,,,,,,,,,,,"<a href=""https://digital.lib.uiowa.edu/"" target=""_blank"">View this item in its source respository</a>",,,,,,,,,,,,,,,,,,,,,,,,,,,,,https://www.iowaheritage.org/files/original/b4030bf45fed6326c28422b4c529353a.jpg,"Remote Item","Iowa City Town and Campus Scenes",1,0
23037,https://www.iowaheritage.org/items/show/23037,"Women in May Day costume, Iowa Field, The University of Iowa, May 1915","Athletic fields|May Day|University of Iowa|United States -- Iowa -- Iowa City|1910-1920|Women|Flowers|Costumes|Arbors (Bowers)|Universities & colleges|Iowa Field (Iowa City, Iowa)",,"Kent, Frederick W. (Frederick Wallace), 1894-1984",,"University of Iowa. Libraries. University Archives",1915-05|2008-05,,"Educational use only, no other permissions given. U.S. and international copyright laws may protect this digital object. Commercial use or distribution of the object is not permitted without prior permission of the copyright holder.","Iowa City Town and Campus Scenes|Frederick W. Kent Collection of Photographs, 1866-2000|http://www.lib.uiowa.edu/collguides/?RG30.0001.01|Prints|Events and activities|Fetes|Fetes|Scanned with Ricoh Aficio 3228C at 600 ppi, full color. Master images saved in tiff format.",9|14,,"Still image|Photographs; Postcards|jpeg",RG30.0001.01|https://digital.lib.uiowa.edu/,,,,,,,,,,,,,,,,,,,,,,,,,,,,,,,,,,,,,,,,,,,,,,,,"<a href=""https://digital.lib.uiowa.edu/"" target=""_blank"">View this item in its source respository</a>",,,,,,,,,,,,,,,,,,,,,,,,,,,,,https://www.iowaheritage.org/files/original/0772bf1c79c470d33e60a50e8e9e2bdf.jpg,"Remote Item","Iowa City Town and Campus Scenes",1,0
23043,https://www.iowaheritage.org/items/show/23043,"Women folk dancing for celebration on Iowa Field, The University of Iowa, June 1, 1917","Celebrations|University of Iowa|United States -- Iowa -- Iowa City|1910-1920|Athletic fields|Folk dancing|Costumes|Women|Universities & colleges|Iowa Field (Iowa City, Iowa)",,"Kent, Frederick W. (Frederick Wallace), 1894-1984",,"University of Iowa. Libraries. University Archives",1917-06-01|2008-05,,"Educational use only, no other permissions given. U.S. and international copyright laws may protect this digital object. Commercial use or distribution of the object is not permitted without prior permission of the copyright holder.","Iowa City Town and Campus Scenes|Frederick W. Kent Collection of Photographs, 1866-2000|http://www.lib.uiowa.edu/collguides/?RG30.0001.01|Prints|Events and activities|Fetes|Fetes|Scanned with Ricoh Aficio 3228C at 600 ppi, full color. Master images saved in tiff format.",9|14,,"Still image|Photographs; Postcards|jpeg",RG30.0001.01|https://digital.lib.uiowa.edu/,,,,,,,,,,,,,,,,,,,,,,,,,,,,,,,,,,,,,,,,,,,,,,,,"<a href=""https://digital.lib.uiowa.edu/"" target=""_blank"">View this item in its source respository</a>",,,,,,,,,,,,,,,,,,,,,,,,,,,,,https://www.iowaheritage.org/files/original/975f45aeffd46f37a07b3b400bdae244.jpg,"Remote Item","Iowa City Town and Campus Scenes",1,0
23045,https://www.iowaheritage.org/items/show/23045,"Procession of people in costume for Shakespeare tercentenary fete, The University of Iowa, 1916","Costumes|Shakespeare, William, 1564-1616|University of Iowa|United States -- Iowa -- Iowa City|1910-1920|Parades & processions|Celebrations|Commemorations|Universities & colleges","1916 was the 300th anniversary of William Shakespeare's death.","Kent, Frederick W. (Frederick Wallace), 1894-1984",,"University of Iowa. Libraries. University Archives",1916|2008-05,,"Educational use only, no other permissions given. U.S. and international copyright laws may protect this digital object. Commercial use or distribution of the object is not permitted without prior permission of the copyright holder.","Iowa City Town and Campus Scenes|Frederick W. Kent Collection of Photographs, 1866-2000|http://www.lib.uiowa.edu/collguides/?RG30.0001.01|Prints|Events and activities|Fetes|Fetes|Scanned with Ricoh Aficio 3228C at 600 ppi, full color. Master images saved in tiff format.",9|14,,"Still image|Photographs; Postcards|jpeg",RG30.0001.01|https://digital.lib.uiowa.edu/,,,,,,,,,,,,,,,,,,,,,,,,,,,,,,,,,,,,,,,,,,,,,,,,"<a href=""https://digital.lib.uiowa.edu/"" target=""_blank"">View this item in its source respository</a>",,,,,,,,,,,,,,,,,,,,,,,,,,,,,https://www.iowaheritage.org/files/original/bad2a01e9c0b2ada2060ccca71348d94.jpg,"Remote Item","Iowa City Town and Campus Scenes",1,0
23047,https://www.iowaheritage.org/items/show/23047,"Women performing May Day dance at Iowa Field, The University of Iowa, May 1915","Athletic fields|May Day|University of Iowa|United States -- Iowa -- Iowa City|1910-1920|Women|Dance|Costumes|May poles|Arbors (Bowers)|Universities & colleges|Iowa Field (Iowa City, Iowa)",,"Kent, Frederick W. (Frederick Wallace), 1894-1984",,"University of Iowa. Libraries. University Archives",1915-05|2008-05,,"Educational use only, no other permissions given. U.S. and international copyright laws may protect this digital object. Commercial use or distribution of the object is not permitted without prior permission of the copyright holder.","Iowa City Town and Campus Scenes|Frederick W. Kent Collection of Photographs, 1866-2000|http://www.lib.uiowa.edu/collguides/?RG30.0001.01|Prints|Events and activities|Fetes|Fetes|Scanned with Ricoh Aficio 3228C at 600 ppi, full color. Master images saved in tiff format.",9|14,,"Still image|Photographs; Postcards|jpeg",RG30.0001.01|https://digital.lib.uiowa.edu/,,,,,,,,,,,,,,,,,,,,,,,,,,,,,,,,,,,,,,,,,,,,,,,,"<a href=""https://digital.lib.uiowa.edu/"" target=""_blank"">View this item in its source respository</a>",,,,,,,,,,,,,,,,,,,,,,,,,,,,,https://www.iowaheritage.org/files/original/3aad0ec7d5d254a2c9e9c7fd5d1f6880.jpg,"Remote Item","Iowa City Town and Campus Scenes",1,0
23049,https://www.iowaheritage.org/items/show/23049,"Folk dancing for celebration on Iowa Field, The University of Iowa, June 1, 1917","Celebrations|University of Iowa|United States -- Iowa -- Iowa City|1910-1920|Folk dancing|Costumes|Athletic fields|Universities & colleges|Iowa Field (Iowa City, Iowa)",,"Kent, Frederick W. (Frederick Wallace), 1894-1984",,"University of Iowa. Libraries. University Archives",1917-06-01|2008-05,,"Educational use only, no other permissions given. U.S. and international copyright laws may protect this digital object. Commercial use or distribution of the object is not permitted without prior permission of the copyright holder.","Iowa City Town and Campus Scenes|Frederick W. Kent Collection of Photographs, 1866-2000|http://www.lib.uiowa.edu/collguides/?RG30.0001.01|Prints|Events and activities|Fetes|Fetes|Scanned with Ricoh Aficio 3228C at 600 ppi, full color. Master images saved in tiff format.",9|14,,"Still image|Photographs; Postcards|jpeg",RG30.0001.01|https://digital.lib.uiowa.edu/,,,,,,,,,,,,,,,,,,,,,,,,,,,,,,,,,,,,,,,,,,,,,,,,"<a href=""https://digital.lib.uiowa.edu/"" target=""_blank"">View this item in its source respository</a>",,,,,,,,,,,,,,,,,,,,,,,,,,,,,https://www.iowaheritage.org/files/original/e2516ae363d2e6d1f7bdc75e17971668.jpg,"Remote Item","Iowa City Town and Campus Scenes",1,0
23056,https://www.iowaheritage.org/items/show/23056,"Fete at City Park commemorating Shakespeare tercentenary, The University of Iowa, 1916","Crowds|Shakespeare, William, 1564-1616|University of Iowa|United States -- Iowa -- Iowa City|1910-1920|Costumes|Stages (Platforms)|Theatrical productions|Celebrations|Commemorations|Universities & colleges|City Park (Iowa City, Iowa)","1916 was the 300th anniversary of William Shakespeare's death.","Kent, Frederick W. (Frederick Wallace), 1894-1984",,"University of Iowa. Libraries. University Archives",1916|2008-05,,"Educational use only, no other permissions given. U.S. and international copyright laws may protect this digital object. Commercial use or distribution of the object is not permitted without prior permission of the copyright holder.","Iowa City Town and Campus Scenes|Frederick W. Kent Collection of Photographs, 1866-2000|http://www.lib.uiowa.edu/collguides/?RG30.0001.01|Prints|Events and activities|Fetes|Fetes|Scanned with Ricoh Aficio 3228C at 600 ppi, full color. Master images saved in tiff format.",9|14,,"Still image|Photographs; Postcards|jpeg",RG30.0001.01|https://digital.lib.uiowa.edu/,,,,,,,,,,,,,,,,,,,,,,,,,,,,,,,,,,,,,,,,,,,,,,,,"<a href=""https://digital.lib.uiowa.edu/"" target=""_blank"">View this item in its source respository</a>",,,,,,,,,,,,,,,,,,,,,,,,,,,,,https://www.iowaheritage.org/files/original/944db2ba89288058b2eff5b71ffcc7a9.jpg,"Remote Item","Iowa City Town and Campus Scenes",1,0
23064,https://www.iowaheritage.org/items/show/23064,"Women dancing on Iowa Field for celebration, The University of Iowa, June 1, 1917","Dance|University of Iowa|United States -- Iowa -- Iowa City|1910-1920|Athletic fields|Bleachers|Women|Costumes|Celebrations|Universities & colleges|Iowa Field (Iowa City, Iowa)",,"Kent, Frederick W. (Frederick Wallace), 1894-1984",,"University of Iowa. Libraries. University Archives",1917-06-01|2008-05,,"Educational use only, no other permissions given. U.S. and international copyright laws may protect this digital object. Commercial use or distribution of the object is not permitted without prior permission of the copyright holder.","Iowa City Town and Campus Scenes|Frederick W. Kent Collection of Photographs, 1866-2000|http://www.lib.uiowa.edu/collguides/?RG30.0001.01|Prints|Events and activities|Fetes|Fetes|Scanned with Ricoh Aficio 3228C at 600 ppi, full color. Master images saved in tiff format.",9|14,,"Still image|Photographs; Postcards|jpeg",RG30.0001.01|https://digital.lib.uiowa.edu/,,,,,,,,,,,,,,,,,,,,,,,,,,,,,,,,,,,,,,,,,,,,,,,,"<a href=""https://digital.lib.uiowa.edu/"" target=""_blank"">View this item in its source respository</a>",,,,,,,,,,,,,,,,,,,,,,,,,,,,,https://www.iowaheritage.org/files/original/8548c73261e4ee401a0412b9f6201f55.jpg,"Remote Item","Iowa City Town and Campus Scenes",1,0
