 




﻿"Item Id","Item URI","Dublin Core:Title","Dublin Core:Subject","Dublin Core:Description","Dublin Core:Creator","Dublin Core:Source","Dublin Core:Publisher","Dublin Core:Date","Dublin Core:Contributor","Dublin Core:Rights","Dublin Core:Relation","Dublin Core:Format","Dublin Core:Language","Dublin Core:Type","Dublin Core:Identifier","Dublin Core:Coverage","Item Type Metadata:Text","Item Type Metadata:Interviewer","Item Type Metadata:Interviewee","Item Type Metadata:Location","Item Type Metadata:Transcription","Item Type Metadata:Local URL","Item Type Metadata:Original Format","Item Type Metadata:Physical Dimensions","Item Type Metadata:Duration","Item Type Metadata:Compression","Item Type Metadata:Producer","Item Type Metadata:Director","Item Type Metadata:Bit Rate/Frequency","Item Type Metadata:Time Summary","Item Type Metadata:Email Body","Item Type Metadata:Subject Line","Item Type Metadata:From","Item Type Metadata:To","Item Type Metadata:CC","Item Type Metadata:BCC","Item Type Metadata:Number of Attachments","Item Type Metadata:Standards","Item Type Metadata:Objectives","Item Type Metadata:Materials","Item Type Metadata:Lesson Plan Text","Item Type Metadata:URL","Item Type Metadata:Event Type","Item Type Metadata:Participants","Item Type Metadata:Birth Date","Item Type Metadata:Birthplace","Item Type Metadata:Death Date","Item Type Metadata:Occupation","Item Type Metadata:Biographical Text","Item Type Metadata:Bibliography","Item Type Metadata:Digital Reproduction Information","Item Type Metadata:Repository","Item Type Metadata:Repository Collection","Item Type Metadata:Contact information.","Item Type Metadata:File Name","Item Type Metadata:Notes","Item Type Metadata:Digital item created","Item Type Metadata:Digital item modified","Item Type Metadata:Executive Orders","Item Type Metadata:Record Created","Item Type Metadata:Record Modified","Item Type Metadata:Transcription2","Item Type Metadata:Source URL","Omeka Legacy File:Additional Creator","Omeka Legacy File:Transcriber","Omeka Legacy File:Producer","Omeka Legacy File:Render Device","Omeka Legacy File:Render Details","Omeka Legacy File:Capture Date","Omeka Legacy File:Capture Device","Omeka Legacy File:Capture Details","Omeka Legacy File:Change History","Omeka Legacy File:Watermark","Omeka Legacy File:Encryption","Omeka Legacy File:Compression","Omeka Legacy File:Post Processing","Omeka Image File:Width","Omeka Image File:Height","Omeka Image File:Bit Depth","Omeka Image File:Channels","Omeka Image File:Exif String","Omeka Image File:Exif Array","Omeka Image File:IPTC String","Omeka Image File:IPTC Array","Omeka Video File:Bitrate","Omeka Video File:Duration","Omeka Video File:Sample Rate","Omeka Video File:Codec","Omeka Video File:Width","Omeka Video File:Height",tags,file,itemType,collection,public,featured
78874,https://www.iowaheritage.org/items/show/78874,"Town Square Gathering, Oskaloosa, Iowa, Late 1800's; Mahaska County","Oskaloosa|Iowa|Mahaska County|Late 19th Century|Town Square|Gathering","The town square in many small towns across America served as a link for town members to connect with one another.  In this photograph, for example, the square allowed for casual socialization among friends, spouses, and business owners.  From the middle of the 1800's to present day Oskaloosa, Iowa, the people have established and maintained a town square that has allowed for positive interaction among community members.","Chuck Russell","Chuck Russell","Chuck Russell","""2009-03-08""",,www.wmpenn.edu/library/about.html,,"still image/jpeg",,image,"www.wmpenn.edu/library/about.html|http://cdm16125.contentdm.oclc.org/u?/p270701coll6,181",,,,,,,,,,,,,,,,,,,,,,,,,,,,,,,,,,,,,,,,,,,,,,,,"<a href=""http://cdm16125.contentdm.oclc.org/u?/p270701coll6,181"" target=""_blank"">View this item in its source respository</a>",,,,,,,,,,,,,,,,,,,,,,,,,,,,,https://www.iowaheritage.org/files/original/0742a03a29267aa87736fe80f8a4a33c.jpg,"Remote Item","Mahaska History",1,0
78420,https://www.iowaheritage.org/items/show/78420,"Tom Schultz's Farm, 1930's; Mahaska County, Iowa","Farming|Depression|20th Century|Tom Schultz|Midwest|Mahaska County|Iowa","Much of the livlihood of Mahaska County, and for that matter, Iowa, has depended on farming, and the success each year brings.  Pictured here is a scene on Tom Schultz's farm during the Great Depression in the 1930's.  By no means was farming a one-man operation, as the entire family or community in some cases would get involved during harvest time.","Mahaska County Historical Society","Historical Archives","Mahaska County Historical Society",1930's|2008-08-04,,www.nelsonpioneer.org,,"still image/jpeg",,image,"Mahaska County Historical Society|http://cdm16125.contentdm.oclc.org/u?/p270701coll7,80",,,,,,,,,,,,,,,,,,,,,,,,,,,,,,,,,,,,,,,,,,,,,,,,"<a href=""http://cdm16125.contentdm.oclc.org/u?/p270701coll7,80"" target=""_blank"">View this item in its source respository</a>",,,,,,,,,,,,,,,,,,,,,,,,,,,,,https://www.iowaheritage.org/files/original/ef5d53b11f4b12ffb8bc4965f7aeef1e.jpg,"Remote Item","Mahaska County Historical Society",1,0
78689,https://www.iowaheritage.org/items/show/78689,"Tioga, IA, 1913 map; White Oak Township; Mahaska County; Iowa","Map|Towns|Townships|Mahaska County|Iowa","Tioga was established as a meeting place for coal trains coming from the Muchakinock mines, so the town of Tioga was established and platted on August 24, 1886.  The most memorable occurence in Tioga was the train wreck that took place on September 16, 1899.  A fully-loaded coal train powered by two engines collided with a passenger train at full speed, killing four trainmen from Belle Plaine.  The town continued to thrive though until the 1920's and 30's, when the Great Depression took its toll on the community, causing its citizens to scatter to various places.  This is a town plat of Tioga in 1913.","Mahaska County Historical Society","Mahaska County Collection","Curtis Media Corporation: Dallas, Texas",2008-07-19,,www.wmpenn.edu/library/library/about.html,,"still image/jpeg",,image,"Wilcox Library|http://cdm16125.contentdm.oclc.org/u?/p270701coll6,81",,,,,,,,,,,,,,,,,,,,,,,,,,,,,,,,,,,,,,,,,,,,,,,,"<a href=""http://cdm16125.contentdm.oclc.org/u?/p270701coll6,81"" target=""_blank"">View this item in its source respository</a>",,,,,,,,,,,,,,,,,,,,,,,,,,,,,https://www.iowaheritage.org/files/original/73ce2b62c4c94527497c728c56cb94f1.jpg,"Remote Item","Mahaska History",1,0
78421,https://www.iowaheritage.org/items/show/78421,"Threshing on the T.B. Emmert Farm, 1898, Cedar, Iowa; Mahaska County","Farming|19th Century|T.B. Emmert|Midwest|Cedar|Mahaska County|Iowa","Much of the livelihood of Mahaska County, and for that matter, Iowa, has depended on farming, and the success each year brings.  Pictured here is a scene on T.B. Emmert's farm in the small community of Cedar, Iowa, in 1898.  The process that is taking place in this picture is called threshing, where a machine or tool is used to separate the seed or grain from the crop; in this case, wheat.","Mahaska County Historical Society","Historical Archives","Mahaska County Historical Society",1898|2008-08-04,"Mrs. Ed Gilchrist",www.nelsonpioneer.org,,"still image/jpeg",,image,"Mahaska County Historical Society|http://cdm16125.contentdm.oclc.org/u?/p270701coll7,81",,,,,,,,,,,,,,,,,,,,,,,,,,,,,,,,,,,,,,,,,,,,,,,,"<a href=""http://cdm16125.contentdm.oclc.org/u?/p270701coll7,81"" target=""_blank"">View this item in its source respository</a>",,,,,,,,,,,,,,,,,,,,,,,,,,,,,https://www.iowaheritage.org/files/original/c048d93522554978c7fd42671f999550.jpg,"Remote Item","Mahaska County Historical Society",1,0
78706,https://www.iowaheritage.org/items/show/78706,"Thomas Gray, Eddyville, IA; Civil War Casualty; Mahaska County; Iowa","Civil War|Union|Casualties|Battle of Pea Ridge (March 6-8, 1862)|Fayetteville, Arkansas|Eddyville, Iowa|Mahaska County","Thomas Gray enlisted in the Union Army on August 24, 1861.  He was from the booming river town of Eddyville, Iowa, located in Mahaska County.  After being mustered up the next month, Gray was engaged in some of the earliest battles of the Civil War.  At the Battle of Pea Ridge (March 6-8, 1862), Gray was killed in action on March 7.  He is buried at Fayetteville National Cemetery, Arkansas in Section 2, Grave 47.","Mahaska County Historical Society","Historical Archives","Mahaska County Historical Society",2008-07-23,,www.nelsonpioneer.org,,"still image/jpeg",,image,"Mahaska County Historical Society|http://cdm16125.contentdm.oclc.org/u?/p270701coll6,92",,,,,,,,,,,,,,,,,,,,,,,,,,,,,,,,,,,,,,,,,,,,,,,,"<a href=""http://cdm16125.contentdm.oclc.org/u?/p270701coll6,92"" target=""_blank"">View this item in its source respository</a>",,,,,,,,,,,,,,,,,,,,,,,,,,,,,https://www.iowaheritage.org/files/original/3b88f3201743104e3b56bca7449198a2.jpg,"Remote Item","Mahaska History",1,0
78577,https://www.iowaheritage.org/items/show/78577,"The Oskaloosa Town Square Bandstand, dedicated in 1912","Town Square|Bandstand|20th Century|Midwest|Iowa|Mahaska County|Oskaloosa","The bandstand pictured here replaced the old wooden bandstand that was built back in 1882.  This bandstand was erected in 1912 and still stands and is made use of to this day.","Mahaska County Historical Society","Mahaska County Collection","Curtis Media Corporation: Dallas, Texas",2008-06-22,,www.wmpenn.edu/library/library/about.html,,"still image/jpeg",,image,"Wilcox Library|http://cdm16125.contentdm.oclc.org/u?/p270701coll6,26",,,,,,,,,,,,,,,,,,,,,,,,,,,,,,,,,,,,,,,,,,,,,,,,"<a href=""http://cdm16125.contentdm.oclc.org/u?/p270701coll6,26"" target=""_blank"">View this item in its source respository</a>",,,,,,,,,,,,,,,,,,,,,,,,,,,,,https://www.iowaheritage.org/files/original/9528fd6a9d222859f56ae7186e96c2df.jpg,"Remote Item","Mahaska History",1,0
79061,https://www.iowaheritage.org/items/show/79061,"The Oskaloosa City Park in the Late 1800's, Iowa","City Park|Town Square|Oskaloosa|Iowa|Mahaska County|Late 19th Century","The Oskaloosa City Park has been a center of activity in the community for over a century, as events and entertainment have been conducted within the realm of the park.  Also known as the town square, many businesses surround the park, so in many ways, the city park is really the center focal point for the community.  One of the best features of the city park is the famous bandstand that stands in the center of the park.  For years, C.L. Barnhouse and the Iowa Brigade Band would draw hundreds of people to hear their performances live at the bandstand.  Before it became the city park, the area directly below the bandstand was the sight of an artesian well dig to supply the residents of Oskaloosa with water.  After much money and five years were invested into the project empty-handed, the project was abandoned, a bandstand was built over the 2,000 foot hole, and a city park was created around the bandstand's outskirts.","Chuck Russell","Chuck Russell","Chuck Russell","""2009-06-08""",,www.wmpenn.edu/library/about.html,,"still image/jpeg 2000",,image,"www.wmpenn.edu/library/about.html|http://cdm16125.contentdm.oclc.org/u?/p270701coll6,276",,,,,,,,,,,,,,,,,,,,,,,,,,,,,,,,,,,,,,,,,,,,,,,,"<a href=""http://cdm16125.contentdm.oclc.org/u?/p270701coll6,276"" target=""_blank"">View this item in its source respository</a>",,,,,,,,,,,,,,,,,,,,,,,,,,,,,https://www.iowaheritage.org/files/original/4c031ce8199f2b3c067bf8f6baec05f9.jpg,"Remote Item","Mahaska History",1,0
78575,https://www.iowaheritage.org/items/show/78575,"The Old Wooden Bandstand, Oskaloosa, IA, 1882; Town Square","Town Square|Bandstand|19th Century|Midwest|Iowa|Mahaska County|Oskaloosa","The old wooden bandstand was built back in 1882 so that performers like C.L. Barnhouse's Iowa Brigade Band could entertain spectators from around the county.  The bandstand was originally built to cover the cap underneath that came about as a result of a failed 2,500 foot artesian well dig that cost Oskaloosa and Mahaska County $35,000 between 1872-1876.  On the rights side of the photo stands a cannon commemorating the Grand Army of the Republic.","Mahaska County Historical Society","Mahaska County Collection","Curtis Media Corporation: Dallas, Texas",2008-06-22,,www.wmpenn.edu/library/library/about.html,,"still image/jpeg",,image,"Wilcox Library|http://cdm16125.contentdm.oclc.org/u?/p270701coll6,25",,,,,,,,,,,,,,,,,,,,,,,,,,,,,,,,,,,,,,,,,,,,,,,,"<a href=""http://cdm16125.contentdm.oclc.org/u?/p270701coll6,25"" target=""_blank"">View this item in its source respository</a>",,,,,,,,,,,,,,,,,,,,,,,,,,,,,https://www.iowaheritage.org/files/original/759ae9fdf6d64b59ca04f52959b65219.jpg,"Remote Item","Mahaska History",1,0
78509,https://www.iowaheritage.org/items/show/78509,"The McNeill Home, built in 1909; Oskaloosa, Mahaska County; Iowa","Historic Home|McNeill|Mahaska County|Oskaloosa|Iowa","This is a photograph taken of the home of W.A. McNeill, which was built between the years 1908-1909 by the architecture firm Hallett and Rawson.  The outside of the home is built with limestone.  Today, the home is host to a bed and breakfast and is known as the McNeill stone mansion, located on C Avenue East.","Mahaska County Historical Society","Historical Archives","Mahaska County Historical Society",1910?|2008-08-11,,www.nelsonpioneer.org,,"still image/jpeg",,image,"Mahaska County Historical Society|http://cdm16125.contentdm.oclc.org/u?/p270701coll7,171",,,,,,,,,,,,,,,,,,,,,,,,,,,,,,,,,,,,,,,,,,,,,,,,"<a href=""http://cdm16125.contentdm.oclc.org/u?/p270701coll7,171"" target=""_blank"">View this item in its source respository</a>",,,,,,,,,,,,,,,,,,,,,,,,,,,,,https://www.iowaheritage.org/files/original/23e406408c2ad062f45b78f2ab802273.jpg,"Remote Item","Mahaska County Historical Society",1,0
78516,https://www.iowaheritage.org/items/show/78516,"The Knights Templar Band, 1886-1890; Oskaloosa; Mahaska County; Iowa","Knights Templar Band|19th Century|Music|Oskaloosa|Mahaska County|Iowa","In Oskaloosa, Iowa, music has always been appreciated and taken seriously by its bands.  One of the first bands in Oskaloosa was the Knights Templar Band, formed out of the musical brotherhood that existed within the town.  On weekends and on special days, the Knights Templar Band would play on top of the town square's bandstand before a large audience of families and friends in the community.  Here they are pictured in front of the Oskaloosa bandstand created by C.L. Barnhouse.",,"Historical Archives","Mahaska County Historical Society",1886-1890|2008-08-12,"Mahaska County Historical Society",www.nelsonpioneer.org,,"still image/jpeg",,image,"Mahaska County Historical Society|http://cdm16125.contentdm.oclc.org/u?/p270701coll7,178",,,,,,,,,,,,,,,,,,,,,,,,,,,,,,,,,,,,,,,,,,,,,,,,"<a href=""http://cdm16125.contentdm.oclc.org/u?/p270701coll7,178"" target=""_blank"">View this item in its source respository</a>",,,,,,,,,,,,,,,,,,,,,,,,,,,,,https://www.iowaheritage.org/files/original/0b4fd4b6b008514fd21965a90b86832b.jpg,"Remote Item","Mahaska County Historical Society",1,0
