 




﻿"Item Id","Item URI","Dublin Core:Title","Dublin Core:Subject","Dublin Core:Description","Dublin Core:Creator","Dublin Core:Source","Dublin Core:Publisher","Dublin Core:Date","Dublin Core:Contributor","Dublin Core:Rights","Dublin Core:Relation","Dublin Core:Format","Dublin Core:Language","Dublin Core:Type","Dublin Core:Identifier","Dublin Core:Coverage","Item Type Metadata:Text","Item Type Metadata:Interviewer","Item Type Metadata:Interviewee","Item Type Metadata:Location","Item Type Metadata:Transcription","Item Type Metadata:Local URL","Item Type Metadata:Original Format","Item Type Metadata:Physical Dimensions","Item Type Metadata:Duration","Item Type Metadata:Compression","Item Type Metadata:Producer","Item Type Metadata:Director","Item Type Metadata:Bit Rate/Frequency","Item Type Metadata:Time Summary","Item Type Metadata:Email Body","Item Type Metadata:Subject Line","Item Type Metadata:From","Item Type Metadata:To","Item Type Metadata:CC","Item Type Metadata:BCC","Item Type Metadata:Number of Attachments","Item Type Metadata:Standards","Item Type Metadata:Objectives","Item Type Metadata:Materials","Item Type Metadata:Lesson Plan Text","Item Type Metadata:URL","Item Type Metadata:Event Type","Item Type Metadata:Participants","Item Type Metadata:Birth Date","Item Type Metadata:Birthplace","Item Type Metadata:Death Date","Item Type Metadata:Occupation","Item Type Metadata:Biographical Text","Item Type Metadata:Bibliography","Item Type Metadata:Digital Reproduction Information","Item Type Metadata:Repository","Item Type Metadata:Repository Collection","Item Type Metadata:Contact information.","Item Type Metadata:File Name","Item Type Metadata:Notes","Item Type Metadata:Digital item created","Item Type Metadata:Digital item modified","Item Type Metadata:Executive Orders","Item Type Metadata:Record Created","Item Type Metadata:Record Modified","Item Type Metadata:Transcription2","Item Type Metadata:Source URL","Omeka Legacy File:Additional Creator","Omeka Legacy File:Transcriber","Omeka Legacy File:Producer","Omeka Legacy File:Render Device","Omeka Legacy File:Render Details","Omeka Legacy File:Capture Date","Omeka Legacy File:Capture Device","Omeka Legacy File:Capture Details","Omeka Legacy File:Change History","Omeka Legacy File:Watermark","Omeka Legacy File:Encryption","Omeka Legacy File:Compression","Omeka Legacy File:Post Processing","Omeka Image File:Width","Omeka Image File:Height","Omeka Image File:Bit Depth","Omeka Image File:Channels","Omeka Image File:Exif String","Omeka Image File:Exif Array","Omeka Image File:IPTC String","Omeka Image File:IPTC Array","Omeka Video File:Bitrate","Omeka Video File:Duration","Omeka Video File:Sample Rate","Omeka Video File:Codec","Omeka Video File:Width","Omeka Video File:Height",tags,file,itemType,collection,public,featured
31113,https://www.iowaheritage.org/items/show/31113,"First graders watching a student feed a chicken, The University of Iowa elementary school, May 1932","Universities & colleges|Elementary schools|University of Iowa|United States -- Iowa -- Iowa City|1930-1940|Laboratory schools|Students|School children|Chickens|University of Iowa. College of Education","The University Elementary School,established in 1915, was a laboratory or experimental school directed through the College of Education for the training of principals, superintendents and teachers. Along with the University High School, it was closed in 1972 due to lack of funding.","Kent, Frederick W. (Frederick Wallace), 1894-1984",,"University of Iowa. Libraries. University Archives",1932-05|2010-09-12,,"Educational use only, no other permissions given. U.S. and international copyright laws may protect this digital object. Commercial use or distribution of the object is not permitted without prior permission of the copyright holder.","Iowa City Town and Campus Scenes|Frederick W. Kent Collection of Photographs, 1866-2000|http://www.lib.uiowa.edu/collguides/?RG30.0001.01|Prints|Organizations|University Elementary School|University Elementary School|Scanned with Ricoh Aficio 3228C @ 600 ppi. Master image saved in TIFF format",3|4,,"Still image|Photographs|jpeg",RG30.0001.01|index.cpd|https://digital.lib.uiowa.edu/,,,,,,,,,,,,,,,,,,,,,,,,,,,,,,,,,,,,,,,,,,,,,,,,"<a href=""https://digital.lib.uiowa.edu/"" target=""_blank"">View this item in its source respository</a>",,,,,,,,,,,,,,,,,,,,,,,,,,,,,https://www.iowaheritage.org/files/original/95ed6b57b8c8b4a71f7d3286d6ea548f.jpg,"Remote Item","Iowa City Town and Campus Scenes",1,0
31475,https://www.iowaheritage.org/items/show/31475,"First graders with chickens at Dane farm, The University of Iowa, May 15, 1939","Universities & colleges|Elementary schools|Dane family|University of Iowa|United States -- Iowa -- Iowa City|1930-1940|School children|Chickens|Poultry houses|Farms|University of Iowa. College of Education","The University Elementary School,established in 1915, was a laboratory or experimental school directed through the College of Education for the training of principals, superintendents and teachers. Along with the University High School, it was closed in 1972 due to lack of funding.","Kent, Frederick W. (Frederick Wallace), 1894-1984",,"University of Iowa. Libraries. University Archives",1939-05-15|2010-09-12,,"Educational use only, no other permissions given. U.S. and international copyright laws may protect this digital object. Commercial use or distribution of the object is not permitted without prior permission of the copyright holder.","Iowa City Town and Campus Scenes|Frederick W. Kent Collection of Photographs, 1866-2000|http://www.lib.uiowa.edu/collguides/?RG30.0001.01|Prints|Organizations|University Elementary School|University Elementary School|Scanned with Ricoh Aficio 3228C @ 600 ppi. Master image saved in TIFF format",,,"Still image|Photographs|jpeg",RG30.0001.01|org20-0082.jpg|https://digital.lib.uiowa.edu/,,,,,,,,,,,,,,,,,,,,,,,,,,,,,,,,,,,,,,,,,,,,,,,,"<a href=""https://digital.lib.uiowa.edu/"" target=""_blank"">View this item in its source respository</a>",,,,,,,,,,,,,,,,,,,,,,,,,,,,,https://www.iowaheritage.org/files/original/1647ce4b0b4da9f44d5165bdcc8fbf1b.jpg,"Remote Item","Iowa City Town and Campus Scenes",1,0
31476,https://www.iowaheritage.org/items/show/31476,"First graders with farm equipment, The University of Iowa, May 15, 1939","Universities & colleges|Elementary schools|University of Iowa|United States -- Iowa -- Iowa City|1930-1940|School children|Farms|Agricultural machinery & implements|University of Iowa. College of Education","The University Elementary School,established in 1915, was a laboratory or experimental school directed through the College of Education for the training of principals, superintendents and teachers. Along with the University High School, it was closed in 1972 due to lack of funding.","Kent, Frederick W. (Frederick Wallace), 1894-1984",,"University of Iowa. Libraries. University Archives",1939-05-15|2010-09-12,,"Educational use only, no other permissions given. U.S. and international copyright laws may protect this digital object. Commercial use or distribution of the object is not permitted without prior permission of the copyright holder.","Iowa City Town and Campus Scenes|Frederick W. Kent Collection of Photographs, 1866-2000|http://www.lib.uiowa.edu/collguides/?RG30.0001.01|Prints|Organizations|University Elementary School|University Elementary School|Scanned with Ricoh Aficio 3228C @ 600 ppi. Master image saved in TIFF format",,,"Still image|Photographs|jpeg",RG30.0001.01|org20-0083.jpg|https://digital.lib.uiowa.edu/,,,,,,,,,,,,,,,,,,,,,,,,,,,,,,,,,,,,,,,,,,,,,,,,"<a href=""https://digital.lib.uiowa.edu/"" target=""_blank"">View this item in its source respository</a>",,,,,,,,,,,,,,,,,,,,,,,,,,,,,https://www.iowaheritage.org/files/original/e7247b16aa752a77c463b7064bb1c9e2.jpg,"Remote Item","Iowa City Town and Campus Scenes",1,0
31137,https://www.iowaheritage.org/items/show/31137,"First graders with teacher on stage, The University of Iowa elementary school, March 1958","Universities & colleges|Elementary schools|University of Iowa|United States -- Iowa -- Iowa City|1950-1960|Laboratory schools|Teachers|Students|School children|Stages (Platforms)|Auditoriums|Audiences|Pianos|University of Iowa. College of Education","The University Elementary School,established in 1915, was a laboratory or experimental school directed through the College of Education for the training of principals, superintendents and teachers. Along with the University High School, it was closed in 1972 due to lack of funding.","Kent, Frederick W. (Frederick Wallace), 1894-1984",,"University of Iowa. Libraries. University Archives",1958-03|2010-09-12,,"Educational use only, no other permissions given. U.S. and international copyright laws may protect this digital object. Commercial use or distribution of the object is not permitted without prior permission of the copyright holder.","Iowa City Town and Campus Scenes|Frederick W. Kent Collection of Photographs, 1866-2000|http://www.lib.uiowa.edu/collguides/?RG30.0001.01|Prints|Organizations|University Elementary School|University Elementary School|Scanned with Ricoh Aficio 3228C @ 600 ppi. Master image saved in TIFF format",,,"Still image|Photographs|jpeg",RG30.0001.01|index.cpd|https://digital.lib.uiowa.edu/,,,,,,,,,,,,,,,,,,,,,,,,,,,,,,,,,,,,,,,,,,,,,,,,"<a href=""https://digital.lib.uiowa.edu/"" target=""_blank"">View this item in its source respository</a>",,,,,,,,,,,,,,,,,,,,,,,,,,,,,https://www.iowaheritage.org/files/original/ba8ebcbcc69e2b5e68a384b2ae506791.jpg,"Remote Item","Iowa City Town and Campus Scenes",1,0
31220,https://www.iowaheritage.org/items/show/31220,"First-grade health and safety display, The University of Iowa, February 1928","Universities & colleges|Elementary schools|University of Iowa|United States -- Iowa -- Iowa City|1920-1930|Schools|Posters|Bulletin boards|Exhibitions|First aid|Health|Safety|University of Iowa. College of Education","The University Elementary School,established in 1915, was a laboratory or experimental school directed through the College of Education for the training of principals, superintendents and teachers. Along with the University High School, it was closed in 1972 due to lack of funding. It was originally housed in the Old Dental Building, known at the time as the Observational Schools Building.","Kent, Frederick W. (Frederick Wallace), 1894-1984",,"University of Iowa. Libraries. University Archives",1928-02|2010-09-12,,"Educational use only, no other permissions given. U.S. and international copyright laws may protect this digital object. Commercial use or distribution of the object is not permitted without prior permission of the copyright holder.","Iowa City Town and Campus Scenes|Frederick W. Kent Collection of Photographs, 1866-2000|http://www.lib.uiowa.edu/collguides/?RG30.0001.01|Prints|Organizations|University Elementary School|University Elementary School|Scanned with Ricoh Aficio 3228C @ 600 ppi. Master image saved in TIFF format",,,"Still image|Photographs|jpeg",RG30.0001.01|index.cpd|https://digital.lib.uiowa.edu/,,,,,,,,,,,,,,,,,,,,,,,,,,,,,,,,,,,,,,,,,,,,,,,,"<a href=""https://digital.lib.uiowa.edu/"" target=""_blank"">View this item in its source respository</a>",,,,,,,,,,,,,,,,,,,,,,,,,,,,,https://www.iowaheritage.org/files/original/33b4b088eae45156f661dfd2bf6bc01c.jpg,"Remote Item","Iowa City Town and Campus Scenes",1,0
31131,https://www.iowaheritage.org/items/show/31131,"First-grade presentation, The University of Iowa, June 1, 1932","Universities & colleges|Elementary schools|University of Iowa|United States -- Iowa -- Iowa City|1930-1940|Schools|School children|Classrooms|Public speaking|University of Iowa. College of Education","The University Elementary School,established in 1915, was a laboratory or experimental school directed through the College of Education for the training of principals, superintendents and teachers. Along with the University High School, it was closed in 1972 due to lack of funding.","Kent, Frederick W. (Frederick Wallace), 1894-1984",,"University of Iowa. Libraries. University Archives",1932-06-01|2010-09-12,,"Educational use only, no other permissions given. U.S. and international copyright laws may protect this digital object. Commercial use or distribution of the object is not permitted without prior permission of the copyright holder.","Iowa City Town and Campus Scenes|Frederick W. Kent Collection of Photographs, 1866-2000|http://www.lib.uiowa.edu/collguides/?RG30.0001.01|Prints|Organizations|University Elementary School|University Elementary School|Scanned with Ricoh Aficio 3228C @ 600 ppi. Master image saved in TIFF format",4|7,,"Still image|Photographs|jpeg",RG30.0001.01|index.cpd|https://digital.lib.uiowa.edu/,,,,,,,,,,,,,,,,,,,,,,,,,,,,,,,,,,,,,,,,,,,,,,,,"<a href=""https://digital.lib.uiowa.edu/"" target=""_blank"">View this item in its source respository</a>",,,,,,,,,,,,,,,,,,,,,,,,,,,,,https://www.iowaheritage.org/files/original/eff8b97488ae3d55fd8f3ebad84dd87b.jpg,"Remote Item","Iowa City Town and Campus Scenes",1,0
31085,https://www.iowaheritage.org/items/show/31085,"First-grade students feeding ducks, The University of Iowa, May 15, 1930","Universities & colleges|Elementary schools|University of Iowa|United States -- Iowa -- Iowa City|1930-1940|Schools|School children|Ducks|Animal feeding|Flowers|University of Iowa. College of Education","The University Elementary School,established in 1915, was a laboratory or experimental school directed through the College of Education for the training of principals, superintendents and teachers. Along with the University High School, it was closed in 1972 due to lack of funding.","Kent, Frederick W. (Frederick Wallace), 1894-1984",,"University of Iowa. Libraries. University Archives",1930-05-15|2010-09-12,,"Educational use only, no other permissions given. U.S. and international copyright laws may protect this digital object. Commercial use or distribution of the object is not permitted without prior permission of the copyright holder.","Iowa City Town and Campus Scenes|Frederick W. Kent Collection of Photographs, 1866-2000|http://www.lib.uiowa.edu/collguides/?RG30.0001.01|Prints|Organizations|University Elementary School|University Elementary School|Scanned with Ricoh Aficio 3228C @ 600 ppi. Master image saved in TIFF format",5|7,,"Still image|Photographs|jpeg",RG30.0001.01|index.cpd|https://digital.lib.uiowa.edu/,,,,,,,,,,,,,,,,,,,,,,,,,,,,,,,,,,,,,,,,,,,,,,,,"<a href=""https://digital.lib.uiowa.edu/"" target=""_blank"">View this item in its source respository</a>",,,,,,,,,,,,,,,,,,,,,,,,,,,,,https://www.iowaheritage.org/files/original/062419d3a4ce3da19b5b8d8f28a9fe58.jpg,"Remote Item","Iowa City Town and Campus Scenes",1,0
31086,https://www.iowaheritage.org/items/show/31086,"First-grade students feeding ducks, The University of Iowa, May 15, 1930","Universities & colleges|Elementary schools|University of Iowa|United States -- Iowa -- Iowa City|1930-1940|Schools|School children|Ducks|Animal feeding|Flowers|University of Iowa. College of Education","The University Elementary School,established in 1915, was a laboratory or experimental school directed through the College of Education for the training of principals, superintendents and teachers. Along with the University High School, it was closed in 1972 due to lack of funding.","Kent, Frederick W. (Frederick Wallace), 1894-1984",,"University of Iowa. Libraries. University Archives",1930-05-15|2010-09-12,,"Educational use only, no other permissions given. U.S. and international copyright laws may protect this digital object. Commercial use or distribution of the object is not permitted without prior permission of the copyright holder.","Iowa City Town and Campus Scenes|Frederick W. Kent Collection of Photographs, 1866-2000|http://www.lib.uiowa.edu/collguides/?RG30.0001.01|Prints|Organizations|University Elementary School|University Elementary School|Scanned with Ricoh Aficio 3228C @ 600 ppi. Master image saved in TIFF format",4|7,,"Still image|Photographs|jpeg",RG30.0001.01|index.cpd|https://digital.lib.uiowa.edu/,,,,,,,,,,,,,,,,,,,,,,,,,,,,,,,,,,,,,,,,,,,,,,,,"<a href=""https://digital.lib.uiowa.edu/"" target=""_blank"">View this item in its source respository</a>",,,,,,,,,,,,,,,,,,,,,,,,,,,,,https://www.iowaheritage.org/files/original/2687ef1a316b6d0d7570dc873e129bd9.jpg,"Remote Item","Iowa City Town and Campus Scenes",1,0
31468,https://www.iowaheritage.org/items/show/31468,"Fourth grade class watching glass-blowing demonstration, The University of Iowa, May 11, 1935","Universities & colleges|Elementary schools|University of Iowa|United States -- Iowa -- Iowa City|1930-1940|Schools|School children|Demonstrations|Glassblowing|Glass|University of Iowa. College of Education","The University Elementary School,established in 1915, was a laboratory or experimental school directed through the College of Education for the training of principals, superintendents and teachers. Along with the University High School, it was closed in 1972 due to lack of funding.","Kent, Frederick W. (Frederick Wallace), 1894-1984",,"University of Iowa. Libraries. University Archives",1935-05-11|2010-09-12,,"Educational use only, no other permissions given. U.S. and international copyright laws may protect this digital object. Commercial use or distribution of the object is not permitted without prior permission of the copyright holder.","Iowa City Town and Campus Scenes|Frederick W. Kent Collection of Photographs, 1866-2000|http://www.lib.uiowa.edu/collguides/?RG30.0001.01|Prints|Organizations|University Elementary School|University Elementary School|Scanned with Ricoh Aficio 3228C @ 600 ppi. Master image saved in TIFF format",,,"Still image|Photographs|jpeg",RG30.0001.01|org20-0075.jpg|https://digital.lib.uiowa.edu/,,,,,,,,,,,,,,,,,,,,,,,,,,,,,,,,,,,,,,,,,,,,,,,,"<a href=""https://digital.lib.uiowa.edu/"" target=""_blank"">View this item in its source respository</a>",,,,,,,,,,,,,,,,,,,,,,,,,,,,,https://www.iowaheritage.org/files/original/ceeca1011e1a360609d26656280e488b.jpg,"Remote Item","Iowa City Town and Campus Scenes",1,0
31081,https://www.iowaheritage.org/items/show/31081,"Fourth grade class, The University of Iowa, May 15, 1930","Universities & colleges|Elementary schools|University of Iowa|United States -- Iowa -- Iowa City|1930-1940|Schools|School children|Costumes|University of Iowa. College of Education","The University Elementary School,established in 1915, was a laboratory or experimental school directed through the College of Education for the training of principals, superintendents and teachers. Along with the University High School, it was closed in 1972 due to lack of funding.","Kent, Frederick W. (Frederick Wallace), 1894-1984",,"University of Iowa. Libraries. University Archives",1930-05-15|2010-09-12,,"Educational use only, no other permissions given. U.S. and international copyright laws may protect this digital object. Commercial use or distribution of the object is not permitted without prior permission of the copyright holder.","Iowa City Town and Campus Scenes|Frederick W. Kent Collection of Photographs, 1866-2000|http://www.lib.uiowa.edu/collguides/?RG30.0001.01|Prints|Organizations|University Elementary School|University Elementary School|Scanned with Ricoh Aficio 3228C @ 600 ppi. Master image saved in TIFF format",5|7,,"Still image|Photographs; Group portraits|jpeg",RG30.0001.01|index.cpd|https://digital.lib.uiowa.edu/,,,,,,,,,,,,,,,,,,,,,,,,,,,,,,,,,,,,,,,,,,,,,,,,"<a href=""https://digital.lib.uiowa.edu/"" target=""_blank"">View this item in its source respository</a>",,,,,,,,,,,,,,,,,,,,,,,,,,,,,https://www.iowaheritage.org/files/original/79dbeb80c7251963147391dbc559ce7c.jpg,"Remote Item","Iowa City Town and Campus Scenes",1,0
