 




﻿"Item Id","Item URI","Dublin Core:Title","Dublin Core:Subject","Dublin Core:Description","Dublin Core:Creator","Dublin Core:Source","Dublin Core:Publisher","Dublin Core:Date","Dublin Core:Contributor","Dublin Core:Rights","Dublin Core:Relation","Dublin Core:Format","Dublin Core:Language","Dublin Core:Type","Dublin Core:Identifier","Dublin Core:Coverage","Item Type Metadata:Text","Item Type Metadata:Interviewer","Item Type Metadata:Interviewee","Item Type Metadata:Location","Item Type Metadata:Transcription","Item Type Metadata:Local URL","Item Type Metadata:Original Format","Item Type Metadata:Physical Dimensions","Item Type Metadata:Duration","Item Type Metadata:Compression","Item Type Metadata:Producer","Item Type Metadata:Director","Item Type Metadata:Bit Rate/Frequency","Item Type Metadata:Time Summary","Item Type Metadata:Email Body","Item Type Metadata:Subject Line","Item Type Metadata:From","Item Type Metadata:To","Item Type Metadata:CC","Item Type Metadata:BCC","Item Type Metadata:Number of Attachments","Item Type Metadata:Standards","Item Type Metadata:Objectives","Item Type Metadata:Materials","Item Type Metadata:Lesson Plan Text","Item Type Metadata:URL","Item Type Metadata:Event Type","Item Type Metadata:Participants","Item Type Metadata:Birth Date","Item Type Metadata:Birthplace","Item Type Metadata:Death Date","Item Type Metadata:Occupation","Item Type Metadata:Biographical Text","Item Type Metadata:Bibliography","Item Type Metadata:Digital Reproduction Information","Item Type Metadata:Repository","Item Type Metadata:Repository Collection","Item Type Metadata:Contact information.","Item Type Metadata:File Name","Item Type Metadata:Notes","Item Type Metadata:Digital item created","Item Type Metadata:Digital item modified","Item Type Metadata:Executive Orders","Item Type Metadata:Record Created","Item Type Metadata:Record Modified","Item Type Metadata:Transcription2","Item Type Metadata:Source URL","Omeka Legacy File:Additional Creator","Omeka Legacy File:Transcriber","Omeka Legacy File:Producer","Omeka Legacy File:Render Device","Omeka Legacy File:Render Details","Omeka Legacy File:Capture Date","Omeka Legacy File:Capture Device","Omeka Legacy File:Capture Details","Omeka Legacy File:Change History","Omeka Legacy File:Watermark","Omeka Legacy File:Encryption","Omeka Legacy File:Compression","Omeka Legacy File:Post Processing","Omeka Image File:Width","Omeka Image File:Height","Omeka Image File:Bit Depth","Omeka Image File:Channels","Omeka Image File:Exif String","Omeka Image File:Exif Array","Omeka Image File:IPTC String","Omeka Image File:IPTC Array","Omeka Video File:Bitrate","Omeka Video File:Duration","Omeka Video File:Sample Rate","Omeka Video File:Codec","Omeka Video File:Width","Omeka Video File:Height",tags,file,itemType,collection,public,featured
17877,https://www.iowaheritage.org/items/show/17877,"Man and boys with goats, Holy City, Bettendorf, Iowa, 1920s","Men|Hispanic Americans|United States -- Iowa -- Bettendorf|1920-1930|Boys|Goats",,unknown,,"University of Iowa. Libraries. Iowa Women's Archives",1920/1929|2007-07-17,,"Educational use only, no other permissions given. U.S. and international copyright laws may protect this item. Commercial use or distribution of this digital object is not permitted without written permission of the Iowa Women's Archives.","Mujeres Latinas Digital Collection|LULAC Council #10 records|LULAC exhibit: Holy City|http://lib.uiowa.edu/collguides/?IWA0733|http://www.lib.uiowa.edu/iwa/Topical_holdings_lists/Latinas.html",jpeg,,"Still image|Photographs",IWA0733|lulac5-2.jpg|162640987|https://digital.lib.uiowa.edu/,,,,,,,,,,,,,,,,,,,,,,,,,,,,,,,,,,,,,,,,,,,,,,,,"<a href=""https://digital.lib.uiowa.edu/"" target=""_blank"">View this item in its source respository</a>",,,,,,,,,,,,,,,,,,,,,,,,,,,,,https://www.iowaheritage.org/files/original/3b73dac56114198d3ef57f4c29083d68.jpg,"Remote Item","Mujeres Latinas Digital Collection",1,0
17866,https://www.iowaheritage.org/items/show/17866,"Man in front of car, Holy City, Bettendorf, Iowa, 1920s","Men|Hispanic Americans|United States -- Iowa -- Bettendorf|1920-1930|Automobiles",,unknown,,"University of Iowa. Libraries. Iowa Women's Archives",1920/1929|2007-07-17,,"Educational use only, no other permissions given. U.S. and international copyright laws may protect this item. Commercial use or distribution of this digital object is not permitted without written permission of the Iowa Women's Archives.","Mujeres Latinas Digital Collection|LULAC Council #10 records|LULAC exhibit: Holy City|http://lib.uiowa.edu/collguides/?IWA0733|http://www.lib.uiowa.edu/iwa/Topical_holdings_lists/Latinas.html",jpeg,,"Still image|Photographs",IWA0733|lulac6-1.jpg|162640987|https://digital.lib.uiowa.edu/,,,,,,,,,,,,,,,,,,,,,,,,,,,,,,,,,,,,,,,,,,,,,,,,"<a href=""https://digital.lib.uiowa.edu/"" target=""_blank"">View this item in its source respository</a>",,,,,,,,,,,,,,,,,,,,,,,,,,,,,https://www.iowaheritage.org/files/original/bcc5b6f3be4f874423ef0fe55731d2d4.jpg,"Remote Item","Mujeres Latinas Digital Collection",1,1
17838,https://www.iowaheritage.org/items/show/17838,"Man in sailor's uniform, Holy City, Bettendorf, Iowa, 1920s","Men|Hispanic Americans|United States -- Iowa -- Bettendorf|1920-1930|Sailors",,unknown,,"University of Iowa. Libraries. Iowa Women's Archives",1920/1929|2007-07-17,,"Educational use only, no other permissions given. U.S. and international copyright laws may protect this item. Commercial use or distribution of this digital object is not permitted without written permission of the Iowa Women's Archives.","Mujeres Latinas Digital Collection|LULAC Council #10 records|LULAC exhibit: Holy City|http://lib.uiowa.edu/collguides/?IWA0733|http://www.lib.uiowa.edu/iwa/Topical_holdings_lists/Latinas.html",jpeg,,"Still image|Photographs",IWA0733|lulac4-4.jpg|162640987|https://digital.lib.uiowa.edu/,,,,,,,,,,,,,,,,,,,,,,,,,,,,,,,,,,,,,,,,,,,,,,,,"<a href=""https://digital.lib.uiowa.edu/"" target=""_blank"">View this item in its source respository</a>",,,,,,,,,,,,,,,,,,,,,,,,,,,,,https://www.iowaheritage.org/files/original/495a2be3e68b72f31ea9e23ee03dd1a3.jpg,"Remote Item","Mujeres Latinas Digital Collection",1,0
17851,https://www.iowaheritage.org/items/show/17851,"Man sitting in chair, Holy City, Bettendorf, Iowa, 1920s","Men|Hispanic Americans|United States -- Iowa -- Bettendorf|1920-1930|Chairs",,unknown,,"University of Iowa. Libraries. Iowa Women's Archives",1920/1929|2007-07-17,,"Educational use only, no other permissions given. U.S. and international copyright laws may protect this item. Commercial use or distribution of this digital object is not permitted without written permission of the Iowa Women's Archives.","Mujeres Latinas Digital Collection|LULAC Council #10 records|LULAC exhibit: Holy City|http://lib.uiowa.edu/collguides/?IWA0733|http://www.lib.uiowa.edu/iwa/Topical_holdings_lists/Latinas.html",jpeg,,"Still image|Photographs",IWA0733|lulac7-5.jpg|162640987|https://digital.lib.uiowa.edu/,,,,,,,,,,,,,,,,,,,,,,,,,,,,,,,,,,,,,,,,,,,,,,,,"<a href=""https://digital.lib.uiowa.edu/"" target=""_blank"">View this item in its source respository</a>",,,,,,,,,,,,,,,,,,,,,,,,,,,,,https://www.iowaheritage.org/files/original/8e4d91759290d54008095be222bb7326.jpg,"Remote Item","Mujeres Latinas Digital Collection",1,0
17832,https://www.iowaheritage.org/items/show/17832,"Man standing beside car, Holy City, Bettendorf, Iowa, 1920s","Men|Hispanic Americans|United States -- Iowa -- Bettendorf|1920-1930|Automobiles",,unknown,,"University of Iowa. Libraries. Iowa Women's Archives",1920/1929|2007-07-17,,"Educational use only, no other permissions given. U.S. and international copyright laws may protect this item. Commercial use or distribution of this digital object is not permitted without written permission of the Iowa Women's Archives.","Mujeres Latinas Digital Collection|LULAC Council #10 records|LULAC exhibit: Holy City|http://lib.uiowa.edu/collguides/?IWA0733|http://www.lib.uiowa.edu/iwa/Topical_holdings_lists/Latinas.html",jpeg,,"Still image|Photographs",IWA0733|lulac4-1.jpg|162640987|https://digital.lib.uiowa.edu/,,,,,,,,,,,,,,,,,,,,,,,,,,,,,,,,,,,,,,,,,,,,,,,,"<a href=""https://digital.lib.uiowa.edu/"" target=""_blank"">View this item in its source respository</a>",,,,,,,,,,,,,,,,,,,,,,,,,,,,,https://www.iowaheritage.org/files/original/f279d4a7dbccdd31ef49c550fa3f1c28.jpg,"Remote Item","Mujeres Latinas Digital Collection",1,0
17813,https://www.iowaheritage.org/items/show/17813,"Maria Mercedes ""Mercy"" Aguilera oral history interview, September 22, 2005","Women|Hispanic Americans|Aguilera, Maria Mercedes, 1936-|United States -- Iowa -- Davenport|2000-2010","Interview excerpt about bringing home water from a nearby water pump.","Aguilera, Maria Mercedes, 1936-",,"University of Iowa. Libraries. Iowa Women's Archives|University of Iowa. Libraries. Iowa Women's Archives",2005-09-22|2006-04-05,"Weaver, Janet","Educational use only, no other permissions given. U.S. and international copyright laws may protect this item. Commercial use or distribution of this digital object is not permitted without written permission of the Iowa Women's Archives.","Mujeres Latinas Digital Collection|Maria Mercedes Aguilera papers, 1950-2004|http://lib.uiowa.edu/collguides/?IWA0558|http://www.lib.uiowa.edu/iwa/Topical_holdings_lists/Latinas.html",mpeg,,"Sound|Oral histories (Ddocument genres); Audiocassettes; Interviews",IWA0558|Getting_Water.mp3|162640987|https://digital.lib.uiowa.edu/,,,,,,,,,,,,,,,,,,,,,,,,,,,,,,,,,,,,,,,,,,,,,,,,"<a href=""https://digital.lib.uiowa.edu/"" target=""_blank"">View this item in its source respository</a>",,,,,,,,,,,,,,,,,,,,,,,,,,,,,https://www.iowaheritage.org/files/original/6ef3e44e5c84fd893fb35780fd7ff499.jpg,"Remote Item","Mujeres Latinas Digital Collection",1,0
17811,https://www.iowaheritage.org/items/show/17811,"Maria Mercedes ""Mercy"" Aguilera, Davenport, Iowa, 1948?","Girls|Hispanic Americans|Aguilera, Maria Mercedes, 1936-|United States -- Iowa -- Davenport|1940-1950","Photograph of Mercy Aguilera on the day of her first communion.",unknown,,"University of Iowa. Libraries. Iowa Women's Archives",1948|2006-04,,"Educational use only, no other permissions given. U.S. and international copyright laws may protect this item. Commercial use or distribution of this digital object is not permitted without written permission of the Iowa Women's Archives.","Mujeres Latinas Digital Collection|Maria Mercedes Aguilera papers, 1950-2004|http://lib.uiowa.edu/collguides/?IWA0558|http://www.lib.uiowa.edu/iwa/Topical_holdings_lists/Latinas.html",jpeg|9|6,,"Still image|Photographs",IWA0558|mujeres_aguilera001.jpg|162640987|https://digital.lib.uiowa.edu/,,,,,,,,,,,,,,,,,,,,,,,,,,,,,,,,,,,,,,,,,,,,,,,,"<a href=""https://digital.lib.uiowa.edu/"" target=""_blank"">View this item in its source respository</a>",,,,,,,,,,,,,,,,,,,,,,,,,,,,,https://www.iowaheritage.org/files/original/9575c59e120d8a74f691a8ab4ef29b81.jpg,"Remote Item","Mujeres Latinas Digital Collection",1,1
17769,https://www.iowaheritage.org/items/show/17769,"Mason City (Iowa) Public Library annual report, 1965","Children|Hispanic Americans|Punke, Alma|Mason City Public Library (Mason City, Iowa)|United States -- Iowa -- Mason City|1960-1970|Librarians|Storytelling|Public libraries","Cover of Mason City (Iowa) Public Library annual report that shows librarian reading to migrant children.","Mason City Public Library (Mason City, Iowa)",,"Mason City Public Library (Mason City, Iowa)|University of Iowa. Libraries. Iowa Women's Archives",1965|2006-02-22,,"Educational use only, no other permissions given. U.S. and international copyright laws may protect this item. Commercial use or distribution of this digital object is not permitted without written permission of the Iowa Women's Archives.","Mujeres Latinas Digital Collection|Shirley M. Sandage papers, 1927-1998|http://www.lib.uiowa.edu/collguides/?IWA0318|http://www.lib.uiowa.edu/iwa/Topical_holdings_lists/Latinas.html",jpeg|20|16,,"Still image; Text|Brochures",IWA0318|mujeres_sandage004.jpg|162640987|https://digital.lib.uiowa.edu/,,,,,,,,,,,,,,,,,,,,,,,,,,,,,,,,,,,,,,,,,,,,,,,,"<a href=""https://digital.lib.uiowa.edu/"" target=""_blank"">View this item in its source respository</a>",,,,,,,,,,,,,,,,,,,,,,,,,,,,,https://www.iowaheritage.org/files/original/0e833c060733e16dfc75c663dd41ef25.jpg,"Remote Item","Mujeres Latinas Digital Collection",1,0
17815,https://www.iowaheritage.org/items/show/17815,"Men and woman posed in front of car, Davenport, Iowa, 1940s?","Men|Hispanic Americans|United States -- Iowa -- Davenport|1940-1950|Women|Automobiles",,unknown,,"University of Iowa. Libraries. Iowa Women's Archives",1940/1949|2007-04-18,,"Educational use only, no other permissions given. U.S. and international copyright laws may protect this item. Commercial use or distribution of this digital object is not permitted without written permission of the Iowa Women's Archives.","Mujeres Latinas Digital Collection|LULAC Council #10 records|http://lib.uiowa.edu/collguides/?IWA0733|http://www.lib.uiowa.edu/iwa/Topical_holdings_lists/Latinas.html",jpeg|9|14,,"Still image|Photocopies; Photographs",IWA0733|162640987|https://digital.lib.uiowa.edu/,,,,,,,,,,,,,,,,,,,,,,,,,,,,,,,,,,,,,,,,,,,,,,,,"<a href=""https://digital.lib.uiowa.edu/"" target=""_blank"">View this item in its source respository</a>",,,,,,,,,,,,,,,,,,,,,,,,,,,,,https://www.iowaheritage.org/files/original/e487157db11508d8f7d4971a1dabdbfa.jpg,"Remote Item","Mujeres Latinas Digital Collection",1,0
17823,https://www.iowaheritage.org/items/show/17823,"Men and woman posed in front of car, Davenport, Iowa, 1940s?","Men|Hispanic Americans|United States -- Iowa -- Davenport|1940-1950|Women|Automobiles",,unknown,,"University of Iowa. Libraries. Iowa Women's Archives",1940/1949|2007-04-18,,"Educational use only, no other permissions given. U.S. and international copyright laws may protect this item. Commercial use or distribution of this digital object is not permitted without written permission of the Iowa Women's Archives.","Mujeres Latinas Digital Collection|LULAC Council #10 records|http://lib.uiowa.edu/collguides/?IWA0733|http://www.lib.uiowa.edu/iwa/Topical_holdings_lists/Latinas.html",jpeg|10|14,,"Still image|Photocopies; Photographs",IWA0733|162640987|https://digital.lib.uiowa.edu/,,,,,,,,,,,,,,,,,,,,,,,,,,,,,,,,,,,,,,,,,,,,,,,,"<a href=""https://digital.lib.uiowa.edu/"" target=""_blank"">View this item in its source respository</a>",,,,,,,,,,,,,,,,,,,,,,,,,,,,,https://www.iowaheritage.org/files/original/c93190ee1cd49b56069f373558b07d35.jpg,"Remote Item","Mujeres Latinas Digital Collection",1,0
