 




﻿"Item Id","Item URI","Dublin Core:Title","Dublin Core:Subject","Dublin Core:Description","Dublin Core:Creator","Dublin Core:Source","Dublin Core:Publisher","Dublin Core:Date","Dublin Core:Contributor","Dublin Core:Rights","Dublin Core:Relation","Dublin Core:Format","Dublin Core:Language","Dublin Core:Type","Dublin Core:Identifier","Dublin Core:Coverage","Item Type Metadata:Text","Item Type Metadata:Interviewer","Item Type Metadata:Interviewee","Item Type Metadata:Location","Item Type Metadata:Transcription","Item Type Metadata:Local URL","Item Type Metadata:Original Format","Item Type Metadata:Physical Dimensions","Item Type Metadata:Duration","Item Type Metadata:Compression","Item Type Metadata:Producer","Item Type Metadata:Director","Item Type Metadata:Bit Rate/Frequency","Item Type Metadata:Time Summary","Item Type Metadata:Email Body","Item Type Metadata:Subject Line","Item Type Metadata:From","Item Type Metadata:To","Item Type Metadata:CC","Item Type Metadata:BCC","Item Type Metadata:Number of Attachments","Item Type Metadata:Standards","Item Type Metadata:Objectives","Item Type Metadata:Materials","Item Type Metadata:Lesson Plan Text","Item Type Metadata:URL","Item Type Metadata:Event Type","Item Type Metadata:Participants","Item Type Metadata:Birth Date","Item Type Metadata:Birthplace","Item Type Metadata:Death Date","Item Type Metadata:Occupation","Item Type Metadata:Biographical Text","Item Type Metadata:Bibliography","Item Type Metadata:Digital Reproduction Information","Item Type Metadata:Repository","Item Type Metadata:Repository Collection","Item Type Metadata:Contact information.","Item Type Metadata:File Name","Item Type Metadata:Notes","Item Type Metadata:Digital item created","Item Type Metadata:Digital item modified","Item Type Metadata:Executive Orders","Item Type Metadata:Record Created","Item Type Metadata:Record Modified","Item Type Metadata:Transcription2","Item Type Metadata:Source URL","Omeka Legacy File:Additional Creator","Omeka Legacy File:Transcriber","Omeka Legacy File:Producer","Omeka Legacy File:Render Device","Omeka Legacy File:Render Details","Omeka Legacy File:Capture Date","Omeka Legacy File:Capture Device","Omeka Legacy File:Capture Details","Omeka Legacy File:Change History","Omeka Legacy File:Watermark","Omeka Legacy File:Encryption","Omeka Legacy File:Compression","Omeka Legacy File:Post Processing","Omeka Image File:Width","Omeka Image File:Height","Omeka Image File:Bit Depth","Omeka Image File:Channels","Omeka Image File:Exif String","Omeka Image File:Exif Array","Omeka Image File:IPTC String","Omeka Image File:IPTC Array","Omeka Video File:Bitrate","Omeka Video File:Duration","Omeka Video File:Sample Rate","Omeka Video File:Codec","Omeka Video File:Width","Omeka Video File:Height",tags,file,itemType,collection,public,featured
64490,https://www.iowaheritage.org/items/show/64490,"This wouldn't have anything to do with the fact that grades are coming out soon, would it?","Issues|United States|Classrooms|1990-2000|Education|Education and state|Reform|Voters|Politicians|Politics|Political promises|Teachers|Students|Children|Desks|Apples|Signs|Blackboards","Voters; Politicians; School reform","Duffy, Brian, 1955-",,"University of Iowa. Libraries. Special Collections Dept.",1997-09-16|2011-04,,"Educational use only, no other permissions given. Copyright to this digital object is owned by The Des Moines Register; it may not be downloaded, reproduced, or distributed without written permission. For more information, contact the Special Collections Department.","Editorial Cartoons of Brian Duffy; Des Moines Register Cartoonists|Papers of Brian Duffy|Des Moines Register",,English,"Still image|Editorial cartoons",MSC916|duffy-970916|http://digital.lib.uiowa.edu/cdm/ref/collection/duffy/id/328,,,,,,,,,,,,,,,,,,,,,,,,,,,,,,,,,,,,,,,,,,,,,,,,"<a href=""http://digital.lib.uiowa.edu/cdm/ref/collection/duffy/id/328"" target=""_blank"">View this item in its source respository</a>",,,,,,,,,,,,,,,,,,,,,,,,,,,,,https://www.iowaheritage.org/files/original/07758b6ca10a3993dcb10b274c47ea21.jpg,"Remote Item","Editorial Cartoons of Brian Duffy",1,0
64246,https://www.iowaheritage.org/items/show/64246,"Room and board rates to climb at state universities","College|Iowa|Fathers|2000-2010|College students|Universities and colleges|Daughters|Students|Newspapers|Breakfast tables","It says the university dorm rooms are ""loftable""; Are they referring to the beds, or the cost of living there?; Housing admissions","Duffy, Brian, 1955-",,"University of Iowa. Libraries. Special Collections Dept.",2003-03-09|2011-04,,"Educational use only, no other permissions given. Copyright to this digital object is owned by The Des Moines Register; it may not be downloaded, reproduced, or distributed without written permission. For more information, contact the Special Collections Department.","Editorial Cartoons of Brian Duffy; Des Moines Register Cartoonists|Papers of Brian Duffy|Des Moines Register",,English,"Still image|Editorial cartoons",MSC916|duffy-030309|http://digital.lib.uiowa.edu/cdm/ref/collection/duffy/id/84,,,,,,,,,,,,,,,,,,,,,,,,,,,,,,,,,,,,,,,,,,,,,,,,"<a href=""http://digital.lib.uiowa.edu/cdm/ref/collection/duffy/id/84"" target=""_blank"">View this item in its source respository</a>",,,,,,,,,,,,,,,,,,,,,,,,,,,,,https://www.iowaheritage.org/files/original/f2f206134a078df844e4cc4959d0d31c.jpg,"Remote Item","Editorial Cartoons of Brian Duffy",1,0
64232,https://www.iowaheritage.org/items/show/64232,"I know I speak for the entire student body when I say, we'd be willing to accept layoffs","School|Students|2000-2010|School children|School boards|Education|Education and state|Budgets|Dismissal of employees|Children|School children|Schoolrooms|Teachers|Blackboards","School officials","Duffy, Brian, 1955-",,"University of Iowa. Libraries. Special Collections Dept.",2001-10-18|2011-04,,"Educational use only, no other permissions given. Copyright to this digital object is owned by The Des Moines Register; it may not be downloaded, reproduced, or distributed without written permission. For more information, contact the Special Collections Department.","Editorial Cartoons of Brian Duffy; Des Moines Register Cartoonists|Papers of Brian Duffy|Des Moines Register",,English,"Still image|Editorial cartoons",MSC916|duffy-011018|http://digital.lib.uiowa.edu/cdm/ref/collection/duffy/id/70,,,,,,,,,,,,,,,,,,,,,,,,,,,,,,,,,,,,,,,,,,,,,,,,"<a href=""http://digital.lib.uiowa.edu/cdm/ref/collection/duffy/id/70"" target=""_blank"">View this item in its source respository</a>",,,,,,,,,,,,,,,,,,,,,,,,,,,,,https://www.iowaheritage.org/files/original/0c678c96a24711633e4cf1f18a92642c.jpg,"Remote Item","Editorial Cartoons of Brian Duffy",1,0
64207,https://www.iowaheritage.org/items/show/64207,"This hill seems to get steeper all the time","Universities & colleges|Iowa|Students|2000-2010|State governments|States|Budgets|Education and state|Education|Universities & colleges|Books|Bags|Hills|Sweating|Tongues","State colleges; Budget cuts; Tuition increases","Duffy, Brian, 1955-",,"University of Iowa. Libraries. Special Collections Dept.",2001-09-30|2011-04,,"Educational use only, no other permissions given. Copyright to this digital object is owned by The Des Moines Register; it may not be downloaded, reproduced, or distributed without written permission. For more information, contact the Special Collections Department.","Editorial Cartoons of Brian Duffy; Des Moines Register Cartoonists|Papers of Brian Duffy|Des Moines Register",,English,"Still image|Editorial cartoons",MSC916|duffy-010930|http://digital.lib.uiowa.edu/cdm/ref/collection/duffy/id/45,,,,,,,,,,,,,,,,,,,,,,,,,,,,,,,,,,,,,,,,,,,,,,,,"<a href=""http://digital.lib.uiowa.edu/cdm/ref/collection/duffy/id/45"" target=""_blank"">View this item in its source respository</a>",,,,,,,,,,,,,,,,,,,,,,,,,,,,,https://www.iowaheritage.org/files/original/b1bbe4a09f3168eeb5cb2cd2b3fb0da1.jpg,"Remote Item","Editorial Cartoons of Brian Duffy",1,0
64192,https://www.iowaheritage.org/items/show/64192,"Higher education","Universities & colleges|United States|Men|2000-2010|Education|Education and state|Expenses|Students|Diplomas|Books|Pencils","I.O.U.; ... and higher, and higher ...; Tuition","Duffy, Brian, 1955-",,"University of Iowa. Libraries. Special Collections Dept.",2001-09-06|2011-04,,"Educational use only, no other permissions given. Copyright to this digital object is owned by The Des Moines Register; it may not be downloaded, reproduced, or distributed without written permission. For more information, contact the Special Collections Department.","Editorial Cartoons of Brian Duffy; Des Moines Register Cartoonists|Papers of Brian Duffy|Des Moines Register",,English,"Still image|Editorial cartoons",MSC916|duffy-010906|http://digital.lib.uiowa.edu/cdm/ref/collection/duffy/id/30,,,,,,,,,,,,,,,,,,,,,,,,,,,,,,,,,,,,,,,,,,,,,,,,"<a href=""http://digital.lib.uiowa.edu/cdm/ref/collection/duffy/id/30"" target=""_blank"">View this item in its source respository</a>",,,,,,,,,,,,,,,,,,,,,,,,,,,,,https://www.iowaheritage.org/files/original/45f3fa7c3aff987d7568ee24cb9da2c9.jpg,"Remote Item","Editorial Cartoons of Brian Duffy",1,0
52116,https://www.iowaheritage.org/items/show/52116,"Mildred Wirt Benson memory book, 1922-1928","Students|Wirt, Mildred A. (Mildred Augustine), 1905-2002|University of Iowa|United States -- Iowa -- Ladora|1920-1930|Universities & colleges|Student organizations|Women|United States -- Iowa -- Iowa City|United States -- Ohio -- Cleveland",,"Wirt, Mildred A. (Mildred Augustine), 1905-2002",,"University of Iowa. Libraries. Iowa Women's Archives",1922-1928|2007-05-30,,"Educational use only, no other permissions given. U.S. and international copyright laws may protect this digital object. Commercial use or distribution of the object is not permitted without prior permission of the copyright holder.","Mildred Wirt Benson Collection; Iowa Women's Scrapbooks Digital Collection|Mildred Augustine Wirt Benson Papers, 1915-2002|http://lib.uiowa.edu/collguides/?IWA0054",jpeg,,"Still image; Text|Scrapbooks; Clippings; Programs; Dance cards; Place cards; Announcements",IWA0054|mwbscrap|169948831|http://digital.lib.uiowa.edu/cdm/ref/collection/mwb/id/2587,,,,,,,,,,,,,,,,,,,,,,,,,,,,,,,,,,,,,,,,,,,,,,,,"<a href=""http://digital.lib.uiowa.edu/cdm/ref/collection/mwb/id/2587"" target=""_blank"">View this item in its source respository</a>",,,,,,,,,,,,,,,,,,,,,,,,,,,,,https://www.iowaheritage.org/files/original/a8d3354963cb71cd08638b9c89a6856b.jpg,"Remote Item","Mildred Wirt Benson Collection",1,0
52033,https://www.iowaheritage.org/items/show/52033,"Hawkeye 1924 [excerpt]","Universities & colleges|Wirt, Mildred A. (Mildred Augustine), 1905-2002|University of Iowa|United States -- Iowa -- Iowa City|1920-1930|Students|Women|Men|Student organizations",,,,"Student Publications, Inc.|University of Iowa. Libraries. University Archives",1924|2007-05-14,,"Educational use only, no other permissions given. U.S. and international copyright laws may protect this digital object. Commercial use or distribution of the object is not permitted without prior permission of the copyright holder.","Mildred Wirt Benson Collection|Mildred Augustine Wirt Benson Papers, 1915-2002 |http://lib.uiowa.edu/collguides/?IWA0054",jpeg,,"Text; Still image|Yearbooks",IWA0054|mwbyb1924jpg|169948831|http://digital.lib.uiowa.edu/cdm/ref/collection/mwb/id/1182,,,,,,,,,,,,,,,,,,,,,,,,,,,,,,,,,,,,,,,,,,,,,,,,"<a href=""http://digital.lib.uiowa.edu/cdm/ref/collection/mwb/id/1182"" target=""_blank"">View this item in its source respository</a>",,,,,,,,,,,,,,,,,,,,,,,,,,,,,https://www.iowaheritage.org/files/original/a2c6c1fa0ba20279d5b806b1130c0b22.jpg,"Remote Item","Mildred Wirt Benson Collection",1,0
52032,https://www.iowaheritage.org/items/show/52032,"Hawkeye 1926 [excerpt]","Universities & colleges|Wirt, Mildred A. (Mildred Augustine), 1905-2002|University of Iowa|United States -- Iowa -- Iowa City|1920-1930|Students|Women|Men|Student organizations",,,,"Student Publications, Inc.|University of Iowa. Libraries. University Archives",1926|2007-05-14,,"Educational use only, no other permissions given. U.S. and international copyright laws may protect this digital object. Commercial use or distribution of the object is not permitted without prior permission of the copyright holder.","Mildred Wirt Benson Collection|Mildred Augustine Wirt Benson Papers, 1915-2002 |http://lib.uiowa.edu/collguides/?IWA0054",jpeg,,"Text; Still image|Yearbooks",IWA0054|mwbyb1926jpg|169948831|http://digital.lib.uiowa.edu/cdm/ref/collection/mwb/id/1173,,,,,,,,,,,,,,,,,,,,,,,,,,,,,,,,,,,,,,,,,,,,,,,,"<a href=""http://digital.lib.uiowa.edu/cdm/ref/collection/mwb/id/1173"" target=""_blank"">View this item in its source respository</a>",,,,,,,,,,,,,,,,,,,,,,,,,,,,,https://www.iowaheritage.org/files/original/8771433eaffb5f97434130d9216e67fe.jpg,"Remote Item","Mildred Wirt Benson Collection",1,0
52031,https://www.iowaheritage.org/items/show/52031,"Hawkeye 1925 [excerpt]","Universities & colleges|Wirt, Mildred A. (Mildred Augustine), 1905-2002|University of Iowa|United States -- Iowa -- Iowa City|1920-1930|Students|Women|Men|Student organizations",,,,"Student Publications, Inc.|University of Iowa. Libraries. University Archives",1925|2007-05-14,,"Educational use only, no other permissions given. U.S. and international copyright laws may protect this digital object. Commercial use or distribution of the object is not permitted without prior permission of the copyright holder.","Mildred Wirt Benson Collection|Mildred Augustine Wirt Benson Papers, 1915-2002 |http://lib.uiowa.edu/collguides/?IWA0054",jpeg,,"Text; Still image|Yearbooks",IWA0054|mwbyb1925jpg|169948831|http://digital.lib.uiowa.edu/cdm/ref/collection/mwb/id/1093,,,,,,,,,,,,,,,,,,,,,,,,,,,,,,,,,,,,,,,,,,,,,,,,"<a href=""http://digital.lib.uiowa.edu/cdm/ref/collection/mwb/id/1093"" target=""_blank"">View this item in its source respository</a>",,,,,,,,,,,,,,,,,,,,,,,,,,,,,https://www.iowaheritage.org/files/original/624d354bdf2e86b9c8e5f4279837ec66.jpg,"Remote Item","Mildred Wirt Benson Collection",1,0
50086,https://www.iowaheritage.org/items/show/50086,"Amana Band","Post-1932 activities|Education|United States -- Iowa -- Iowa County -- Amana|Agriculture and Rural Life|School activities|High schools|Public schools|School children|Student activities|Students","Amana High School band and cheerleaders outside the school.",unknown,,,"-19|1984;  1985;  1986;  1987;  1988;  1989;  1990;  1991;  1992;  1993;  1994","Amana Heritage Society","U.S. and international copyright laws protect this digital image. Commercial use or distribution of the image is not permitted without prior permission of the copyright holder. For permission to use the digital image, please contact the Amana Heritage Society",,"1 photograph : col.",,,,,,,,,,,,,,,,,,,,,,,,,,,,,,,,,,,,,,,"image/jpeg|bytes|Scanned with HP Scanjet 3400C at 300 ppi. Archival master image available in tiff format.","Amana Heritage Society Post-1932 Exhibit",,"Please contact the Amana Heritage Society: (319) 622-3567; amherit@juno.com ; http://www.amanaheritage.org/","Amana Band at HS.jpg",,2/19/2006,,,,,,,,,,,,,,,,,,,,,,,,,,,,,,,,,,,https://www.iowaheritage.org/files/original/aefa6ea1101b68fc8b711da67a4745f4.jpg,"Still Image","Amana Heritage Society Collection",1,0
