 




﻿"Item Id","Item URI","Dublin Core:Title","Dublin Core:Subject","Dublin Core:Description","Dublin Core:Creator","Dublin Core:Source","Dublin Core:Publisher","Dublin Core:Date","Dublin Core:Contributor","Dublin Core:Rights","Dublin Core:Relation","Dublin Core:Format","Dublin Core:Language","Dublin Core:Type","Dublin Core:Identifier","Dublin Core:Coverage","Item Type Metadata:Text","Item Type Metadata:Interviewer","Item Type Metadata:Interviewee","Item Type Metadata:Location","Item Type Metadata:Transcription","Item Type Metadata:Local URL","Item Type Metadata:Original Format","Item Type Metadata:Physical Dimensions","Item Type Metadata:Duration","Item Type Metadata:Compression","Item Type Metadata:Producer","Item Type Metadata:Director","Item Type Metadata:Bit Rate/Frequency","Item Type Metadata:Time Summary","Item Type Metadata:Email Body","Item Type Metadata:Subject Line","Item Type Metadata:From","Item Type Metadata:To","Item Type Metadata:CC","Item Type Metadata:BCC","Item Type Metadata:Number of Attachments","Item Type Metadata:Standards","Item Type Metadata:Objectives","Item Type Metadata:Materials","Item Type Metadata:Lesson Plan Text","Item Type Metadata:URL","Item Type Metadata:Event Type","Item Type Metadata:Participants","Item Type Metadata:Birth Date","Item Type Metadata:Birthplace","Item Type Metadata:Death Date","Item Type Metadata:Occupation","Item Type Metadata:Biographical Text","Item Type Metadata:Bibliography","Item Type Metadata:Digital Reproduction Information","Item Type Metadata:Repository","Item Type Metadata:Repository Collection","Item Type Metadata:Contact information.","Item Type Metadata:File Name","Item Type Metadata:Notes","Item Type Metadata:Digital item created","Item Type Metadata:Digital item modified","Item Type Metadata:Executive Orders","Item Type Metadata:Record Created","Item Type Metadata:Record Modified","Item Type Metadata:Transcription2","Item Type Metadata:Source URL","Omeka Legacy File:Additional Creator","Omeka Legacy File:Transcriber","Omeka Legacy File:Producer","Omeka Legacy File:Render Device","Omeka Legacy File:Render Details","Omeka Legacy File:Capture Date","Omeka Legacy File:Capture Device","Omeka Legacy File:Capture Details","Omeka Legacy File:Change History","Omeka Legacy File:Watermark","Omeka Legacy File:Encryption","Omeka Legacy File:Compression","Omeka Legacy File:Post Processing","Omeka Image File:Width","Omeka Image File:Height","Omeka Image File:Bit Depth","Omeka Image File:Channels","Omeka Image File:Exif String","Omeka Image File:Exif Array","Omeka Image File:IPTC String","Omeka Image File:IPTC Array","Omeka Video File:Bitrate","Omeka Video File:Duration","Omeka Video File:Sample Rate","Omeka Video File:Codec","Omeka Video File:Width","Omeka Video File:Height",tags,file,itemType,collection,public,featured
27574,http://www.iowaheritage.org/items/show/27574,"Spars take over war show Friday|Times (Davenport, Iowa)|Women's military activity","United States. Coast Guard Reserve. Women’s Reserve|United States -- Iowa -- Scott County -- Davenport|World War II|World War, 1939-1945 -- Participation, Female|Women soldiers -- Iowa","Image of SPAR band accompanies this article.",,,"State Historical Society of Iowa, Iowa City",1944-04-13,,"This digital image may be used for educational purposes, as long as it is not altered in any way.  No commercial reproduction or distribution of this file is permitted without written permission of the State Historical Society of Iowa","World War II Iowa Press Clippings","image/jpeg|1 clipping : b&w ; 21 x 10 cm",eng,"Still images; Clippings; Text",1944-04-13-06.jpg|https://digital.lib.uiowa.edu/,,,,,,,,,,,,,,,,,,,,,,,,,,,,,,,,,,,,,,,,,,,,,,,,"<a href=""https://digital.lib.uiowa.edu/"" target=""_blank"">View this item in its source respository</a>",,,,,,,,,,,,,,,,,,,,,,,,,,,,,http://www.iowaheritage.org/files/original/7e96a2b17590619dcb9dade9e576765e.jpg,"Remote Item","World War II Iowa Press Clippings",1,0
27548,http://www.iowaheritage.org/items/show/27548,"Recruiting personnel|Evening Tribune (Des Moines, Iowa)|Women's military activity","United States. Coast Guard Reserve. Women’s Reserve|United States -- Iowa -- Polk County -- Des Moines|World War II|World War, 1939-1945 -- Participation, Female|Women soldiers -- Iowa","Image of two WACs in store window with dummy accompanies article.",,,"State Historical Society of Iowa, Iowa City",1944-04-11,,"This digital image may be used for educational purposes, as long as it is not altered in any way.  No commercial reproduction or distribution of this file is permitted without written permission of the State Historical Society of Iowa","World War II Iowa Press Clippings","image/jpeg|1 clipping : b&w ; 10 x 10 cm",eng,"Clippings; Still Image; Text",1944-04-11-04.jpg|https://digital.lib.uiowa.edu/,,,,,,,,,,,,,,,,,,,,,,,,,,,,,,,,,,,,,,,,,,,,,,,,"<a href=""https://digital.lib.uiowa.edu/"" target=""_blank"">View this item in its source respository</a>",,,,,,,,,,,,,,,,,,,,,,,,,,,,,http://www.iowaheritage.org/files/original/2843418927de707246c1f796f1f76011.jpg,"Remote Item","World War II Iowa Press Clippings",1,0
27537,http://www.iowaheritage.org/items/show/27537,"Seek women for SPARs|Evening Tribune (Des Moines, Iowa)|Women's military activity","United States. Coast Guard Reserve. Women’s Reserve|United States -- Iowa -- Polk County -- Des Moines|World War II|World War, 1939-1945 -- Participation, Female|Women soldiers -- Iowa",,,,"State Historical Society of Iowa, Iowa City",1944-04-10,,"This digital image may be used for educational purposes, as long as it is not altered in any way.  No commercial reproduction or distribution of this file is permitted without written permission of the State Historical Society of Iowa","World War II Iowa Press Clippings","image/jpeg|1 clipping : b&w ;  20 x 5 cm",eng,"Clippings; Text",1944-04-10-03.jpg|https://digital.lib.uiowa.edu/,,,,,,,,,,,,,,,,,,,,,,,,,,,,,,,,,,,,,,,,,,,,,,,,"<a href=""https://digital.lib.uiowa.edu/"" target=""_blank"">View this item in its source respository</a>",,,,,,,,,,,,,,,,,,,,,,,,,,,,,http://www.iowaheritage.org/files/original/f0509f83a1387ce8adbc65dc1eb6fd10.jpg,"Remote Item","World War II Iowa Press Clippings",1,0
27469,http://www.iowaheritage.org/items/show/27469,"SPAR recruiter at Pearl Harbor|Ensign Ayer present at Japanese attack|Nonpareil (Council Bluffs, Iowa)|Women's military activity","United States. Coast Guard Reserve. Women’s Reserve|United States|World War II|World War, 1939-1945 -- Participation, Female|Women soldiers","Image of SPAR recruiter Ensign Elizabeth Ayer accompanies article.",,,"State Historical Society of Iowa, Iowa City","1944-03-27|1941;  1942;  1943;  1944;  1945;  1946;  1947;  1948;  1949;  1950|2007-11-08",,"This digital image may be used for educational purposes, as long as it is not altered in any way. No commercial reproduction or distribution of this file is permitted without written permission of the State Historical Society of Iowa.","World War II Iowa Press Clippings","image/jpeg|1 clipping : b&w ; 23 x 5 cm.",eng,"Text; Clippings; Still Image",1944-03-27-03.jpg|173848404|https://digital.lib.uiowa.edu/,,,,,,,,,,,,,,,,,,,,,,,,,,,,,,,,,,,,,,,,,,,,,,,,"<a href=""https://digital.lib.uiowa.edu/"" target=""_blank"">View this item in its source respository</a>",,,,,,,,,,,,,,,,,,,,,,,,,,,,,http://www.iowaheritage.org/files/original/63f98aed49bdc21ecd58992b9a96ae33.jpg,"Remote Item","World War II Iowa Press Clippings",1,0
27417,http://www.iowaheritage.org/items/show/27417,"Girls learn about SPARS|Morning Register (Des Moines, Iowa)|Women's military activity","United States. Coast Guard Reserve. Women’s Reserve|United States -- Iowa -- Polk County -- Des Moines|World War II|World War, 1939-1945 -- Participation, Female|Women soldiers -- Iowa","Image of WAC and two Des Moines girls accompanies article.",,,"State Historical Society of Iowa, Iowa City","1944-03-15|1941;  1942;  1943;  1944;  1945;  1946;  1947;  1948;  1949;  1950|2007-11-08",,"This digital image may be used for educational purposes, as long as it is not altered in any way. No commercial reproduction or distribution of this file is permitted without written permission of the State Historical Society of Iowa.","World War II Iowa Press Clippings","image/jpeg|1 clipping : b&w ; 13 x 9 cm.",eng,"Text; Clippings; Still Image",1944-03-15-02.jpg|173848404|https://digital.lib.uiowa.edu/,,,,,,,,,,,,,,,,,,,,,,,,,,,,,,,,,,,,,,,,,,,,,,,,"<a href=""https://digital.lib.uiowa.edu/"" target=""_blank"">View this item in its source respository</a>",,,,,,,,,,,,,,,,,,,,,,,,,,,,,http://www.iowaheritage.org/files/original/e4764fe33c4e1aac0a1325c97af5fc78.jpg,"Remote Item","World War II Iowa Press Clippings",1,0
27404,http://www.iowaheritage.org/items/show/27404,"Two SPAR recruiters spending two days in this city|Times Republican (Marshalltown, Iowa)|Women's military activity","United States. Coast Guard Reserve. Women’s Reserve|United States -- Iowa -- Marshall County -- Marshalltown|World War II|World War, 1939-1945 -- Participation, Female|Women soldiers -- Iowa","Image of Ensign Ayer accompanies article.",,,"State Historical Society of Iowa, Iowa City","1944-03-14|1941;  1942;  1943;  1944;  1945;  1946;  1947;  1948;  1949;  1950|2007-11-08",,"This digital image may be used for educational purposes, as long as it is not altered in any way. No commercial reproduction or distribution of this file is permitted without written permission of the State Historical Society of Iowa.","World War II Iowa Press Clippings","image/jpeg|1 clipping : b&w ; 22 x 5 cm.",eng,"Text; Still Image; Clippings",1944-03-14-01.jpg|173848404|https://digital.lib.uiowa.edu/,,,,,,,,,,,,,,,,,,,,,,,,,,,,,,,,,,,,,,,,,,,,,,,,"<a href=""https://digital.lib.uiowa.edu/"" target=""_blank"">View this item in its source respository</a>",,,,,,,,,,,,,,,,,,,,,,,,,,,,,http://www.iowaheritage.org/files/original/95abfa17a2f8861aeb85dbce7e5dc8d9.jpg,"Remote Item","World War II Iowa Press Clippings",1,0
27393,http://www.iowaheritage.org/items/show/27393,"Seek women here for Coast Guard|Morning Register (Des Moines, Iowa)|Women's military activity","United States. Coast Guard Reserve. Women’s Reserve|United States -- Iowa -- Polk County -- Des Moines|World War II|World War, 1939-1945 -- Participation, Female|Women soldiers -- Iowa",,,,"State Historical Society of Iowa, Iowa City","1944-03-12|1941;  1942;  1943;  1944;  1945;  1946;  1947;  1948;  1949;  1950|2007-11-08",,"This digital image may be used for educational purposes, as long as it is not altered in any way. No commercial reproduction or distribution of this file is permitted without written permission of the State Historical Society of Iowa.","World War II Iowa Press Clippings","image/jpeg|1 clipping : b&w ; 6 x 5 cm.",eng,"Text; Clippings",1944-03-12-02.jpg|173848404|https://digital.lib.uiowa.edu/,,,,,,,,,,,,,,,,,,,,,,,,,,,,,,,,,,,,,,,,,,,,,,,,"<a href=""https://digital.lib.uiowa.edu/"" target=""_blank"">View this item in its source respository</a>",,,,,,,,,,,,,,,,,,,,,,,,,,,,,http://www.iowaheritage.org/files/original/c917278608433f7dee2eaa1ff0090666.jpg,"Remote Item","World War II Iowa Press Clippings",1,0
27372,http://www.iowaheritage.org/items/show/27372,"SPARS to visit here|New-Republican (Boone, Iowa)|Women's military activity","United States. Coast Guard Reserve. Women’s Reserve|United States -- Iowa -- Boone County -- Boone|World War II|World War, 1939-1945 -- Participation, Female|Women soldiers -- Iowa",,,,"State Historical Society of Iowa, Iowa City","1944-03-03|1941;  1942;  1943;  1944;  1945;  1946;  1947;  1948;  1949;  1950|2007-11-08",,"This digital image may be used for educational purposes, as long as it is not altered in any way. No commercial reproduction or distribution of this file is permitted without written permission of the State Historical Society of Iowa.","World War II Iowa Press Clippings","image/jpeg|1 clipping : b&w ; 7 x 6 cm.",eng,"Text; Clippings",1944-03-03-03.jpg|173848404|https://digital.lib.uiowa.edu/,,,,,,,,,,,,,,,,,,,,,,,,,,,,,,,,,,,,,,,,,,,,,,,,"<a href=""https://digital.lib.uiowa.edu/"" target=""_blank"">View this item in its source respository</a>",,,,,,,,,,,,,,,,,,,,,,,,,,,,,http://www.iowaheritage.org/files/original/a6c1a5ad1b376d7e168cfb772bd608ae.jpg,"Remote Item","World War II Iowa Press Clippings",1,0
27328,http://www.iowaheritage.org/items/show/27328,"SPARS to open temporary recruiting office here|Press Citizen (Iowa City, Iowa)|Women's military activity","United States. Coast Guard Reserve. Women’s Reserve|United States -- Iowa -- Johnson County -- Iowa City|World War II|World War, 1939-1945 -- Participation, Female|Women soldiers -- Iowa","Image of Lieut. Betty Bauer accompanies article.",,,"State Historical Society of Iowa, Iowa City","1944-02-18|1941;  1942;  1943;  1944;  1945;  1946;  1947;  1948;  1949;  1950|2007-11-08",,"This digital image may be used for educational purposes, as long as it is not altered in any way. No commercial reproduction or distribution of this file is permitted without written permission of the State Historical Society of Iowa.","World War II Iowa Press Clippings","image/jpeg|1 clipping : b&w ; 15 x 11 cm.",eng,"Text; Still Image; Clippings",1944-02-18-03.jpg|173848404|https://digital.lib.uiowa.edu/,,,,,,,,,,,,,,,,,,,,,,,,,,,,,,,,,,,,,,,,,,,,,,,,"<a href=""https://digital.lib.uiowa.edu/"" target=""_blank"">View this item in its source respository</a>",,,,,,,,,,,,,,,,,,,,,,,,,,,,,http://www.iowaheritage.org/files/original/5357d3da9c54668a69a7aeced138aeea.jpg,"Remote Item","World War II Iowa Press Clippings",1,0
27312,http://www.iowaheritage.org/items/show/27312,"They're looking for SPARS|Morning Register (Des Moines, Iowa)|Women's military activity","United States. Coast Guard Reserve. Women’s Reserve|United States -- Iowa -- Polk County -- Des Moines|World War II|World War, 1939-1945 -- Participation, Female|Women soldiers -- Iowa","Image of two spars accompanies article.",,,"State Historical Society of Iowa, Iowa City","1944-02-16|1941;  1942;  1943;  1944;  1945;  1946;  1947;  1948;  1949;  1950|2007-11-08",,"This digital image may be used for educational purposes, as long as it is not altered in any way. No commercial reproduction or distribution of this file is permitted without written permission of the State Historical Society of Iowa.","World War II Iowa Press Clippings","image/jpeg|1 clipping : b&w ; 12 x 10 cm.",eng,"Text; Still Image; Clippings",1944-02-16-01.jpg|173848404|https://digital.lib.uiowa.edu/,,,,,,,,,,,,,,,,,,,,,,,,,,,,,,,,,,,,,,,,,,,,,,,,"<a href=""https://digital.lib.uiowa.edu/"" target=""_blank"">View this item in its source respository</a>",,,,,,,,,,,,,,,,,,,,,,,,,,,,,http://www.iowaheritage.org/files/original/96779c87dd416ea132ba83c74e462156.jpg,"Remote Item","World War II Iowa Press Clippings",1,0
