 




﻿"Item Id","Item URI","Dublin Core:Title","Dublin Core:Subject","Dublin Core:Description","Dublin Core:Creator","Dublin Core:Source","Dublin Core:Publisher","Dublin Core:Date","Dublin Core:Contributor","Dublin Core:Rights","Dublin Core:Relation","Dublin Core:Format","Dublin Core:Language","Dublin Core:Type","Dublin Core:Identifier","Dublin Core:Coverage","Item Type Metadata:Text","Item Type Metadata:Interviewer","Item Type Metadata:Interviewee","Item Type Metadata:Location","Item Type Metadata:Transcription","Item Type Metadata:Local URL","Item Type Metadata:Original Format","Item Type Metadata:Physical Dimensions","Item Type Metadata:Duration","Item Type Metadata:Compression","Item Type Metadata:Producer","Item Type Metadata:Director","Item Type Metadata:Bit Rate/Frequency","Item Type Metadata:Time Summary","Item Type Metadata:Email Body","Item Type Metadata:Subject Line","Item Type Metadata:From","Item Type Metadata:To","Item Type Metadata:CC","Item Type Metadata:BCC","Item Type Metadata:Number of Attachments","Item Type Metadata:Standards","Item Type Metadata:Objectives","Item Type Metadata:Materials","Item Type Metadata:Lesson Plan Text","Item Type Metadata:URL","Item Type Metadata:Event Type","Item Type Metadata:Participants","Item Type Metadata:Birth Date","Item Type Metadata:Birthplace","Item Type Metadata:Death Date","Item Type Metadata:Occupation","Item Type Metadata:Biographical Text","Item Type Metadata:Bibliography","Item Type Metadata:Digital Reproduction Information","Item Type Metadata:Repository","Item Type Metadata:Repository Collection","Item Type Metadata:Contact information.","Item Type Metadata:File Name","Item Type Metadata:Notes","Item Type Metadata:Digital item created","Item Type Metadata:Digital item modified","Item Type Metadata:Executive Orders","Item Type Metadata:Record Created","Item Type Metadata:Record Modified","Item Type Metadata:Transcription2","Item Type Metadata:Source URL","Omeka Legacy File:Additional Creator","Omeka Legacy File:Transcriber","Omeka Legacy File:Producer","Omeka Legacy File:Render Device","Omeka Legacy File:Render Details","Omeka Legacy File:Capture Date","Omeka Legacy File:Capture Device","Omeka Legacy File:Capture Details","Omeka Legacy File:Change History","Omeka Legacy File:Watermark","Omeka Legacy File:Encryption","Omeka Legacy File:Compression","Omeka Legacy File:Post Processing","Omeka Image File:Width","Omeka Image File:Height","Omeka Image File:Bit Depth","Omeka Image File:Channels","Omeka Image File:Exif String","Omeka Image File:Exif Array","Omeka Image File:IPTC String","Omeka Image File:IPTC Array","Omeka Video File:Bitrate","Omeka Video File:Duration","Omeka Video File:Sample Rate","Omeka Video File:Codec","Omeka Video File:Width","Omeka Video File:Height",tags,file,itemType,collection,public,featured
30907,https://www.iowaheritage.org/items/show/30907,"Scottish Highlanders drummer, The University of Iowa, 1970s","Universities & colleges|Tartans|University of Iowa|United States -- Iowa -- Iowa City|1970-1980|Bands|Kilts|Drums|Drummers (Musicians)|University of Iowa. Scottish Highlanders","Dating back to 1936, the Scottish Highlanders was a student group dedicated to practicing and performing the Scottish arts of piping, drumming and dancing.","Kent, Frederick W. (Frederick Wallace), 1894-1984",,"University of Iowa. Libraries. University Archives",1970/1979|2010-09-12,,"Educational use only, no other permissions given. U.S. and international copyright laws may protect this digital object. Commercial use or distribution of the object is not permitted without prior permission of the copyright holder.","Iowa City Town and Campus Scenes|Frederick W. Kent Collection of Photographs, 1866-2000|http://www.lib.uiowa.edu/collguides/?RG30.0001.01|Prints|Organizations|Scottish Highlanders|Scottish Highlanders|Scanned with Ricoh Aficio 3228C @ 600 ppi. Master image saved in TIFF format",10|8,,"Still image|Photographs|jpeg",RG30.0001.01|index.cpd|https://digital.lib.uiowa.edu/,,,,,,,,,,,,,,,,,,,,,,,,,,,,,,,,,,,,,,,,,,,,,,,,"<a href=""https://digital.lib.uiowa.edu/"" target=""_blank"">View this item in its source respository</a>",,,,,,,,,,,,,,,,,,,,,,,,,,,,,https://www.iowaheritage.org/files/original/d6b51d3df934e6ed08ae7483ba5508e1.jpg,"Remote Item","Iowa City Town and Campus Scenes",1,0
30908,https://www.iowaheritage.org/items/show/30908,"Girl dancing to music of Scottish Highlanders bagpiper, The University of Iowa, 1938","Universities & colleges|Tartans|University of Iowa|United States -- Iowa -- Iowa City|1930-1940|Bands|Kilts|Bagpipes|Bleachers|Girls|University of Iowa. Scottish Highlanders","Dating back to 1936, the Scottish Highlanders was a student group dedicated to practicing and performing the Scottish arts of piping, drumming and dancing.","Kent, Frederick W. (Frederick Wallace), 1894-1984",,"University of Iowa. Libraries. University Archives",1938|2010-09-12,,"Educational use only, no other permissions given. U.S. and international copyright laws may protect this digital object. Commercial use or distribution of the object is not permitted without prior permission of the copyright holder.","Iowa City Town and Campus Scenes|Frederick W. Kent Collection of Photographs, 1866-2000|http://www.lib.uiowa.edu/collguides/?RG30.0001.01|Prints|Organizations|Scottish Highlanders|Scottish Highlanders|Scanned with Ricoh Aficio 3228C @ 600 ppi. Master image saved in TIFF format",4|3,,"Still image|Photographs|jpeg",RG30.0001.01|index.cpd|https://digital.lib.uiowa.edu/,,,,,,,,,,,,,,,,,,,,,,,,,,,,,,,,,,,,,,,,,,,,,,,,"<a href=""https://digital.lib.uiowa.edu/"" target=""_blank"">View this item in its source respository</a>",,,,,,,,,,,,,,,,,,,,,,,,,,,,,https://www.iowaheritage.org/files/original/d9cc64c8bb929991e7d5c92a7bd14629.jpg,"Remote Item","Iowa City Town and Campus Scenes",1,0
30909,https://www.iowaheritage.org/items/show/30909,"Scottish Highlanders performing on pontoon boat on Iowa River, The University of Iowa, October 1938","Universities & colleges|Tartans|University of Iowa|United States -- Iowa -- Iowa City|1930-1940|Bands|Kilts|Rivers|Boats|University of Iowa. Scottish Highlanders|Iowa Memorial Union (Iowa City, Iowa)|Old Armory (Iowa City, Iowa)|United States -- Iowa -- Iowa River","Dating back to 1936, the Scottish Highlanders was a student group dedicated to practicing and performing the Scottish arts of piping, drumming and dancing. This performance was on ROTC Pontoniers' Unit pontoon boat in conjunction with Dad's Day and part of weekend's festivities. Iowa Memorial Union, left, and Old Armory in background.","Kent, Frederick W. (Frederick Wallace), 1894-1984",,"University of Iowa. Libraries. University Archives",1938-10|2010-09-12,,"Educational use only, no other permissions given. U.S. and international copyright laws may protect this digital object. Commercial use or distribution of the object is not permitted without prior permission of the copyright holder.","Iowa City Town and Campus Scenes|Frederick W. Kent Collection of Photographs, 1866-2000|http://www.lib.uiowa.edu/collguides/?RG30.0001.01|Prints|Organizations|Scottish Highlanders|Scottish Highlanders|Scanned with Ricoh Aficio 3228C @ 600 ppi. Master image saved in TIFF format",4|3,,"Still image|Photographs|jpeg",RG30.0001.01|index.cpd|https://digital.lib.uiowa.edu/,,,,,,,,,,,,,,,,,,,,,,,,,,,,,,,,,,,,,,,,,,,,,,,,"<a href=""https://digital.lib.uiowa.edu/"" target=""_blank"">View this item in its source respository</a>",,,,,,,,,,,,,,,,,,,,,,,,,,,,,https://www.iowaheritage.org/files/original/357ac99ef72251fa879c71722d2b5adb.jpg,"Remote Item","Iowa City Town and Campus Scenes",1,0
30918,https://www.iowaheritage.org/items/show/30918,"Scottish Highlander members on steps of Old Capitol, The University of Iowa, June 1939","Universities & colleges|University of Iowa|United States -- Iowa -- Iowa City|1930-1940|Women|Band uniforms|Kilts|University of Iowa. Scottish Highlanders|Old Capitol (Iowa City, Iowa)","Dating back to 1936, the Scottish Highlanders was a student group dedicated to practicing and performing the Scottish arts of piping, drumming and dancing.","Kent, Frederick W. (Frederick Wallace), 1894-1984",,"University of Iowa. Libraries. University Archives",1939-06|2010-09-12,,"Educational use only, no other permissions given. U.S. and international copyright laws may protect this digital object. Commercial use or distribution of the object is not permitted without prior permission of the copyright holder.","Iowa City Town and Campus Scenes|Frederick W. Kent Collection of Photographs, 1866-2000|http://www.lib.uiowa.edu/collguides/?RG30.0001.01|Prints|Organizations|Scottish Highlanders|Scottish Highlanders|Scanned with Ricoh Aficio 3228C @ 600 ppi. Master image saved in TIFF format",,,"Still image|Photographs|jpeg",RG30.0001.01|index.cpd|https://digital.lib.uiowa.edu/,,,,,,,,,,,,,,,,,,,,,,,,,,,,,,,,,,,,,,,,,,,,,,,,"<a href=""https://digital.lib.uiowa.edu/"" target=""_blank"">View this item in its source respository</a>",,,,,,,,,,,,,,,,,,,,,,,,,,,,,https://www.iowaheritage.org/files/original/1436c1a258262de86868e3493bed45ed.jpg,"Remote Item","Iowa City Town and Campus Scenes",1,0
30919,https://www.iowaheritage.org/items/show/30919,"Scottish Highlander members, The University of Iowa, June 1939","Universities & colleges|University of Iowa|United States -- Iowa -- Iowa City|1930-1940|Women|Band uniforms|Kilts|University of Iowa. Scottish Highlanders","Dating back to 1936, the Scottish Highlanders was a student group dedicated to practicing and performing the Scottish arts of piping, drumming and dancing.","Kent, Frederick W. (Frederick Wallace), 1894-1984",,"University of Iowa. Libraries. University Archives",1939-06|2010-09-12,,"Educational use only, no other permissions given. U.S. and international copyright laws may protect this digital object. Commercial use or distribution of the object is not permitted without prior permission of the copyright holder.","Iowa City Town and Campus Scenes|Frederick W. Kent Collection of Photographs, 1866-2000|http://www.lib.uiowa.edu/collguides/?RG30.0001.01|Prints|Organizations|Scottish Highlanders|Scottish Highlanders|Scanned with Ricoh Aficio 3228C @ 600 ppi. Master image saved in TIFF format",,,"Still image|Photographs|jpeg",RG30.0001.01|index.cpd|https://digital.lib.uiowa.edu/,,,,,,,,,,,,,,,,,,,,,,,,,,,,,,,,,,,,,,,,,,,,,,,,"<a href=""https://digital.lib.uiowa.edu/"" target=""_blank"">View this item in its source respository</a>",,,,,,,,,,,,,,,,,,,,,,,,,,,,,https://www.iowaheritage.org/files/original/e1294e139684425fc06c37fb4bbd3171.jpg,"Remote Item","Iowa City Town and Campus Scenes",1,0
30920,https://www.iowaheritage.org/items/show/30920,"ROTC Scottish Highlander drum major, The University of Iowa, June 1939","Universities & colleges|University of Iowa|United States -- Iowa -- Iowa City|1930-1940|Drum majors|Kilts|University of Iowa. Scottish Highlanders","Dating back to 1936, the Scottish Highlanders was a student group dedicated to practicing and performing the Scottish arts of piping, drumming and dancing.","Kent, Frederick W. (Frederick Wallace), 1894-1984",,"University of Iowa. Libraries. University Archives",1939-06|2010-09-12,,"Educational use only, no other permissions given. U.S. and international copyright laws may protect this digital object. Commercial use or distribution of the object is not permitted without prior permission of the copyright holder.","Iowa City Town and Campus Scenes|Frederick W. Kent Collection of Photographs, 1866-2000|http://www.lib.uiowa.edu/collguides/?RG30.0001.01|Prints|Organizations|Scottish Highlanders|Scottish Highlanders|Scanned with Ricoh Aficio 3228C @ 600 ppi. Master image saved in TIFF format",,,"Still image|Photographs|jpeg",RG30.0001.01|index.cpd|https://digital.lib.uiowa.edu/,,,,,,,,,,,,,,,,,,,,,,,,,,,,,,,,,,,,,,,,,,,,,,,,"<a href=""https://digital.lib.uiowa.edu/"" target=""_blank"">View this item in its source respository</a>",,,,,,,,,,,,,,,,,,,,,,,,,,,,,https://www.iowaheritage.org/files/original/cdfc25d7e0e85d305b97ce56a19c87de.jpg,"Remote Item","Iowa City Town and Campus Scenes",1,0
30921,https://www.iowaheritage.org/items/show/30921,"ROTC Scottish Highlander drummer, The University of Iowa, June 1939","Universities & colleges|Drummers (Musicians)|University of Iowa|United States -- Iowa -- Iowa City|1930-1940|Drums|Kilts|University of Iowa. Scottish Highlanders|United States. Army. Reserve Officers' Training Corps","Dating back to 1936, the Scottish Highlanders was a student group dedicated to practicing and performing the Scottish arts of piping, drumming and dancing.","Kent, Frederick W. (Frederick Wallace), 1894-1984",,"University of Iowa. Libraries. University Archives",1939-06|2010-09-12,,"Educational use only, no other permissions given. U.S. and international copyright laws may protect this digital object. Commercial use or distribution of the object is not permitted without prior permission of the copyright holder.","Iowa City Town and Campus Scenes|Frederick W. Kent Collection of Photographs, 1866-2000|http://www.lib.uiowa.edu/collguides/?RG30.0001.01|Prints|Organizations|Scottish Highlanders|Scottish Highlanders|Scanned with Ricoh Aficio 3228C @ 600 ppi. Master image saved in TIFF format",,,"Still image|Photographs|jpeg",RG30.0001.01|index.cpd|https://digital.lib.uiowa.edu/,,,,,,,,,,,,,,,,,,,,,,,,,,,,,,,,,,,,,,,,,,,,,,,,"<a href=""https://digital.lib.uiowa.edu/"" target=""_blank"">View this item in its source respository</a>",,,,,,,,,,,,,,,,,,,,,,,,,,,,,https://www.iowaheritage.org/files/original/6f6a54ab173d23b4133a65421138aaf8.jpg,"Remote Item","Iowa City Town and Campus Scenes",1,0
30922,https://www.iowaheritage.org/items/show/30922,"Scottish Highlanders on rooftop garden across from Times Square, New York, New York, 1940","Universities & colleges|Tartans|University of Iowa|United States -- New York -- New York|1940-1950|Bands|Drums|Kilts|Roof gardens|University of Iowa. Scottish Highlanders","Dating back to 1936, the Scottish Highlanders was a student group dedicated to practicing and performing the Scottish arts of piping, drumming and dancing.","Kent, Frederick W. (Frederick Wallace), 1894-1984",,"University of Iowa. Libraries. University Archives",1940|2010-09-12,,"Educational use only, no other permissions given. U.S. and international copyright laws may protect this digital object. Commercial use or distribution of the object is not permitted without prior permission of the copyright holder.","Iowa City Town and Campus Scenes|Frederick W. Kent Collection of Photographs, 1866-2000|http://www.lib.uiowa.edu/collguides/?RG30.0001.01|Prints|Organizations|Scottish Highlanders|Scottish Highlanders|Scanned with Ricoh Aficio 3228C @ 600 ppi. Master image saved in TIFF format",3|4,,"Still image|Photographs|jpeg",RG30.0001.01|index.cpd|https://digital.lib.uiowa.edu/,,,,,,,,,,,,,,,,,,,,,,,,,,,,,,,,,,,,,,,,,,,,,,,,"<a href=""https://digital.lib.uiowa.edu/"" target=""_blank"">View this item in its source respository</a>",,,,,,,,,,,,,,,,,,,,,,,,,,,,,https://www.iowaheritage.org/files/original/7c9228525098cff21437b97db7bdbeda.jpg,"Remote Item","Iowa City Town and Campus Scenes",1,0
30923,https://www.iowaheritage.org/items/show/30923,"Scottish Highlanders on rooftop garden across from Times Square, New York, New York, 1940","Universities & colleges|Tartans|University of Iowa|United States -- New York -- New York|1940-1950|Bands|Drums|Kilts|Roof gardens|Times Square (New York, N.Y.)|University of Iowa. Scottish Highlanders","Dating back to 1936, the Scottish Highlanders was a student group dedicated to practicing and performing the Scottish arts of piping, drumming and dancing.","Kent, Frederick W. (Frederick Wallace), 1894-1984",,"University of Iowa. Libraries. University Archives",1940|2010-09-12,,"Educational use only, no other permissions given. U.S. and international copyright laws may protect this digital object. Commercial use or distribution of the object is not permitted without prior permission of the copyright holder.","Iowa City Town and Campus Scenes|Frederick W. Kent Collection of Photographs, 1866-2000|http://www.lib.uiowa.edu/collguides/?RG30.0001.01|Prints|Organizations|Scottish Highlanders|Scottish Highlanders|Scanned with Ricoh Aficio 3228C @ 600 ppi. Master image saved in TIFF format",3|4,,"Still image|Photographs|jpeg",RG30.0001.01|index.cpd|https://digital.lib.uiowa.edu/,,,,,,,,,,,,,,,,,,,,,,,,,,,,,,,,,,,,,,,,,,,,,,,,"<a href=""https://digital.lib.uiowa.edu/"" target=""_blank"">View this item in its source respository</a>",,,,,,,,,,,,,,,,,,,,,,,,,,,,,https://www.iowaheritage.org/files/original/ce560050467beb1dbf00a0bcf8b1a99e.jpg,"Remote Item","Iowa City Town and Campus Scenes",1,0
30924,https://www.iowaheritage.org/items/show/30924,"Scottish Highlander posing with women in ethnic dress, New York, New York, 1940","Universities & colleges|Tartans|University of Iowa|United States -- New York -- New York|1940-1950|Kilts|University of Iowa. Scottish Highlanders","Dating back to 1936, the Scottish Highlanders was a student group dedicated to practicing and performing the Scottish arts of piping, drumming and dancing.","Kent, Frederick W. (Frederick Wallace), 1894-1984",,"University of Iowa. Libraries. University Archives",1940|2010-09-12,,"Educational use only, no other permissions given. U.S. and international copyright laws may protect this digital object. Commercial use or distribution of the object is not permitted without prior permission of the copyright holder.","Iowa City Town and Campus Scenes|Frederick W. Kent Collection of Photographs, 1866-2000|http://www.lib.uiowa.edu/collguides/?RG30.0001.01|Prints|Organizations|Scottish Highlanders|Scottish Highlanders|Scanned with Ricoh Aficio 3228C @ 600 ppi. Master image saved in TIFF format",3|4,,"Still image|Photographs|jpeg",RG30.0001.01|index.cpd|https://digital.lib.uiowa.edu/,,,,,,,,,,,,,,,,,,,,,,,,,,,,,,,,,,,,,,,,,,,,,,,,"<a href=""https://digital.lib.uiowa.edu/"" target=""_blank"">View this item in its source respository</a>",,,,,,,,,,,,,,,,,,,,,,,,,,,,,https://www.iowaheritage.org/files/original/a3239d550c469959aff9c2073cc569ee.jpg,"Remote Item","Iowa City Town and Campus Scenes",1,0
