 




﻿"Item Id","Item URI","Dublin Core:Title","Dublin Core:Subject","Dublin Core:Description","Dublin Core:Creator","Dublin Core:Source","Dublin Core:Publisher","Dublin Core:Date","Dublin Core:Contributor","Dublin Core:Rights","Dublin Core:Relation","Dublin Core:Format","Dublin Core:Language","Dublin Core:Type","Dublin Core:Identifier","Dublin Core:Coverage","Item Type Metadata:Text","Item Type Metadata:Interviewer","Item Type Metadata:Interviewee","Item Type Metadata:Location","Item Type Metadata:Transcription","Item Type Metadata:Local URL","Item Type Metadata:Original Format","Item Type Metadata:Physical Dimensions","Item Type Metadata:Duration","Item Type Metadata:Compression","Item Type Metadata:Producer","Item Type Metadata:Director","Item Type Metadata:Bit Rate/Frequency","Item Type Metadata:Time Summary","Item Type Metadata:Email Body","Item Type Metadata:Subject Line","Item Type Metadata:From","Item Type Metadata:To","Item Type Metadata:CC","Item Type Metadata:BCC","Item Type Metadata:Number of Attachments","Item Type Metadata:Standards","Item Type Metadata:Objectives","Item Type Metadata:Materials","Item Type Metadata:Lesson Plan Text","Item Type Metadata:URL","Item Type Metadata:Event Type","Item Type Metadata:Participants","Item Type Metadata:Birth Date","Item Type Metadata:Birthplace","Item Type Metadata:Death Date","Item Type Metadata:Occupation","Item Type Metadata:Biographical Text","Item Type Metadata:Bibliography","Item Type Metadata:Digital Reproduction Information","Item Type Metadata:Repository","Item Type Metadata:Repository Collection","Item Type Metadata:Contact information.","Item Type Metadata:File Name","Item Type Metadata:Notes","Item Type Metadata:Digital item created","Item Type Metadata:Digital item modified","Item Type Metadata:Executive Orders","Item Type Metadata:Record Created","Item Type Metadata:Record Modified","Item Type Metadata:Transcription2","Item Type Metadata:Source URL","Omeka Legacy File:Additional Creator","Omeka Legacy File:Transcriber","Omeka Legacy File:Producer","Omeka Legacy File:Render Device","Omeka Legacy File:Render Details","Omeka Legacy File:Capture Date","Omeka Legacy File:Capture Device","Omeka Legacy File:Capture Details","Omeka Legacy File:Change History","Omeka Legacy File:Watermark","Omeka Legacy File:Encryption","Omeka Legacy File:Compression","Omeka Legacy File:Post Processing","Omeka Image File:Width","Omeka Image File:Height","Omeka Image File:Bit Depth","Omeka Image File:Channels","Omeka Image File:Exif String","Omeka Image File:Exif Array","Omeka Image File:IPTC String","Omeka Image File:IPTC Array","Omeka Video File:Bitrate","Omeka Video File:Duration","Omeka Video File:Sample Rate","Omeka Video File:Codec","Omeka Video File:Width","Omeka Video File:Height",tags,file,itemType,collection,public,featured
67726,https://www.iowaheritage.org/items/show/67726,"ISU quarterback ready to pass during the Homecoming Game, 1985","Iowa State University|Homecoming|Football Field|Homecoming Game","The ISU quarterback, Alex Espinoza, gets ready to pass during the Homecoming Game against Kansas, 1985.|Alumni first began returning to Iowa State for an official Homecoming in 1912. Since then, the celebration continues to entertain both young and old Iowa Staters, with traditional events, including tailgate parties, fireworks, lawn displays, """"Yell Like Hell"""" cheering competition, and mass campaniling. Currently, the Student Alumni Association Leadership Council coordinates the efforts of hundreds of students, who volunteer their time to help Story County Habitat for Humanity build a house.","Pete; Iowa State University",22-07-G.Homecoming.1666-12-03-22A,"Iowa State University Library Special Collections: http://www.add.lib.iastate.edu/spcl/index.html",1985|2012-05,,"U.S. and international copyright laws protect this digital image. Commercial use or distribution of the image is not permitted without prior permission of the copyright holder. For permission to use the digital image, please contact Iowa State University Library, Special Collections archives@iastate.edu  For reproductions see:  http://www.add.lib.iastate.edu/spcl/services/photfees.html","University Photographs; http://www.add.lib.iastate.edu/spcl/collections/images.html","Photograph| 3.6 x 2.2 cm",,Image|Image,22-07-G.Homecoming.1666-12-03-22A|https://digitalcollections.lib.iastate.edu/,,,,,,,,,,,,,,,,,,,,,,,,,,,,,,,,,,,,,,,,,,,,,,,,"<a href=""https://digitalcollections.lib.iastate.edu/"" target=""_blank"">View this item in its source respository</a>",,,,,,,,,,,,,,,,,,,,,,,,,,,,,https://www.iowaheritage.org/files/original/382d61defb85bc6ad6fb9199da3960ef.jpg,"Remote Item","Iowa State University Library Photograph Collection",1,0
72869,https://www.iowaheritage.org/items/show/72869,"ISU quarterback ready to pass during the Homecoming Game, 1985","Iowa State University|Homecoming|Football Field|Homecoming Game","The ISU quarterback, Alex Espinoza, gets ready to pass during the Homecoming Game against Kansas, 1985.|Alumni first began returning to Iowa State for an official Homecoming in 1912. Since then, the celebration continues to entertain both young and old Iowa Staters, with traditional events, including tailgate parties, fireworks, lawn displays, """"Yell Like Hell"""" cheering competition, and mass campaniling. Currently, the Student Alumni Association Leadership Council coordinates the efforts of hundreds of students, who volunteer their time to help Story County Habitat for Humanity build a house.","Pete; Iowa State University",22-07-G.Homecoming.1666-12-03-22A,"Iowa State University Library Special Collections: http://www.add.lib.iastate.edu/spcl/index.html",1985|2012-05,,"U.S. and international copyright laws protect this digital image. Commercial use or distribution of the image is not permitted without prior permission of the copyright holder. For permission to use the digital image, please contact Iowa State University Library, Special Collections archives@iastate.edu  For reproductions see:  http://www.add.lib.iastate.edu/spcl/services/photfees.html","University Photographs; http://www.add.lib.iastate.edu/spcl/collections/images.html","Photograph| 3.6 x 2.2 cm",,Image|Image,22-07-G.Homecoming.1666-12-03-22A|https://digitalcollections.lib.iastate.edu/,,,,,,,,,,,,,,,,,,,,,,,,,,,,,,,,,,,,,,,,,,,,,,,,"<a href=""https://digitalcollections.lib.iastate.edu/"" target=""_blank"">View this item in its source respository</a>",,,,,,,,,,,,,,,,,,,,,,,,,,,,,https://www.iowaheritage.org/files/original/dcec01631daae07e2337703ba608e9ec.jpg,"Remote Item",,1,0
67727,https://www.iowaheritage.org/items/show/67727,"ISU quarterback tossing the ball during the Homecoming Game, 1985","Iowa State University|Homecoming|Football Field|Homecoming Game","The ISU quarterback, Alex Espinoza, tosses the ball during the Homecoming Game against Kansas, 1985.|Alumni first began returning to Iowa State for an official Homecoming in 1912. Since then, the celebration continues to entertain both young and old Iowa Staters, with traditional events, including tailgate parties, fireworks, lawn displays, """"Yell Like Hell"""" cheering competition, and mass campaniling. Currently, the Student Alumni Association Leadership Council coordinates the efforts of hundreds of students, who volunteer their time to help Story County Habitat for Humanity build a house.","Pete; Iowa State University",22-07-G.Homecoming.1666-12-03-26A,"Iowa State University Library Special Collections: http://www.add.lib.iastate.edu/spcl/index.html",1985|2012-05,,"U.S. and international copyright laws protect this digital image. Commercial use or distribution of the image is not permitted without prior permission of the copyright holder. For permission to use the digital image, please contact Iowa State University Library, Special Collections archives@iastate.edu  For reproductions see:  http://www.add.lib.iastate.edu/spcl/services/photfees.html","University Photographs; http://www.add.lib.iastate.edu/spcl/collections/images.html","Photograph| 3.6 x 2.4 cm",,Image|Image,22-07-G.Homecoming.1666-12-03-26A|https://digitalcollections.lib.iastate.edu/,,,,,,,,,,,,,,,,,,,,,,,,,,,,,,,,,,,,,,,,,,,,,,,,"<a href=""https://digitalcollections.lib.iastate.edu/"" target=""_blank"">View this item in its source respository</a>",,,,,,,,,,,,,,,,,,,,,,,,,,,,,https://www.iowaheritage.org/files/original/ac40482dccbf28be5ad96089b4e03284.jpg,"Remote Item","Iowa State University Library Photograph Collection",1,0
72870,https://www.iowaheritage.org/items/show/72870,"ISU quarterback tossing the ball during the Homecoming Game, 1985","Iowa State University|Homecoming|Football Field|Homecoming Game","The ISU quarterback, Alex Espinoza, tosses the ball during the Homecoming Game against Kansas, 1985.|Alumni first began returning to Iowa State for an official Homecoming in 1912. Since then, the celebration continues to entertain both young and old Iowa Staters, with traditional events, including tailgate parties, fireworks, lawn displays, """"Yell Like Hell"""" cheering competition, and mass campaniling. Currently, the Student Alumni Association Leadership Council coordinates the efforts of hundreds of students, who volunteer their time to help Story County Habitat for Humanity build a house.","Pete; Iowa State University",22-07-G.Homecoming.1666-12-03-26A,"Iowa State University Library Special Collections: http://www.add.lib.iastate.edu/spcl/index.html",1985|2012-05,,"U.S. and international copyright laws protect this digital image. Commercial use or distribution of the image is not permitted without prior permission of the copyright holder. For permission to use the digital image, please contact Iowa State University Library, Special Collections archives@iastate.edu  For reproductions see:  http://www.add.lib.iastate.edu/spcl/services/photfees.html","University Photographs; http://www.add.lib.iastate.edu/spcl/collections/images.html","Photograph| 3.6 x 2.4 cm",,Image|Image,22-07-G.Homecoming.1666-12-03-26A|https://digitalcollections.lib.iastate.edu/,,,,,,,,,,,,,,,,,,,,,,,,,,,,,,,,,,,,,,,,,,,,,,,,"<a href=""https://digitalcollections.lib.iastate.edu/"" target=""_blank"">View this item in its source respository</a>",,,,,,,,,,,,,,,,,,,,,,,,,,,,,https://www.iowaheritage.org/files/original/795d6a6be9ce03411810726ba9b33264.jpg,"Remote Item",,1,0
67722,https://www.iowaheritage.org/items/show/67722,"Military color guard performing with the ISU Marching Band at Homecoming, 1985","Iowa State University|Homecoming|Marching Band|Color Guard|Football Field","The military color guard performs with the ISU Marching Band on the football field at Homecoming, 1985.|Alumni first began returning to Iowa State for an official Homecoming in 1912. Since then, the celebration continues to entertain both young and old Iowa Staters, with traditional events, including tailgate parties, fireworks, lawn displays, """"Yell Like Hell"""" cheering competition, and mass campaniling. Currently, the Student Alumni Association Leadership Council coordinates the efforts of hundreds of students, who volunteer their time to help Story County Habitat for Humanity build a house.","Pete; Iowa State University",22-07-G.Homecoming.1666-12-03-02A,"Iowa State University Library Special Collections: http://www.add.lib.iastate.edu/spcl/index.html",1985|2012-05,,"U.S. and international copyright laws protect this digital image. Commercial use or distribution of the image is not permitted without prior permission of the copyright holder. For permission to use the digital image, please contact Iowa State University Library, Special Collections archives@iastate.edu  For reproductions see:  http://www.add.lib.iastate.edu/spcl/services/photfees.html","University Photographs; http://www.add.lib.iastate.edu/spcl/collections/images.html","Photograph| 3.6 x 2.4 cm",,Image|Image,22-07-G.Homecoming.1666-12-03-02A|https://digitalcollections.lib.iastate.edu/,,,,,,,,,,,,,,,,,,,,,,,,,,,,,,,,,,,,,,,,,,,,,,,,"<a href=""https://digitalcollections.lib.iastate.edu/"" target=""_blank"">View this item in its source respository</a>",,,,,,,,,,,,,,,,,,,,,,,,,,,,,https://www.iowaheritage.org/files/original/8eb4d516e731b7875fdaa3661eb5a77c.jpg,"Remote Item","Iowa State University Library Photograph Collection",1,0
72865,https://www.iowaheritage.org/items/show/72865,"Military color guard performing with the ISU Marching Band at Homecoming, 1985","Iowa State University|Homecoming|Marching Band|Color Guard|Football Field","The military color guard performs with the ISU Marching Band on the football field at Homecoming, 1985.|Alumni first began returning to Iowa State for an official Homecoming in 1912. Since then, the celebration continues to entertain both young and old Iowa Staters, with traditional events, including tailgate parties, fireworks, lawn displays, """"Yell Like Hell"""" cheering competition, and mass campaniling. Currently, the Student Alumni Association Leadership Council coordinates the efforts of hundreds of students, who volunteer their time to help Story County Habitat for Humanity build a house.","Pete; Iowa State University",22-07-G.Homecoming.1666-12-03-02A,"Iowa State University Library Special Collections: http://www.add.lib.iastate.edu/spcl/index.html",1985|2012-05,,"U.S. and international copyright laws protect this digital image. Commercial use or distribution of the image is not permitted without prior permission of the copyright holder. For permission to use the digital image, please contact Iowa State University Library, Special Collections archives@iastate.edu  For reproductions see:  http://www.add.lib.iastate.edu/spcl/services/photfees.html","University Photographs; http://www.add.lib.iastate.edu/spcl/collections/images.html","Photograph| 3.6 x 2.4 cm",,Image|Image,22-07-G.Homecoming.1666-12-03-02A|https://digitalcollections.lib.iastate.edu/,,,,,,,,,,,,,,,,,,,,,,,,,,,,,,,,,,,,,,,,,,,,,,,,"<a href=""https://digitalcollections.lib.iastate.edu/"" target=""_blank"">View this item in its source respository</a>",,,,,,,,,,,,,,,,,,,,,,,,,,,,,https://www.iowaheritage.org/files/original/2e76bab1cade98da3a3a88a1c2009bf1.jpg,"Remote Item",,1,0
67718,https://www.iowaheritage.org/items/show/67718,"Saxophone player and drummer marching in the ISU Alumni Band at Homecoming, 1985","Iowa State University|Homecoming|Marching Band|Football Field","A long-haired saxophone player and a drummer are shown marching in the ISU Alumni Band at Homecoming, 1985.|Alumni first began returning to Iowa State for an official Homecoming in 1912. Since then, the celebration continues to entertain both young and old Iowa Staters, with traditional events, including tailgate parties, fireworks, lawn displays, """"Yell Like Hell"""" cheering competition, and mass campaniling. Currently, the Student Alumni Association Leadership Council coordinates the efforts of hundreds of students, who volunteer their time to help Story County Habitat for Humanity build a house.","Pete; Iowa State University",22-07-G.Homecoming.1666-12-01-16A,"Iowa State University Library Special Collections: http://www.add.lib.iastate.edu/spcl/index.html",1985|2012-05,,"U.S. and international copyright laws protect this digital image. Commercial use or distribution of the image is not permitted without prior permission of the copyright holder. For permission to use the digital image, please contact Iowa State University Library, Special Collections archives@iastate.edu  For reproductions see:  http://www.add.lib.iastate.edu/spcl/services/photfees.html","University Photographs; http://www.add.lib.iastate.edu/spcl/collections/images.html","Photograph| 3.6 x 2.5 cm",,Image|Image,22-07-G.Homecoming.1666-12-01-16A|https://digitalcollections.lib.iastate.edu/,,,,,,,,,,,,,,,,,,,,,,,,,,,,,,,,,,,,,,,,,,,,,,,,"<a href=""https://digitalcollections.lib.iastate.edu/"" target=""_blank"">View this item in its source respository</a>",,,,,,,,,,,,,,,,,,,,,,,,,,,,,https://www.iowaheritage.org/files/original/588134db03358f88d8e63876ff0902eb.jpg,"Remote Item","Iowa State University Library Photograph Collection",1,0
72861,https://www.iowaheritage.org/items/show/72861,"Saxophone player and drummer marching in the ISU Alumni Band at Homecoming, 1985","Iowa State University|Homecoming|Marching Band|Football Field","A long-haired saxophone player and a drummer are shown marching in the ISU Alumni Band at Homecoming, 1985.|Alumni first began returning to Iowa State for an official Homecoming in 1912. Since then, the celebration continues to entertain both young and old Iowa Staters, with traditional events, including tailgate parties, fireworks, lawn displays, """"Yell Like Hell"""" cheering competition, and mass campaniling. Currently, the Student Alumni Association Leadership Council coordinates the efforts of hundreds of students, who volunteer their time to help Story County Habitat for Humanity build a house.","Pete; Iowa State University",22-07-G.Homecoming.1666-12-01-16A,"Iowa State University Library Special Collections: http://www.add.lib.iastate.edu/spcl/index.html",1985|2012-05,,"U.S. and international copyright laws protect this digital image. Commercial use or distribution of the image is not permitted without prior permission of the copyright holder. For permission to use the digital image, please contact Iowa State University Library, Special Collections archives@iastate.edu  For reproductions see:  http://www.add.lib.iastate.edu/spcl/services/photfees.html","University Photographs; http://www.add.lib.iastate.edu/spcl/collections/images.html","Photograph| 3.6 x 2.5 cm",,Image|Image,22-07-G.Homecoming.1666-12-01-16A|https://digitalcollections.lib.iastate.edu/,,,,,,,,,,,,,,,,,,,,,,,,,,,,,,,,,,,,,,,,,,,,,,,,"<a href=""https://digitalcollections.lib.iastate.edu/"" target=""_blank"">View this item in its source respository</a>",,,,,,,,,,,,,,,,,,,,,,,,,,,,,https://www.iowaheritage.org/files/original/815c4abcc839f0d73bb1230cde9943df.jpg,"Remote Item",,1,0
67625,https://www.iowaheritage.org/items/show/67625,"Stadium crowd at Clyde Williams Field, Homecoming Game, 1957","Iowa State University|Homecoming|Football field","The crowd stands and cheers at the Iowa State vs. Kansas State Homecoming Game at Clyde Williams Field.|Alumni first began returning to Iowa State for an official Homecoming in 1912. Since then, the celebration continues to entertain both young and old Iowa Staters, with traditional events, including tailgate parties, fireworks, lawn displays, """"Yell Like Hell"""" cheering competition, and mass campaniling. Currently, the Student Alumni Association Leadership Council coordinates the efforts of hundreds of students, who volunteer their time to help Story County Habitat for Humanity build a house.","Dean, Iowa State University",22-07-G.Homecoming.1665-02-03-09,"Iowa State University Library Special Collections: http://www.add.lib.iastate.edu/spcl/index.html",1957|2012-04,,"U.S. and international copyright laws protect this digital image. Commercial use or distribution of the image is not permitted without prior permission of the copyright holder. For permission to use the digital image, please contact Iowa State University Library, Special Collections archives@iastate.edu  For reproductions see:  http://www.add.lib.iastate.edu/spcl/services/photfees.html","University Photographs; http://www.add.lib.iastate.edu/spcl/collections/images.html","Photograph| 5.7 x 5.7",,Image|Image,22-07-G.Homecoming.1665-02-03-09|https://digitalcollections.lib.iastate.edu/,,,,,,,,,,,,,,,,,,,,,,,,,,,,,,,,,,,,,,,,,,,,,,,,"<a href=""https://digitalcollections.lib.iastate.edu/"" target=""_blank"">View this item in its source respository</a>",,,,,,,,,,,,,,,,,,,,,,,,,,,,,https://www.iowaheritage.org/files/original/6868867a602aeee2a40f6fc178eae3c0.jpg,"Remote Item","Iowa State University Library Photograph Collection",1,0
72768,https://www.iowaheritage.org/items/show/72768,"Stadium crowd at Clyde Williams Field, Homecoming Game, 1957","Iowa State University|Homecoming|Football field","The crowd stands and cheers at the Iowa State vs. Kansas State Homecoming Game at Clyde Williams Field.|Alumni first began returning to Iowa State for an official Homecoming in 1912. Since then, the celebration continues to entertain both young and old Iowa Staters, with traditional events, including tailgate parties, fireworks, lawn displays, """"Yell Like Hell"""" cheering competition, and mass campaniling. Currently, the Student Alumni Association Leadership Council coordinates the efforts of hundreds of students, who volunteer their time to help Story County Habitat for Humanity build a house.","Dean, Iowa State University",22-07-G.Homecoming.1665-02-03-09,"Iowa State University Library Special Collections: http://www.add.lib.iastate.edu/spcl/index.html",1957|2012-04,,"U.S. and international copyright laws protect this digital image. Commercial use or distribution of the image is not permitted without prior permission of the copyright holder. For permission to use the digital image, please contact Iowa State University Library, Special Collections archives@iastate.edu  For reproductions see:  http://www.add.lib.iastate.edu/spcl/services/photfees.html","University Photographs; http://www.add.lib.iastate.edu/spcl/collections/images.html","Photograph| 5.7 x 5.7",,Image|Image,22-07-G.Homecoming.1665-02-03-09|https://digitalcollections.lib.iastate.edu/,,,,,,,,,,,,,,,,,,,,,,,,,,,,,,,,,,,,,,,,,,,,,,,,"<a href=""https://digitalcollections.lib.iastate.edu/"" target=""_blank"">View this item in its source respository</a>",,,,,,,,,,,,,,,,,,,,,,,,,,,,,https://www.iowaheritage.org/files/original/65b6795357c86ebd94d6d77bbb13eff8.jpg,"Remote Item",,1,0
