 




﻿"Item Id","Item URI","Dublin Core:Title","Dublin Core:Subject","Dublin Core:Description","Dublin Core:Creator","Dublin Core:Source","Dublin Core:Publisher","Dublin Core:Date","Dublin Core:Contributor","Dublin Core:Rights","Dublin Core:Relation","Dublin Core:Format","Dublin Core:Language","Dublin Core:Type","Dublin Core:Identifier","Dublin Core:Coverage","Item Type Metadata:Text","Item Type Metadata:Interviewer","Item Type Metadata:Interviewee","Item Type Metadata:Location","Item Type Metadata:Transcription","Item Type Metadata:Local URL","Item Type Metadata:Original Format","Item Type Metadata:Physical Dimensions","Item Type Metadata:Duration","Item Type Metadata:Compression","Item Type Metadata:Producer","Item Type Metadata:Director","Item Type Metadata:Bit Rate/Frequency","Item Type Metadata:Time Summary","Item Type Metadata:Email Body","Item Type Metadata:Subject Line","Item Type Metadata:From","Item Type Metadata:To","Item Type Metadata:CC","Item Type Metadata:BCC","Item Type Metadata:Number of Attachments","Item Type Metadata:Standards","Item Type Metadata:Objectives","Item Type Metadata:Materials","Item Type Metadata:Lesson Plan Text","Item Type Metadata:URL","Item Type Metadata:Event Type","Item Type Metadata:Participants","Item Type Metadata:Birth Date","Item Type Metadata:Birthplace","Item Type Metadata:Death Date","Item Type Metadata:Occupation","Item Type Metadata:Biographical Text","Item Type Metadata:Bibliography","Item Type Metadata:Digital Reproduction Information","Item Type Metadata:Repository","Item Type Metadata:Repository Collection","Item Type Metadata:Contact information.","Item Type Metadata:File Name","Item Type Metadata:Notes","Item Type Metadata:Digital item created","Item Type Metadata:Digital item modified","Item Type Metadata:Executive Orders","Item Type Metadata:Record Created","Item Type Metadata:Record Modified","Item Type Metadata:Transcription2","Item Type Metadata:Source URL","Omeka Legacy File:Additional Creator","Omeka Legacy File:Transcriber","Omeka Legacy File:Producer","Omeka Legacy File:Render Device","Omeka Legacy File:Render Details","Omeka Legacy File:Capture Date","Omeka Legacy File:Capture Device","Omeka Legacy File:Capture Details","Omeka Legacy File:Change History","Omeka Legacy File:Watermark","Omeka Legacy File:Encryption","Omeka Legacy File:Compression","Omeka Legacy File:Post Processing","Omeka Image File:Width","Omeka Image File:Height","Omeka Image File:Bit Depth","Omeka Image File:Channels","Omeka Image File:Exif String","Omeka Image File:Exif Array","Omeka Image File:IPTC String","Omeka Image File:IPTC Array","Omeka Video File:Bitrate","Omeka Video File:Duration","Omeka Video File:Sample Rate","Omeka Video File:Codec","Omeka Video File:Width","Omeka Video File:Height",tags,file,itemType,collection,public,featured
22829,https://www.iowaheritage.org/items/show/22829,"Commencement on the Pentacrest, The University of Iowa, June 1920","Graduation ceremonies|Academic costume|University of Iowa|United States -- Iowa -- Iowa City|1920-1930|Alumni & alumnae|Crowds|Trees|Universities & colleges",,"Kent, Frederick W. (Frederick Wallace), 1894-1984",,"The University of Iowa. Libraries. University Archives",1920-06,,"Educational use only, no other permissions given. U.S. and international copyright laws may protect this digital object. Commercial use or distribution of the object is not permitted without prior permission of the copyright holder.","Iowa City Town and Campus Scenes|Frederick W. Kent collection of photographs, 1866-2000|http://www.lib.uiowa.edu/collguides/?RG30.0001.01|Prints|Events and activities|Commencement|Commencement|Scanned with Ricoh Aficio 3228C at 600 ppi, full color. Master images saved in tiff format.",13|18,,"Still image|Photographs|jpeg",RG30.0001.01|https://digital.lib.uiowa.edu/,,,,,,,,,,,,,,,,,,,,,,,,,,,,,,,,,,,,,,,,,,,,,,,,"<a href=""https://digital.lib.uiowa.edu/"" target=""_blank"">View this item in its source respository</a>",,,,,,,,,,,,,,,,,,,,,,,,,,,,,https://www.iowaheritage.org/files/original/e88708a548cfa4ae09e0dabc34c89e9a.jpg,"Remote Item","Iowa City Town and Campus Scenes",1,0
22843,https://www.iowaheritage.org/items/show/22843,"Commencement on the Pentacrest, The University of Iowa, June 1922","Graduation ceremonies|Academic costume|University of Iowa|United States -- Iowa -- Iowa City|1920-1930|Alumni & alumnae|Crowds|Trees|Bleachers|Universities & colleges",,"Kent, Frederick W. (Frederick Wallace), 1894-1984",,"The University of Iowa. Libraries. University Archives",1922-06,,"Educational use only, no other permissions given. U.S. and international copyright laws may protect this digital object. Commercial use or distribution of the object is not permitted without prior permission of the copyright holder.","Iowa City Town and Campus Scenes|Frederick W. Kent collection of photographs, 1866-2000|http://www.lib.uiowa.edu/collguides/?RG30.0001.01|Prints|Events and activities|Commencement|Commencement|Scanned with Ricoh Aficio 3228C at 600 ppi, full color. Master images saved in tiff format.",9|14,,"Still image|Photographs; Photographic postcards|jpeg",RG30.0001.01|https://digital.lib.uiowa.edu/,,,,,,,,,,,,,,,,,,,,,,,,,,,,,,,,,,,,,,,,,,,,,,,,"<a href=""https://digital.lib.uiowa.edu/"" target=""_blank"">View this item in its source respository</a>",,,,,,,,,,,,,,,,,,,,,,,,,,,,,https://www.iowaheritage.org/files/original/b0db92f30906fa5daf896d530a448639.jpg,"Remote Item","Iowa City Town and Campus Scenes",1,0
22853,https://www.iowaheritage.org/items/show/22853,"Commencement on the Pentacrest, The University of Iowa, June 1922","Graduation ceremonies|Academic costume|University of Iowa|United States -- Iowa -- Iowa City|1920-1930|Alumni & alumnae|Crowds|Trees|Universities & colleges",,"Kent, Frederick W. (Frederick Wallace), 1894-1984",,"The University of Iowa. Libraries. University Archives",1922-06,,"Educational use only, no other permissions given. U.S. and international copyright laws may protect this digital object. Commercial use or distribution of the object is not permitted without prior permission of the copyright holder.","Iowa City Town and Campus Scenes|Frederick W. Kent collection of photographs, 1866-2000|http://www.lib.uiowa.edu/collguides/?RG30.0001.01|Prints|Events and activities|Commencement|Commencement|Scanned with Ricoh Aficio 3228C at 600 ppi, full color. Master images saved in tiff format.",9|14,,"Still image|Photographs; Photographic postcards|jpeg",RG30.0001.01|https://digital.lib.uiowa.edu/,,,,,,,,,,,,,,,,,,,,,,,,,,,,,,,,,,,,,,,,,,,,,,,,"<a href=""https://digital.lib.uiowa.edu/"" target=""_blank"">View this item in its source respository</a>",,,,,,,,,,,,,,,,,,,,,,,,,,,,,https://www.iowaheritage.org/files/original/6b83d5abbc57c17d7b69e6f1b90e439f.jpg,"Remote Item","Iowa City Town and Campus Scenes",1,0
22903,https://www.iowaheritage.org/items/show/22903,"Commencement on the Pentacrest, The University of Iowa, June 1924","Graduation ceremonies|Academic costume|University of Iowa|United States -- Iowa -- Iowa City|1920-1930|Alumni & alumnae|Crowds|Universities & colleges",,"Kent, Frederick W. (Frederick Wallace), 1894-1984",,"The University of Iowa. Libraries. University Archives",1924-06,,"Educational use only, no other permissions given. U.S. and international copyright laws may protect this digital object. Commercial use or distribution of the object is not permitted without prior permission of the copyright holder.","Iowa City Town and Campus Scenes|Frederick W. Kent collection of photographs, 1866-2000|http://www.lib.uiowa.edu/collguides/?RG30.0001.01|Prints|Events and activities|Commencement|Commencement|Scanned with Ricoh Aficio 3228C at 600 ppi, full color. Master images saved in tiff format.",8|16,,"Still image|Photographs|jpeg",RG30.0001.01|https://digital.lib.uiowa.edu/,,,,,,,,,,,,,,,,,,,,,,,,,,,,,,,,,,,,,,,,,,,,,,,,"<a href=""https://digital.lib.uiowa.edu/"" target=""_blank"">View this item in its source respository</a>",,,,,,,,,,,,,,,,,,,,,,,,,,,,,https://www.iowaheritage.org/files/original/23c00a56202d0e4b2490f4d208db09b8.jpg,"Remote Item","Iowa City Town and Campus Scenes",1,0
22927,https://www.iowaheritage.org/items/show/22927,"Commencement on the Pentacrest, The University of Iowa, June 1925","Graduation ceremonies|Academic costume|University of Iowa|United States -- Iowa -- Iowa City|1920-1930|Alumni & alumnae|Crowds|Universities & colleges",,"Kent, Frederick W. (Frederick Wallace), 1894-1984",,"The University of Iowa. Libraries. University Archives",1925-06,,"Educational use only, no other permissions given. U.S. and international copyright laws may protect this digital object. Commercial use or distribution of the object is not permitted without prior permission of the copyright holder.","Iowa City Town and Campus Scenes|Frederick W. Kent collection of photographs, 1866-2000|http://www.lib.uiowa.edu/collguides/?RG30.0001.01|Prints|Events and activities|Commencement|Commencement|Scanned with Ricoh Aficio 3228C at 600 ppi, full color. Master images saved in tiff format.",9|14,,"Still image|Photographs; Photographic postcards|jpeg",RG30.0001.01|https://digital.lib.uiowa.edu/,,,,,,,,,,,,,,,,,,,,,,,,,,,,,,,,,,,,,,,,,,,,,,,,"<a href=""https://digital.lib.uiowa.edu/"" target=""_blank"">View this item in its source respository</a>",,,,,,,,,,,,,,,,,,,,,,,,,,,,,https://www.iowaheritage.org/files/original/57054ca8efa24f4e737c3b4b679af3d6.jpg,"Remote Item","Iowa City Town and Campus Scenes",1,0
22931,https://www.iowaheritage.org/items/show/22931,"Commencement on the Pentacrest, The University of Iowa, June 1928","Graduation ceremonies|Academic costume|University of Iowa|United States -- Iowa -- Iowa City|1920-1930|Alumni & alumnae|Crowds|Universities & colleges|Schaeffer Hall (Iowa City, Iowa)",,"Kent, Frederick W. (Frederick Wallace), 1894-1984",,"The University of Iowa. Libraries. University Archives",1928-06,,"Educational use only, no other permissions given. U.S. and international copyright laws may protect this digital object. Commercial use or distribution of the object is not permitted without prior permission of the copyright holder.","Iowa City Town and Campus Scenes|Frederick W. Kent collection of photographs, 1866-2000|http://www.lib.uiowa.edu/collguides/?RG30.0001.01|Prints|Events and activities|Commencement|Commencement|Scanned with Ricoh Aficio 3228C at 600 ppi, full color. Master images saved in tiff format.",13|17,,"Still image|Photographs|jpeg",RG30.0001.01|https://digital.lib.uiowa.edu/,,,,,,,,,,,,,,,,,,,,,,,,,,,,,,,,,,,,,,,,,,,,,,,,"<a href=""https://digital.lib.uiowa.edu/"" target=""_blank"">View this item in its source respository</a>",,,,,,,,,,,,,,,,,,,,,,,,,,,,,https://www.iowaheritage.org/files/original/305ee735a70bc4052baa8bbb8fda4795.jpg,"Remote Item","Iowa City Town and Campus Scenes",1,0
22975,https://www.iowaheritage.org/items/show/22975,"Commencement on the Pentacrest, The University of Iowa, June 1931","Graduation ceremonies|Academic costume|University of Iowa|United States -- Iowa -- Iowa City|1930-1940|Alumni & alumnae|Crowds|Trees|Universities & colleges|Schaeffer Hall (Iowa City, Iowa)|MacLean Hall (Iowa City, Iowa)|Old Capitol (Iowa City, Iowa)","Schaeffer Hall is on left, MacLean Hall in center, and Old Capitol (with steps visible) on right.","Kent, Frederick W. (Frederick Wallace), 1894-1984",,"The University of Iowa. Libraries. University Archives",1931-06,,"Educational use only, no other permissions given. U.S. and international copyright laws may protect this digital object. Commercial use or distribution of the object is not permitted without prior permission of the copyright holder.","Iowa City Town and Campus Scenes|Frederick W. Kent collection of photographs, 1866-2000|http://www.lib.uiowa.edu/collguides/?RG30.0001.01|Prints|Events and activities|Commencement|Commencement|Scanned with Ricoh Aficio 3228C at 600 ppi, full color. Master images saved in tiff format.",13|18,,"Still image|Photographs|jpeg",RG30.0001.01|https://digital.lib.uiowa.edu/,,,,,,,,,,,,,,,,,,,,,,,,,,,,,,,,,,,,,,,,,,,,,,,,"<a href=""https://digital.lib.uiowa.edu/"" target=""_blank"">View this item in its source respository</a>",,,,,,,,,,,,,,,,,,,,,,,,,,,,,https://www.iowaheritage.org/files/original/f89a7a2d2cde24e05ddd72e35970339f.jpg,"Remote Item","Iowa City Town and Campus Scenes",1,0
22559,https://www.iowaheritage.org/items/show/22559,"Commencement procession on Pentacrest with crowd looking on, The University of Iowa, 1945","Graduation ceremonies|Academic costume|University of Iowa|United States -- Iowa -- Iowa City|1940-1950|Alumni & alumnae|Crowds|Universities & colleges|Calvin Hall (Iowa City, Iowa)|Jessup Hall (Iowa City, Iowa)|MacLean Hall (Iowa City, Iowa)|Pentacrest (Iowa City, Iowa)","Buildings are, from back, Calvin Hall, Jessup Hall, and MacLean Hall.","Kent, Frederick W. (Frederick Wallace), 1894-1984",,"The University of Iowa. Libraries. University Archives",1945,,"Educational use only, no other permissions given. U.S. and international copyright laws may protect this digital object. Commercial use or distribution of the object is not permitted without prior permission of the copyright holder.","Iowa City Town and Campus Scenes|Frederick W. Kent collection of photographs, 1866-2000|http://www.lib.uiowa.edu/collguides/?RG30.0001.01|Prints|Events and activities|Commencement|Commencement|Scanned with Ricoh Aficio 3228C at 600 ppi, full color. Master images saved in tiff format.",12|17,,"Still image|Photographs|jpeg",RG30.0001.01|ea0201.jpg|https://digital.lib.uiowa.edu/,,,,,,,,,,,,,,,,,,,,,,,,,,,,,,,,,,,,,,,,,,,,,,,,"<a href=""https://digital.lib.uiowa.edu/"" target=""_blank"">View this item in its source respository</a>",,,,,,,,,,,,,,,,,,,,,,,,,,,,,https://www.iowaheritage.org/files/original/cca3dc55cd6802cc7067a9a08b6c59f0.jpg,"Remote Item","Iowa City Town and Campus Scenes",1,0
22873,https://www.iowaheritage.org/items/show/22873,"Commencement to the east of Schaeffer Hall, The University of Iowa, June 1922","Graduation ceremonies|Academic costume|University of Iowa|United States -- Iowa -- Iowa City|1920-1930|Alumni & alumnae|Crowds|Universities & colleges|Schaeffer Hall (Iowa City, Iowa)",,"Kent, Frederick W. (Frederick Wallace), 1894-1984",,"The University of Iowa. Libraries. University Archives",1922-06,,"Educational use only, no other permissions given. U.S. and international copyright laws may protect this digital object. Commercial use or distribution of the object is not permitted without prior permission of the copyright holder.","Iowa City Town and Campus Scenes|Frederick W. Kent collection of photographs, 1866-2000|http://www.lib.uiowa.edu/collguides/?RG30.0001.01|Prints|Events and activities|Commencement|Commencement|Scanned with Ricoh Aficio 3228C at 600 ppi, full color. Master images saved in tiff format.",10|17,,"Still image|Photographs|jpeg",RG30.0001.01|https://digital.lib.uiowa.edu/,,,,,,,,,,,,,,,,,,,,,,,,,,,,,,,,,,,,,,,,,,,,,,,,"<a href=""https://digital.lib.uiowa.edu/"" target=""_blank"">View this item in its source respository</a>",,,,,,,,,,,,,,,,,,,,,,,,,,,,,https://www.iowaheritage.org/files/original/b0168730d0f1d9b0235fcff811ba9ca7.jpg,"Remote Item","Iowa City Town and Campus Scenes",1,0
22773,https://www.iowaheritage.org/items/show/22773,"Commencement, The University of Iowa, ca. 1900s","Crowds|University of Iowa|United States -- Iowa -- Iowa City|1900-1910|Graduation ceremonies|Trees|Universities & colleges",,unknown,,"The University of Iowa. Libraries. University Archives",1900/1909,,"Educational use only, no other permissions given. U.S. and international copyright laws may protect this digital object. Commercial use or distribution of the object is not permitted without prior permission of the copyright holder.","Iowa City Town and Campus Scenes|Frederick W. Kent collection of photographs, 1866-2000|http://www.lib.uiowa.edu/collguides/?RG30.0001.01|Prints|Events and activities|Commencement|Commencement|Scanned with Ricoh Aficio 3228C at 600 ppi, full color. Master images saved in tiff format.",10|17,,"Still image|Photographs|jpeg",RG30.0001.01|https://digital.lib.uiowa.edu/,,,,,,,,,,,,,,,,,,,,,,,,,,,,,,,,,,,,,,,,,,,,,,,,"<a href=""https://digital.lib.uiowa.edu/"" target=""_blank"">View this item in its source respository</a>",,,,,,,,,,,,,,,,,,,,,,,,,,,,,https://www.iowaheritage.org/files/original/e63fdb626e225a207267fd3315ef2012.jpg,"Remote Item","Iowa City Town and Campus Scenes",1,0
