 




﻿"Item Id","Item URI","Dublin Core:Title","Dublin Core:Subject","Dublin Core:Description","Dublin Core:Creator","Dublin Core:Source","Dublin Core:Publisher","Dublin Core:Date","Dublin Core:Contributor","Dublin Core:Rights","Dublin Core:Relation","Dublin Core:Format","Dublin Core:Language","Dublin Core:Type","Dublin Core:Identifier","Dublin Core:Coverage","Item Type Metadata:Text","Item Type Metadata:Interviewer","Item Type Metadata:Interviewee","Item Type Metadata:Location","Item Type Metadata:Transcription","Item Type Metadata:Local URL","Item Type Metadata:Original Format","Item Type Metadata:Physical Dimensions","Item Type Metadata:Duration","Item Type Metadata:Compression","Item Type Metadata:Producer","Item Type Metadata:Director","Item Type Metadata:Bit Rate/Frequency","Item Type Metadata:Time Summary","Item Type Metadata:Email Body","Item Type Metadata:Subject Line","Item Type Metadata:From","Item Type Metadata:To","Item Type Metadata:CC","Item Type Metadata:BCC","Item Type Metadata:Number of Attachments","Item Type Metadata:Standards","Item Type Metadata:Objectives","Item Type Metadata:Materials","Item Type Metadata:Lesson Plan Text","Item Type Metadata:URL","Item Type Metadata:Event Type","Item Type Metadata:Participants","Item Type Metadata:Birth Date","Item Type Metadata:Birthplace","Item Type Metadata:Death Date","Item Type Metadata:Occupation","Item Type Metadata:Biographical Text","Item Type Metadata:Bibliography","Item Type Metadata:Digital Reproduction Information","Item Type Metadata:Repository","Item Type Metadata:Repository Collection","Item Type Metadata:Contact information.","Item Type Metadata:File Name","Item Type Metadata:Notes","Item Type Metadata:Digital item created","Item Type Metadata:Digital item modified","Item Type Metadata:Executive Orders","Item Type Metadata:Record Created","Item Type Metadata:Record Modified","Item Type Metadata:Transcription2","Item Type Metadata:Source URL","Omeka Legacy File:Additional Creator","Omeka Legacy File:Transcriber","Omeka Legacy File:Producer","Omeka Legacy File:Render Device","Omeka Legacy File:Render Details","Omeka Legacy File:Capture Date","Omeka Legacy File:Capture Device","Omeka Legacy File:Capture Details","Omeka Legacy File:Change History","Omeka Legacy File:Watermark","Omeka Legacy File:Encryption","Omeka Legacy File:Compression","Omeka Legacy File:Post Processing","Omeka Image File:Width","Omeka Image File:Height","Omeka Image File:Bit Depth","Omeka Image File:Channels","Omeka Image File:Exif String","Omeka Image File:Exif Array","Omeka Image File:IPTC String","Omeka Image File:IPTC Array","Omeka Video File:Bitrate","Omeka Video File:Duration","Omeka Video File:Sample Rate","Omeka Video File:Codec","Omeka Video File:Width","Omeka Video File:Height",tags,file,itemType,collection,public,featured
13581,https://www.iowaheritage.org/items/show/13581,"Dyersville, Iowa. CGW","Railroad stations|Chicago Great Western Railroad Company|United States -- Iowa -- Dubuque County -- Dyersville|1950-1960|Buildings|Carriages & coaches|Railroad signals","Single story depot. Signal next to depot. Cart to right of depot.",unknown,,"University of Iowa. Libraries. Special Collections Dept.",1952-06-28|2005-12-01,,"Educational use only, no other permissions given. U.S. and international copyright laws may protect this digital image. Commercial use or distribution of the image is not permitted without prior permission of the copyright holder. For information see:  http://www.lib.uiowa.edu/spec-coll/help/copyright.html","John P. Vander Maas Railroadiana|John P. Vander Maas Railroadiana Collection|MSC0468|http://lib.uiowa.edu/collguides/?MSC0468|Vol. 42, Depots by county",8|11,,"Still image|Photographs|jpeg",42dyersville01.jpg|169946290|https://digital.lib.uiowa.edu/,,,,,,,,,,,,,,,,,,,,,,,,,,,,,,,,,,,,,,,,,,,,,,,,"<a href=""https://digital.lib.uiowa.edu/"" target=""_blank"">View this item in its source respository</a>",,,,,,,,,,,,,,,,,,,,,,,,,,,,,https://www.iowaheritage.org/files/original/178a62b9267cd7b857eba8aec5212259.jpg,"Remote Item","John P. Vander Maas Railroadiana",1,0
13580,https://www.iowaheritage.org/items/show/13580,"Plat book of Shelby County, Iowa","United States|Iowa|Shelby County|Agriculture and Rural Life","W.W. Hixson & Co.'s 1930 plat book of Shelby County, Iowa, containing a map of the county and township maps showing land ownership",,,"W.W. Hixson & Co.|University of Iowa. Libraries. Map Collection",1930|2007-07-31|2007-08-01,,"Educational use only, no other permissions given. U.S. and international copyright laws may protect this digital object. Commercial use or distribution of the object is not permitted without prior permission of the copyright holder.","Hixson Plat Map Atlases of Iowa","1 atlas : 18 l. ; 21 X 28 cm.",English,"Still image; Text|Atlases; Plat books|jpg","Master image scanned with Ricoh Aficio 3228C as a JPEG. Township maps and covers scanned at 600 ppi. County maps are composites of 300 ppi scans merged with Adobe Photoshop.|173845076|https://digital.lib.uiowa.edu/",,,,,,,,,,,,,,,,,,,,,,,,,,,,,,,,,,,,,,,,,,,,,,,,"<a href=""https://digital.lib.uiowa.edu/"" target=""_blank"">View this item in its source respository</a>",,,,,,,,,,,,,,,,,,,,,,,,,,,,,https://www.iowaheritage.org/files/original/5fdc38eec756ae58b4ccc6670a75514b.jpg,"Remote Item","Hixson Plat Map Atlases of Iowa",1,0
13579,https://www.iowaheritage.org/items/show/13579,"Lakota, Iowa. CRIP","Railroad stations|Chicago, Rock Island & Pacific Rail Road Co.|United States -- Iowa -- Kossuth County -- Lakota|1980-1990|Grain elevators","Grain elevator with signs for Wayne Feeds near tracks.",unknown,,"The University of Iowa Libraries Special Collections: http://www.lib.uiowa.edu/spec-coll/",1982-10-13|2005-12-12,,"Educational use only, no other permissions given. U.S. and international copyright laws may protect this digital image. Commercial use or distribution of the image is not permitted without prior permission of the copyright holder. For information see:  http://www.lib.uiowa.edu/spec-coll/help/copyright.html","John P. Vander Maas Railroadiana|John P. Vander Maas Railroadiana Collection|MSC0468|http://lib.uiowa.edu/collguides/?MSC0468|Vol. 44, Depots by county",8|12,,"Still image|Photographs|jpeg",44lakota01.jpg|169946290|https://digital.lib.uiowa.edu/,,,,,,,,,,,,,,,,,,,,,,,,,,,,,,,,,,,,,,,,,,,,,,,,"<a href=""https://digital.lib.uiowa.edu/"" target=""_blank"">View this item in its source respository</a>",,,,,,,,,,,,,,,,,,,,,,,,,,,,,https://www.iowaheritage.org/files/original/6a052afb249c90a71747dd1b91a23c99.jpg,"Remote Item","John P. Vander Maas Railroadiana",1,0
13578,https://www.iowaheritage.org/items/show/13578,"Plat book of Scott County, Iowa","United States|Iowa|Scott County|Agriculture and Rural Life","W.W. Hixson & Co.'s 1930 plat book of Scott County, Iowa, containing a map of the county and township maps showing land ownership",,,"W.W. Hixson & Co.|University of Iowa. Libraries. Map Collection",1930|2007-07-31|2007-07-31,,"Educational use only, no other permissions given. U.S. and international copyright laws may protect this digital object. Commercial use or distribution of the object is not permitted without prior permission of the copyright holder.","Hixson Plat Map Atlases of Iowa","1 atlas : 18 l. ; 21 X 28 cm.",English,"Still image; Text|Atlases; Plat books|jpg","Master image scanned with Ricoh Aficio 3228C as a JPEG. Township maps and covers scanned at 600 ppi. County maps are composites of 300 ppi scans merged with Adobe Photoshop.|173845076|https://digital.lib.uiowa.edu/",,,,,,,,,,,,,,,,,,,,,,,,,,,,,,,,,,,,,,,,,,,,,,,,"<a href=""https://digital.lib.uiowa.edu/"" target=""_blank"">View this item in its source respository</a>",,,,,,,,,,,,,,,,,,,,,,,,,,,,,https://www.iowaheritage.org/files/original/8e72113494603db9f881ffc1f8a317fd.jpg,"Remote Item","Hixson Plat Map Atlases of Iowa",1,0
13577,https://www.iowaheritage.org/items/show/13577,"Irvington, IA. CNW","Railroad stations|Chicago and North Western Railway Company|United States -- Iowa -- Kossuth County -- Irvington|1980-1990|Buildings|Railroad cars","Sign for Irvington between tracks.  Buildings and train cars.",unknown,,"University of Iowa. Libraries. Special Collections Dept.",1982-10-13|2005-12-12,,"Educational use only, no other permissions given. U.S. and international copyright laws may protect this digital image. Commercial use or distribution of the image is not permitted without prior permission of the copyright holder. For information see:  http://www.lib.uiowa.edu/spec-coll/help/copyright.html","John P. Vander Maas Railroadiana|John P. Vander Maas Railroadiana Collection|MSC0468|http://lib.uiowa.edu/collguides/?MSC0468|Vol. 44, Depots by county",8|12,,"Still image|Photographs|jpeg",44irvington01.jpg|169946290|https://digital.lib.uiowa.edu/,,,,,,,,,,,,,,,,,,,,,,,,,,,,,,,,,,,,,,,,,,,,,,,,"<a href=""https://digital.lib.uiowa.edu/"" target=""_blank"">View this item in its source respository</a>",,,,,,,,,,,,,,,,,,,,,,,,,,,,,https://www.iowaheritage.org/files/original/c3ae094f75342e9c808325b674199ed5.jpg,"Remote Item","John P. Vander Maas Railroadiana",1,0
13576,https://www.iowaheritage.org/items/show/13576,"Plat book of Sac County, Iowa","United States|Iowa|Sac County|Agriculture and Rural Life","W.W. Hixson & Co.'s 1930 plat book of Sac County, Iowa, containing a map of the county and township maps showing land ownership",,,"W.W. Hixson & Co.|University of Iowa. Libraries. Map Collection",1930|2007-07-31|2007-07-31,,"Educational use only, no other permissions given. U.S. and international copyright laws may protect this digital object. Commercial use or distribution of the object is not permitted without prior permission of the copyright holder.","Hixson Plat Map Atlases of Iowa","1 atlas : 18 l. ; 21 X 28 cm.",English,"Still image; Text|Atlases; Plat books|jpg","Master image scanned with Ricoh Aficio 3228C as a JPEG. Township maps and covers scanned at 600 ppi. County maps are composites of 300 ppi scans merged with Adobe Photoshop.|173845076|https://digital.lib.uiowa.edu/",,,,,,,,,,,,,,,,,,,,,,,,,,,,,,,,,,,,,,,,,,,,,,,,"<a href=""https://digital.lib.uiowa.edu/"" target=""_blank"">View this item in its source respository</a>",,,,,,,,,,,,,,,,,,,,,,,,,,,,,https://www.iowaheritage.org/files/original/558d2ad27e1d329dd5b46d54ebbc441c.jpg,"Remote Item","Hixson Plat Map Atlases of Iowa",1,0
13575,https://www.iowaheritage.org/items/show/13575,"Lu Verne, Iowa. MSTL","Railroad stations|Minneapolis & St. Louis Railroad|United States -- Iowa -- Kossuth County -- Lu Verne|Buildings|Carriages & coaches|Railroad signals","Single story wooden depot with cart and little girl on tracks.  Signal attached to roof. Grain elevator in distance. ""Railroad Photos, Basil W. Koob, Box 279, Fort Dodge, Iowa""--Photograph verso.","Koob, Basil W.",,"University of Iowa. Libraries. Special Collections Dept.",Unknown|2005-12-12,,"Educational use only, no other permissions given. U.S. and international copyright laws may protect this digital image. Commercial use or distribution of the image is not permitted without prior permission of the copyright holder. For information see:  http://www.lib.uiowa.edu/spec-coll/help/copyright.html","John P. Vander Maas Railroadiana|John P. Vander Maas Railroadiana Collection|MSC0468|http://lib.uiowa.edu/collguides/?MSC0468|Vol. 44, Depots by county",8|7,,"Still image|Photographs|jpeg",44luverne01.jpg|169946290|https://digital.lib.uiowa.edu/,,,,,,,,,,,,,,,,,,,,,,,,,,,,,,,,,,,,,,,,,,,,,,,,"<a href=""https://digital.lib.uiowa.edu/"" target=""_blank"">View this item in its source respository</a>",,,,,,,,,,,,,,,,,,,,,,,,,,,,,https://www.iowaheritage.org/files/original/1903a0e1db735166666ba48d3d0ea178.jpg,"Remote Item","John P. Vander Maas Railroadiana",1,0
13574,https://www.iowaheritage.org/items/show/13574,"Plat book of Ringgold County, Iowa","United States|Iowa|Ringgold County|Agriculture and Rural Life","W.W. Hixson & Co.'s 1930 plat book of Ringgold County, Iowa, containing a map of the county and township maps showing land ownership",,,"W.W. Hixson & Co.|University of Iowa. Libraries. Map Collection",1930|2007-07-31|2007-07-31,,"Educational use only, no other permissions given. U.S. and international copyright laws may protect this digital object. Commercial use or distribution of the object is not permitted without prior permission of the copyright holder.","Hixson Plat Map Atlases of Iowa","1 atlas : 19 l. ; 21 X 28 cm.",English,"Still image; Text|Atlases; Plat books|jpg","Master image scanned with Ricoh Aficio 3228C as a JPEG. Township maps and covers scanned at 600 ppi. County maps are composites of 300 ppi scans merged with Adobe Photoshop.|173845076|https://digital.lib.uiowa.edu/",,,,,,,,,,,,,,,,,,,,,,,,,,,,,,,,,,,,,,,,,,,,,,,,"<a href=""https://digital.lib.uiowa.edu/"" target=""_blank"">View this item in its source respository</a>",,,,,,,,,,,,,,,,,,,,,,,,,,,,,https://www.iowaheritage.org/files/original/1ad209e904707c450381f4fe195751f9.jpg,"Remote Item","Hixson Plat Map Atlases of Iowa",1,0
13573,https://www.iowaheritage.org/items/show/13573,"Titonka, Iowa. CRIP","Railroad stations|Chicago, Rock Island & Pacific Rail Road Co.|United States -- Iowa -- Kossuth County -- Titonka|1960-1970|Buildings|Automobiles","Two story wooden depot with sign for Titonka, ladder up the side and automobiles parked next to depot.",unknown,,"University of Iowa. Libraries. Special Collections Dept.",1964-08|2005-12-12,,"Educational use only, no other permissions given. U.S. and international copyright laws may protect this digital image. Commercial use or distribution of the image is not permitted without prior permission of the copyright holder. For information see:  http://www.lib.uiowa.edu/spec-coll/help/copyright.html","John P. Vander Maas Railroadiana|John P. Vander Maas Railroadiana Collection|MSC0468|http://lib.uiowa.edu/collguides/?MSC0468|Vol. 44, Depots by county",9|9,,"Still image|Photographs|jpeg",44titonka01.jpg|169946290|https://digital.lib.uiowa.edu/,,,,,,,,,,,,,,,,,,,,,,,,,,,,,,,,,,,,,,,,,,,,,,,,"<a href=""https://digital.lib.uiowa.edu/"" target=""_blank"">View this item in its source respository</a>",,,,,,,,,,,,,,,,,,,,,,,,,,,,,https://www.iowaheritage.org/files/original/de0ee2078b503d01c363bdb478802a95.jpg,"Remote Item","John P. Vander Maas Railroadiana",1,0
13572,https://www.iowaheritage.org/items/show/13572,"Plat book of Poweshiek County, Iowa","United States|Iowa|Poweshiek County|Agriculture and Rural Life","W.W. Hixson & Co.'s 1930 plat book of Poweshiek County, Iowa, containing a map of the county and township maps showing land ownership",,,"W.W. Hixson & Co.|University of Iowa. Libraries. Map Collection",1930|2007-07-31|2007-07-31,,"Educational use only, no other permissions given. U.S. and international copyright laws may protect this digital object. Commercial use or distribution of the object is not permitted without prior permission of the copyright holder.","Hixson Plat Map Atlases of Iowa","1 atlas : 18 l. ; 21 X 28 cm.",English,"Still image; Text|Atlases; Plat books|jpg","Master image scanned with Ricoh Aficio 3228C as a JPEG. Township maps and covers scanned at 600 ppi. County maps are composites of 300 ppi scans merged with Adobe Photoshop.|173845076|https://digital.lib.uiowa.edu/",,,,,,,,,,,,,,,,,,,,,,,,,,,,,,,,,,,,,,,,,,,,,,,,"<a href=""https://digital.lib.uiowa.edu/"" target=""_blank"">View this item in its source respository</a>",,,,,,,,,,,,,,,,,,,,,,,,,,,,,https://www.iowaheritage.org/files/original/b026a3e39ef48329c0e8facfecddd0d2.jpg,"Remote Item","Hixson Plat Map Atlases of Iowa",1,0
