 




﻿"Item Id","Item URI","Dublin Core:Title","Dublin Core:Subject","Dublin Core:Description","Dublin Core:Creator","Dublin Core:Source","Dublin Core:Publisher","Dublin Core:Date","Dublin Core:Contributor","Dublin Core:Rights","Dublin Core:Relation","Dublin Core:Format","Dublin Core:Language","Dublin Core:Type","Dublin Core:Identifier","Dublin Core:Coverage","Item Type Metadata:Text","Item Type Metadata:Interviewer","Item Type Metadata:Interviewee","Item Type Metadata:Location","Item Type Metadata:Transcription","Item Type Metadata:Local URL","Item Type Metadata:Original Format","Item Type Metadata:Physical Dimensions","Item Type Metadata:Duration","Item Type Metadata:Compression","Item Type Metadata:Producer","Item Type Metadata:Director","Item Type Metadata:Bit Rate/Frequency","Item Type Metadata:Time Summary","Item Type Metadata:Email Body","Item Type Metadata:Subject Line","Item Type Metadata:From","Item Type Metadata:To","Item Type Metadata:CC","Item Type Metadata:BCC","Item Type Metadata:Number of Attachments","Item Type Metadata:Standards","Item Type Metadata:Objectives","Item Type Metadata:Materials","Item Type Metadata:Lesson Plan Text","Item Type Metadata:URL","Item Type Metadata:Event Type","Item Type Metadata:Participants","Item Type Metadata:Birth Date","Item Type Metadata:Birthplace","Item Type Metadata:Death Date","Item Type Metadata:Occupation","Item Type Metadata:Biographical Text","Item Type Metadata:Bibliography","Item Type Metadata:Digital Reproduction Information","Item Type Metadata:Repository","Item Type Metadata:Repository Collection","Item Type Metadata:Contact information.","Item Type Metadata:File Name","Item Type Metadata:Notes","Item Type Metadata:Digital item created","Item Type Metadata:Digital item modified","Item Type Metadata:Executive Orders","Item Type Metadata:Record Created","Item Type Metadata:Record Modified","Item Type Metadata:Transcription2","Item Type Metadata:Source URL","Omeka Legacy File:Additional Creator","Omeka Legacy File:Transcriber","Omeka Legacy File:Producer","Omeka Legacy File:Render Device","Omeka Legacy File:Render Details","Omeka Legacy File:Capture Date","Omeka Legacy File:Capture Device","Omeka Legacy File:Capture Details","Omeka Legacy File:Change History","Omeka Legacy File:Watermark","Omeka Legacy File:Encryption","Omeka Legacy File:Compression","Omeka Legacy File:Post Processing","Omeka Image File:Width","Omeka Image File:Height","Omeka Image File:Bit Depth","Omeka Image File:Channels","Omeka Image File:Exif String","Omeka Image File:Exif Array","Omeka Image File:IPTC String","Omeka Image File:IPTC Array","Omeka Video File:Bitrate","Omeka Video File:Duration","Omeka Video File:Sample Rate","Omeka Video File:Codec","Omeka Video File:Width","Omeka Video File:Height",tags,file,itemType,collection,public,featured
13593,https://www.iowaheritage.org/items/show/13593,"Plat book of Warren County, Iowa","United States|Iowa|Warren County|Agriculture and Rural Life","W.W. Hixson & Co.'s 1930 plat book of Warren County, Iowa, containing a map of the county and township maps showing land ownership",,,"W.W. Hixson & Co.|University of Iowa. Libraries. Map Collection",1930|2007-08-07|2007-08-08,,"Educational use only, no other permissions given. U.S. and international copyright laws may protect this digital object. Commercial use or distribution of the object is not permitted without prior permission of the copyright holder.","Hixson Plat Map Atlases of Iowa","1 atlas : 18 l. ; 21 X 28 cm.",English,"Still image; Text|Atlases; Plat books|jpg","Master image scanned with Ricoh Aficio 3228C as a JPEG. Township maps and covers scanned at 600 ppi. County maps are composites of 300 ppi scans merged with Adobe Photoshop.|173845076|https://digital.lib.uiowa.edu/",,,,,,,,,,,,,,,,,,,,,,,,,,,,,,,,,,,,,,,,,,,,,,,,"<a href=""https://digital.lib.uiowa.edu/"" target=""_blank"">View this item in its source respository</a>",,,,,,,,,,,,,,,,,,,,,,,,,,,,,https://www.iowaheritage.org/files/original/d00e980242d1fdb967f89c6204d7df3f.jpg,"Remote Item","Hixson Plat Map Atlases of Iowa",1,0
13595,https://www.iowaheritage.org/items/show/13595,"Plat book of Washington County, Iowa","United States|Iowa|Washington County|Agriculture and Rural Life","W.W. Hixson & Co.'s 1930 plat book of Washington County, Iowa, containing a map of the county and township maps showing land ownership",,,"W.W. Hixson & Co.|University of Iowa. Libraries. Map Collection",1930|2007-08-14|2008-08-14,,"Educational use only, no other permissions given. U.S. and international copyright laws may protect this digital object. Commercial use or distribution of the object is not permitted without prior permission of the copyright holder.","Hixson Plat Map Atlases of Iowa","1 atlas : 18 l. ; 21 X 28 cm.",English,"Still image; Text|Atlases; Plat books|jpg","Master image scanned with Ricoh Aficio 3228C as a JPEG. Township maps and covers scanned at 600 ppi. County maps are composites of 300 ppi scans merged with Adobe Photoshop.|173845076|https://digital.lib.uiowa.edu/",,,,,,,,,,,,,,,,,,,,,,,,,,,,,,,,,,,,,,,,,,,,,,,,"<a href=""https://digital.lib.uiowa.edu/"" target=""_blank"">View this item in its source respository</a>",,,,,,,,,,,,,,,,,,,,,,,,,,,,,https://www.iowaheritage.org/files/original/797001573512c91ea0be2bce469656e5.jpg,"Remote Item","Hixson Plat Map Atlases of Iowa",1,0
13597,https://www.iowaheritage.org/items/show/13597,"Plat book of Wayne County, Iowa","United States|Iowa|Wayne County|Agriculture and Rural Life","W.W. Hixson & Co.'s 1930 plat book of Wayne County, Iowa, containing a map of the county and township maps showing land ownership",,,"W.W. Hixson & Co.|University of Iowa. Libraries. Map Collection",1930|2007-08-14|2008-08-14,,"Educational use only, no other permissions given. U.S. and international copyright laws may protect this digital object. Commercial use or distribution of the object is not permitted without prior permission of the copyright holder.","Hixson Plat Map Atlases of Iowa","1 atlas : 18 l. ; 21 X 28 cm.",English,"Still image; Text|Atlases; Plat books|jpg","Master image scanned with Ricoh Aficio 3228C as a JPEG. Township maps and covers scanned at 600 ppi. County maps are composites of 300 ppi scans merged with Adobe Photoshop.|173845076|https://digital.lib.uiowa.edu/",,,,,,,,,,,,,,,,,,,,,,,,,,,,,,,,,,,,,,,,,,,,,,,,"<a href=""https://digital.lib.uiowa.edu/"" target=""_blank"">View this item in its source respository</a>",,,,,,,,,,,,,,,,,,,,,,,,,,,,,https://www.iowaheritage.org/files/original/1c80bc45bd86d57c99ee491c302bf768.jpg,"Remote Item","Hixson Plat Map Atlases of Iowa",1,0
41084,https://www.iowaheritage.org/items/show/41084,"Plat Book of Wayne County, Iowa","United States|Iowa|Wayne County|1890-1900",,,,"North West Publishing Co.|University of Iowa. Libraries. Map Collection",1897,,"No commercial reproduction or distribution of this file is permitted without permission.","Iowa Counties Historic Atlases",,eng,"Still image; Text|Atlases; Maps; Directories|jp2",168474626|https://digital.lib.uiowa.edu/,,,,,,,,,,,,,,,,,,,,,,,,,,,,,,,,,,,,,,,,,,,,,,,,"<a href=""https://digital.lib.uiowa.edu/"" target=""_blank"">View this item in its source respository</a>",,,,,,,,,,,,,,,,,,,,,,,,,,,,,https://www.iowaheritage.org/files/original/02f2f71689b68452f822a2814f1b2a25.jpg,"Remote Item","Iowa Counties Historic Atlases",1,0
13599,https://www.iowaheritage.org/items/show/13599,"Plat book of Webster County, Iowa","United States|Iowa|Webster County|Agriculture and Rural Life","W.W. Hixson & Co.'s 1930 plat book of Webster County, Iowa, containing a map of the county and township maps showing land ownership",,,"W.W. Hixson & Co.|University of Iowa. Libraries. Map Collection",1930|2007-08-17|2008-08-20,,"Educational use only, no other permissions given. U.S. and international copyright laws may protect this digital object. Commercial use or distribution of the object is not permitted without prior permission of the copyright holder.","Hixson Plat Map Atlases of Iowa","1 atlas : 21 l. ; 21 X 28 cm.",English,"Still image; Text|Atlases; Plat books|jpg","Master image scanned with Ricoh Aficio 3228C as a JPEG. Township maps and covers scanned at 600 ppi. County maps are composites of 300 ppi scans merged with Adobe Photoshop.|173845076|https://digital.lib.uiowa.edu/",,,,,,,,,,,,,,,,,,,,,,,,,,,,,,,,,,,,,,,,,,,,,,,,"<a href=""https://digital.lib.uiowa.edu/"" target=""_blank"">View this item in its source respository</a>",,,,,,,,,,,,,,,,,,,,,,,,,,,,,https://www.iowaheritage.org/files/original/8fb650e0ccca2069a8c3653f62e8197d.jpg,"Remote Item","Hixson Plat Map Atlases of Iowa",1,0
13601,https://www.iowaheritage.org/items/show/13601,"Plat book of Winnebago County, Iowa","United States|Iowa|Winnebago County|Agriculture and Rural Life","W.W. Hixson & Co.'s 1930 plat book of Winnebago County, Iowa, containing a map of the county and township maps showing land ownership",,,"W.W. Hixson & Co.|University of Iowa. Libraries. Map Collection",1930|2007-08-17|208-08-20,,"Educational use only, no other permissions given. U.S. and international copyright laws may protect this digital object. Commercial use or distribution of the object is not permitted without prior permission of the copyright holder.","Hixson Plat Map Atlases of Iowa","1 atlas : 14 l. ; 21 X 28 cm.",English,"Still image; Text|Atlases; Plat books|jpg","Master image scanned with Ricoh Aficio 3228C as a JPEG. Township maps and covers scanned at 600 ppi. County maps are composites of 300 ppi scans merged with Adobe Photoshop.|173845076|https://digital.lib.uiowa.edu/",,,,,,,,,,,,,,,,,,,,,,,,,,,,,,,,,,,,,,,,,,,,,,,,"<a href=""https://digital.lib.uiowa.edu/"" target=""_blank"">View this item in its source respository</a>",,,,,,,,,,,,,,,,,,,,,,,,,,,,,https://www.iowaheritage.org/files/original/1878a175879ecb40c487b1ecef5a2786.jpg,"Remote Item","Hixson Plat Map Atlases of Iowa",1,0
13603,https://www.iowaheritage.org/items/show/13603,"Plat book of Winneshiek County, Iowa","United States|Iowa|Winneshiek County|Agriculture and Rural Life","W.W. Hixson & Co.'s 1930 plat book of Winneshiek County, Iowa, containing a map of the county and township maps showing land ownership",,,"W.W. Hixson & Co.|University of Iowa. Libraries. Map Collection",1930|2007-08-21|2008-08-21,,"Educational use only, no other permissions given. U.S. and international copyright laws may protect this digital object. Commercial use or distribution of the object is not permitted without prior permission of the copyright holder.","Hixson Plat Map Atlases of Iowa","1 atlas : 22 l. ; 21 X 28 cm.",English,"Still image; Text|Atlases; Plat books|jpg","Master image scanned with Ricoh Aficio 3228C as a JPEG. Township maps and covers scanned at 600 ppi. County maps are composites of 300 ppi scans merged with Adobe Photoshop.|173845076|https://digital.lib.uiowa.edu/",,,,,,,,,,,,,,,,,,,,,,,,,,,,,,,,,,,,,,,,,,,,,,,,"<a href=""https://digital.lib.uiowa.edu/"" target=""_blank"">View this item in its source respository</a>",,,,,,,,,,,,,,,,,,,,,,,,,,,,,https://www.iowaheritage.org/files/original/68402815b1b837ab2cf2b51b4bce185b.jpg,"Remote Item","Hixson Plat Map Atlases of Iowa",1,0
41121,https://www.iowaheritage.org/items/show/41121,"Plat book of Winneshiek County, Iowa","United States|Iowa|Winneshiek County|1880-1890","Warner & Foote's 1886 Plat book of Winneshiek County, Iowa|300 feet = 1 inch",,,"Warner & Foote|University of Iowa. Libraries. Map Collection",1886,,"No commercial reproduction or distribution of this file is permitted No commercial reproduction or distribution of this file is permitted without permission.","Iowa Counties Historic Atlases",,English,"Still image; Text|Atlases",168474626|https://digital.lib.uiowa.edu/,,,,,,,,,,,,,,,,,,,,,,,,,,,,,,,,,,,,,,,,,,,,,,,,"<a href=""https://digital.lib.uiowa.edu/"" target=""_blank"">View this item in its source respository</a>",,,,,,,,,,,,,,,,,,,,,,,,,,,,,https://www.iowaheritage.org/files/original/d716d769d7b63c491cf02165777fb959.jpg,"Remote Item","Iowa Counties Historic Atlases",1,0
13605,https://www.iowaheritage.org/items/show/13605,"Plat book of Woodbury County, Iowa","United States|Iowa|Woodbury County|Agriculture and Rural Life","W.W. Hixson & Co.'s 1930 plat book of Woodbury County, Iowa, containing a map of the county and township maps showing land ownership",,,"W.W. Hixson & Co.|University of Iowa. Libraries. Map Collection",1930|2007-08-21|2008-08-21,,"Educational use only, no other permissions given. U.S. and international copyright laws may protect this digital object. Commercial use or distribution of the object is not permitted without prior permission of the copyright holder.","Hixson Plat Map Atlases of Iowa","1 atlas : 22 l. ; 21 X 28 cm.",English,"Still image; Text|Atlases; Plat books|jpg","Master image scanned with Ricoh Aficio 3228C as a JPEG. Township maps and covers scanned at 600 ppi. County maps are composites of 300 ppi scans merged with Adobe Photoshop.|173845076|https://digital.lib.uiowa.edu/",,,,,,,,,,,,,,,,,,,,,,,,,,,,,,,,,,,,,,,,,,,,,,,,"<a href=""https://digital.lib.uiowa.edu/"" target=""_blank"">View this item in its source respository</a>",,,,,,,,,,,,,,,,,,,,,,,,,,,,,https://www.iowaheritage.org/files/original/159d408013bf2fd67f8e4fc97a6bcef1.jpg,"Remote Item","Hixson Plat Map Atlases of Iowa",1,0
13607,https://www.iowaheritage.org/items/show/13607,"Plat book of Worth County, Iowa","United States|Iowa|Worth County|Agriculture and Rural Life","W.W. Hixson & Co.'s 1930 plat book of Worth County, Iowa, containing a map of the county and township maps showing land ownership",,,"W.W. Hixson & Co.|University of Iowa. Libraries. Map Collection",1930|2007-08-23|2007-08-23,,"Educational use only, no other permissions given. U.S. and international copyright laws may protect this digital object. Commercial use or distribution of the object is not permitted without prior permission of the copyright holder.","Hixson Plat Map Atlases of Iowa","1 atlas : 14 l. ; 21 X 28 cm.",English,"Still image; Text|Atlases; Plat books|jpg","Master image scanned with Ricoh Aficio 3228C as a JPEG. Township maps and covers scanned at 600 ppi. County maps are composites of 300 ppi scans merged with Adobe Photoshop.|173845076|https://digital.lib.uiowa.edu/",,,,,,,,,,,,,,,,,,,,,,,,,,,,,,,,,,,,,,,,,,,,,,,,"<a href=""https://digital.lib.uiowa.edu/"" target=""_blank"">View this item in its source respository</a>",,,,,,,,,,,,,,,,,,,,,,,,,,,,,https://www.iowaheritage.org/files/original/e3974d341da700208b8c96df35e9cfc4.jpg,"Remote Item","Hixson Plat Map Atlases of Iowa",1,0
