 




﻿"Item Id","Item URI","Dublin Core:Title","Dublin Core:Subject","Dublin Core:Description","Dublin Core:Creator","Dublin Core:Source","Dublin Core:Publisher","Dublin Core:Date","Dublin Core:Contributor","Dublin Core:Rights","Dublin Core:Relation","Dublin Core:Format","Dublin Core:Language","Dublin Core:Type","Dublin Core:Identifier","Dublin Core:Coverage","Item Type Metadata:Text","Item Type Metadata:Interviewer","Item Type Metadata:Interviewee","Item Type Metadata:Location","Item Type Metadata:Transcription","Item Type Metadata:Local URL","Item Type Metadata:Original Format","Item Type Metadata:Physical Dimensions","Item Type Metadata:Duration","Item Type Metadata:Compression","Item Type Metadata:Producer","Item Type Metadata:Director","Item Type Metadata:Bit Rate/Frequency","Item Type Metadata:Time Summary","Item Type Metadata:Email Body","Item Type Metadata:Subject Line","Item Type Metadata:From","Item Type Metadata:To","Item Type Metadata:CC","Item Type Metadata:BCC","Item Type Metadata:Number of Attachments","Item Type Metadata:Standards","Item Type Metadata:Objectives","Item Type Metadata:Materials","Item Type Metadata:Lesson Plan Text","Item Type Metadata:URL","Item Type Metadata:Event Type","Item Type Metadata:Participants","Item Type Metadata:Birth Date","Item Type Metadata:Birthplace","Item Type Metadata:Death Date","Item Type Metadata:Occupation","Item Type Metadata:Biographical Text","Item Type Metadata:Bibliography","Item Type Metadata:Digital Reproduction Information","Item Type Metadata:Repository","Item Type Metadata:Repository Collection","Item Type Metadata:Contact information.","Item Type Metadata:File Name","Item Type Metadata:Notes","Item Type Metadata:Digital item created","Item Type Metadata:Digital item modified","Item Type Metadata:Executive Orders","Item Type Metadata:Record Created","Item Type Metadata:Record Modified","Item Type Metadata:Transcription2","Item Type Metadata:Source URL","Omeka Legacy File:Additional Creator","Omeka Legacy File:Transcriber","Omeka Legacy File:Producer","Omeka Legacy File:Render Device","Omeka Legacy File:Render Details","Omeka Legacy File:Capture Date","Omeka Legacy File:Capture Device","Omeka Legacy File:Capture Details","Omeka Legacy File:Change History","Omeka Legacy File:Watermark","Omeka Legacy File:Encryption","Omeka Legacy File:Compression","Omeka Legacy File:Post Processing","Omeka Image File:Width","Omeka Image File:Height","Omeka Image File:Bit Depth","Omeka Image File:Channels","Omeka Image File:Exif String","Omeka Image File:Exif Array","Omeka Image File:IPTC String","Omeka Image File:IPTC Array","Omeka Video File:Bitrate","Omeka Video File:Duration","Omeka Video File:Sample Rate","Omeka Video File:Codec","Omeka Video File:Width","Omeka Video File:Height",tags,file,itemType,collection,public,featured
99258,https://www.iowaheritage.org/items/show/99258,"Wayne Meyer with chopped forage, 1967","Jackson County Soil and Water Conservation District|Chopped forage|Wayne Meyer","B&W photograph of Wayne Meyer hauling chopped forage from his contour strips. ","Jackson County Soil and Water Conservation District ",,"State Library of Iowa",1967,"Jackson County Soil and Water Conservation District of Iowa. For questions about copyright, contact the State Library of Iowa at  <a href=""http://www.statelibraryofiowa.org"">http://www.statelibraryofiowa.org</a>.","This item is protected by copyright and/or related rights. Your are free to use this Item in any way that is permitted by the copyright and related rights legislation that applies to your use. For other uses you need to obtain permission from the rights-holder(s). <a href=""http://rightsstatements.org/"">http://rightsstatements.org</a>",,jpg,,"Still Image; Photograph",,,,,,,,,,,,,,,,,,,,,,,,,,,,,,,,,,,,,,,,,Jackson_1967_chopped_Forage_On_Wayne_Meyer_Farm_20191218_001|Jackson_1967_chopped_Forage_On_Wayne_Meyer_Farm_20191218_002,,,,,,,,,,,,,,,,,,,,,,,,,,,,,,,,,,,,"Chopped forage,Contour Strips,Jackson County Soil and Water Conservation District,Wayne Meyer","https://www.iowaheritage.org/files/original/a49cd44350db8a419d5293c2447a2013.jpg,https://www.iowaheritage.org/files/original/7eb667f9f5ce7c8c0c5d25c1de927ee8.jpg","Still Image","Jackson County Soil and Water Conservation District Historic Collection",1,0
99276,https://www.iowaheritage.org/items/show/99276,"Wayne Meyer's dairy herd, 1967","Jackson County Soil and Water Conservation District|Livestock|Wayne Meyer","B&W photograph of Wayne Meyer's dairy herd on permanent pasture land.","Jackson County Soil and Water Conservation District ",,"State Library of Iowa",1967,"Jackson County Soil and Water Conservation District of Iowa. For questions about copyright, contact the State Library of Iowa at  <a href=""http://www.statelibraryofiowa.org"">http://www.statelibraryofiowa.org</a>.","This item is protected by copyright and/or related rights. Your are free to use this Item in any way that is permitted by the copyright and related rights legislation that applies to your use. For other uses you need to obtain permission from the rights-holder(s). <a href=""http://rightsstatements.org/"">http://rightsstatements.org</a>",,jpg,,"Still Image; Photograph",,,,,,,,,,,,,,,,,,,,,,,,,,,,,,,,,,,,,,,,,Jackson_1967_Wayne_Meyers_Dairy_Herd_20191218_001|Jackson_1967_Wayne_Meyers_Dairy_Herd_20191218_002,,,,,,,,,,,,,,,,,,,,,,,,,,,,,,,,,,,,"Dairy Cows,Jackson County Soil and Water Conservation District,Livestock,Pasture,Wayne Meyer","https://www.iowaheritage.org/files/original/8584a21d32a8b68360d6a2f525325eb2.jpg,https://www.iowaheritage.org/files/original/b290570f2c47f7ff86f6705fb61485e9.jpg","Still Image","Jackson County Soil and Water Conservation District Historic Collection",1,0
99287,https://www.iowaheritage.org/items/show/99287,"Weiland Bros. farm, 1968","Jackson County Soil and Water Conservation District|Terraces|Pond","B&W photograph of Frank Weiland and Roger Hansen standing in tall grass with pond and terraces in background.","Jackson County Soil and Water Conservation District ",,"State Library of Iowa",1968-08,"Jackson County Soil and Water Conservation District of Iowa. For questions about copyright, contact the State Library of Iowa at  <a href=""http://www.statelibraryofiowa.org"">http://www.statelibraryofiowa.org</a>.","This item is protected by copyright and/or related rights. Your are free to use this Item in any way that is permitted by the copyright and related rights legislation that applies to your use. For other uses you need to obtain permission from the rights-holder(s). <a href=""http://rightsstatements.org/"">http://rightsstatements.org</a>",,jpg,,"Still Image; Photograph",,,,,,,,,,,,,,,,,,,,,,,,,,,,,,,,,,,,,,,,,Jackson_Aug_1968_Terrace_&_Pond_Weiland_Bros_Frank_&_Roger_20191218_001|Jackson_Aug_1968_Terrace_&_Pond_Weiland_Bros_Frank_&_Roger_20191218_002,,,,,,,,,,,,,,,,,,,,,,,,,,,,,,,,,,,,"Frank Weiland,Jackson County Soil and Water Conservation District,Pond,Roger Hansen,Terraces,Weiland Brothers Farm,Weiland Farm","https://www.iowaheritage.org/files/original/8d3ac836327ce924b74261b813079016.jpg,https://www.iowaheritage.org/files/original/6a778ddd7a0a6ffd5fedb31fb79868af.jpg","Still Image","Jackson County Soil and Water Conservation District Historic Collection",1,0
99299,https://www.iowaheritage.org/items/show/99299,"Weiland Bros. pond under construction, 1966","Jackson County Soil and Water Conservation District|Farm Pond|Weiland Bros.","B&W photograph of Weiland Bros. pond under construction.","Jackson County Soil and Water Conservation District ",,"State Library of Iowa",1966,"Jackson County Soil and Water Conservation District of Iowa. For questions about copyright, contact the State Library of Iowa at  <a href=""http://www.statelibraryofiowa.org"">http://www.statelibraryofiowa.org</a>.","This item is protected by copyright and/or related rights. Your are free to use this Item in any way that is permitted by the copyright and related rights legislation that applies to your use. For other uses you need to obtain permission from the rights-holder(s). <a href=""http://rightsstatements.org/"">http://rightsstatements.org</a>",,jpg,,"Still Image; Photograph",,,,,,,,,,,,,,,,,,,,,,,,,,,,,,,,,,,,,,,,,Jackson_June_1966_Weiland_Bros_Pond_Under_Construction_20191218_001|Jackson_June_1966_Weiland_Bros_Pond_Under_Construction_20191218_002,,,,,,,,,,,,,,,,,,,,,,,,,,,,,,,,,,,,"Farm Pond,Jackson County Soil and Water Conservation District,Pond,Weiland Bros.","https://www.iowaheritage.org/files/original/ad972391928aaf7de34a5701361e8a80.jpg,https://www.iowaheritage.org/files/original/01bfd90cce704ace96b3a44e7173995c.jpg","Still Image","Jackson County Soil and Water Conservation District Historic Collection",1,0
99317,https://www.iowaheritage.org/items/show/99317,"Weiland Bros. waterway after reshaping","Jackson County Soil and Water Conservation District|Waterway|Weiland Bros.","B&W photograph of unidentified man observing waterway after reshaping on Weiland Bros. land.","Jackson County Soil and Water Conservation District ",,"State Library of Iowa",Unknown,"Jackson County Soil and Water Conservation District of Iowa. For questions about copyright, contact the State Library of Iowa at  <a href=""http://www.statelibraryofiowa.org"">http://www.statelibraryofiowa.org</a>.","This item is protected by copyright and/or related rights. Your are free to use this Item in any way that is permitted by the copyright and related rights legislation that applies to your use. For other uses you need to obtain permission from the rights-holder(s). <a href=""http://rightsstatements.org/"">http://rightsstatements.org</a>",,,,"jpg|Still Image; Photograph",,,,,,,,,,,,,,,,,,,,,,,,,,,,,,,,,,,,,,,,,Jackson_Weiland_Bros_After_Reshaping_For_Seeding_Pic_2_of_3_20191218_001|Jackson_Weiland_Bros_After_Reshaping_For_Seeding_Pic_2_of_3_20191218_002,,,,,,,,,,,,,,,,,,,,,,,,,,,,,,,,,,,,"Erosion Control,Jackson County Soil and Water Conservation District,Waterway,Weiland Bros.","https://www.iowaheritage.org/files/original/bb35df56b7ad655cca6eb7ebd1db5296.jpg,https://www.iowaheritage.org/files/original/0b30033cd0a41dd67dae0baa40dca76a.jpg","Still Image","Jackson County Soil and Water Conservation District Historic Collection",1,0
99318,https://www.iowaheritage.org/items/show/99318,"Weiland Bros. waterway after seeding","Jackson County Soil and Water Conservation District|Waterway|Weiland Bros.","B&W photograph of Weiland Bros. waterway after seeding.","Jackson County Soil and Water Conservation District ",,"State Library of Iowa","Circa 1961","Jackson County Soil and Water Conservation District of Iowa. For questions about copyright, contact the State Library of Iowa at  <a href=""http://www.statelibraryofiowa.org"">http://www.statelibraryofiowa.org</a>.","This item is protected by copyright and/or related rights. Your are free to use this Item in any way that is permitted by the copyright and related rights legislation that applies to your use. For other uses you need to obtain permission from the rights-holder(s). <a href=""http://rightsstatements.org/"">http://rightsstatements.org</a>",,,,"jpg|Still Image; Photograph",,,,,,,,,,,,,,,,,,,,,,,,,,,,,,,,,,,,,,,,,Jackson_Weiland_Bros_After_Seeding_About_1961_Pic_3_Of_3_20191218_001|Jackson_Weiland_Bros_After_Seeding_About_1961_Pic_3_Of_3_20191218_002,,,,,,,,,,,,,,,,,,,,,,,,,,,,,,,,,,,,"Grass Waterway,Jackson County Soil and Water Conservation District,Seeding,Waterway,Weiland Bros.","https://www.iowaheritage.org/files/original/a50e2ce1b0705f616bd1559d40ea04d4.jpg,https://www.iowaheritage.org/files/original/a2ac02e2f7be700c51c8e83e9046436d.jpg","Still Image","Jackson County Soil and Water Conservation District Historic Collection",1,0
99251,https://www.iowaheritage.org/items/show/99251,"Weiland Brothers contour plowing, 1965","Jackson County Soil and Water Conservation District|Contour Plowing|Weiland Bros.","B&W photograph of Jim (front) and Frank on tractors plowing their contour field. ","Jackson County Soil and Water Conservation District ",,"State Library of Iowa",1965,"Jackson County Soil and Water Conservation District of Iowa. For questions about copyright, contact the State Library of Iowa at  <a href=""http://www.statelibraryofiowa.org"">http://www.statelibraryofiowa.org</a>.","This item is protected by copyright and/or related rights. Your are free to use this Item in any way that is permitted by the copyright and related rights legislation that applies to your use. For other uses you need to obtain permission from the rights-holder(s). <a href=""http://rightsstatements.org/"">http://rightsstatements.org</a>",,jpg,,"Still Image; Photograph",,,,,,,,,,,,,,,,,,,,,,,,,,,,,,,,,,,,,,,,,Jackson_1965_Weiland_Bros_Contour_Plowing_Jim_Front_Frank_Behind20191218_001|Jackson_1965_Weiland_Bros_Contour_Plowing_Jim_Front_Frank_Behind20191218_002,,,,,,,,,,,,,,,,,,,,,,,,,,,,,,,,,,,,"Contour Plowing,Frank Weiland,Jackson County Soil and Water Conservation District,Jim Weiland,Weiland Bros.","https://www.iowaheritage.org/files/original/dac5fd4b9d40e2265e333e910ae08346.jpg,https://www.iowaheritage.org/files/original/1323f9f252f00be013e427248fee3b4f.jpg","Still Image","Jackson County Soil and Water Conservation District Historic Collection",1,0
99080,https://www.iowaheritage.org/items/show/99080,"Weiland Brothers farm, 1960s","Jackson County Soil and Water Conservation District|Weir Notch","B&W photograph of unidentified man standing next to weir notch on Weilland Brothers farm.","Jackson County Soil and Water Conservation District ",,"State Library of Iowa","circa 1960","Jackson County Soil and Water Conservation District of Iowa. For questions about copyright, contact the State Library of Iowa at  <a href=""http://www.statelibraryofiowa.org"">http://www.statelibraryofiowa.org</a>.","This item is protected by copyright and/or related rights. Your are free to use this Item in any way that is permitted by the copyright and related rights legislation that applies to your use. For other uses you need to obtain permission from the rights-holder(s). <a href=""http://rightsstatements.org/"">http://rightsstatements.org</a>",,jpg,,"Still Image; Photograph",,,,,,,,,,,,,,,,,,,,,,,,,,,,,,,,,,,,,,,,,Jackson_1960_OR_1961_Weiland_Bros_Farm_20191218_001|Jackson_1960_OR_1961_Weiland_Bros_Farm_20191218_002,,,,,,,,,,,,,,,,,,,,,,,,,,,,,,,,,,,,"Jackson County Soil and Water Conservation District,Weiland Brothers Farm,Weir Notch","https://www.iowaheritage.org/files/original/298ba1ce191ff8dfb5a4aec82056172f.jpg,https://www.iowaheritage.org/files/original/3d8f546e9c895ba27e531ab3b037ff1c.jpg","Still Image","Jackson County Soil and Water Conservation District Historic Collection",1,0
100286,https://www.iowaheritage.org/items/show/100286,"Wesley Behn, 1999","Jackson County Soil and Water Conservation District","Color image of pond on Wesley Behn farm. ","Jackson County Soil and Water Conservation District ",,"State Library of Iowa",1999,"Jackson County Soil and Water Conservation District of Iowa. For questions about copyright, contact the State Library of Iowa at  <a href=""http://www.statelibraryofiowa.org"">http://www.statelibraryofiowa.org</a>.","This item is protected by copyright and/or related rights. Your are free to use this Item in any way that is permitted by the copyright and related rights legislation that applies to your use. For other uses you need to obtain permission from the rights-holder(s). <a href=""http://rightsstatements.org/"">http://rightsstatements.org</a>",,jpg,,"Still Image; Photograph",,,,,,,,,,,,,,,,,,,,,,,,,,,,,,,,,,,,,,,,,Jackson_SWCD_Wesley_Behn_043|Jackson_SWCD_Wesley_Behn_044,,,,,,,,,,,,,,,,,,,,,,,,,,,,,,,,,,,,"Jackson County Soil and Water Conservation District,Pond,Wesley Behn","https://www.iowaheritage.org/files/original/f080469602ab63de16e81f5a1c7f4aec.jpg,https://www.iowaheritage.org/files/original/af9364ec84227e4c38fc58cb91e49f93.jpg","Still Image","Jackson County Soil and Water Conservation District Historic Collection",1,0
99319,https://www.iowaheritage.org/items/show/99319,"Wilson Bros. land in winter","Jackson County Soil and Water Conservation District|Agriculture|Wilson Bros.","B&W photograph of Wilson Bros. cropland covered in snow.","Jackson County Soil and Water Conservation District ",,"State Library of Iowa",Unknown,"Jackson County Soil and Water Conservation District of Iowa. For questions about copyright, contact the State Library of Iowa at  <a href=""http://www.statelibraryofiowa.org"">http://www.statelibraryofiowa.org</a>.","This item is protected by copyright and/or related rights. Your are free to use this Item in any way that is permitted by the copyright and related rights legislation that applies to your use. For other uses you need to obtain permission from the rights-holder(s). <a href=""http://rightsstatements.org/"">http://rightsstatements.org</a>",,,,"jpg|Still Image; Photograph",,,,,,,,,,,,,,,,,,,,,,,,,,,,,,,,,,,,,,,,,Jackson_Wilson_Bros_Land_20191218_001,,,,,,,,,,,,,,,,,,,,,,,,,,,,,,,,,,,,"Agriculture,Jackson County Soil and Water Conservation District,Snow,Wilson Bros.,Winter",https://www.iowaheritage.org/files/original/eb64c55a33b555c17639137cbcec02ff.jpg,"Still Image","Jackson County Soil and Water Conservation District Historic Collection",1,0
