 




﻿"Item Id","Item URI","Dublin Core:Title","Dublin Core:Subject","Dublin Core:Description","Dublin Core:Creator","Dublin Core:Source","Dublin Core:Publisher","Dublin Core:Date","Dublin Core:Contributor","Dublin Core:Rights","Dublin Core:Relation","Dublin Core:Format","Dublin Core:Language","Dublin Core:Type","Dublin Core:Identifier","Dublin Core:Coverage","Item Type Metadata:Text","Item Type Metadata:Interviewer","Item Type Metadata:Interviewee","Item Type Metadata:Location","Item Type Metadata:Transcription","Item Type Metadata:Local URL","Item Type Metadata:Original Format","Item Type Metadata:Physical Dimensions","Item Type Metadata:Duration","Item Type Metadata:Compression","Item Type Metadata:Producer","Item Type Metadata:Director","Item Type Metadata:Bit Rate/Frequency","Item Type Metadata:Time Summary","Item Type Metadata:Email Body","Item Type Metadata:Subject Line","Item Type Metadata:From","Item Type Metadata:To","Item Type Metadata:CC","Item Type Metadata:BCC","Item Type Metadata:Number of Attachments","Item Type Metadata:Standards","Item Type Metadata:Objectives","Item Type Metadata:Materials","Item Type Metadata:Lesson Plan Text","Item Type Metadata:URL","Item Type Metadata:Event Type","Item Type Metadata:Participants","Item Type Metadata:Birth Date","Item Type Metadata:Birthplace","Item Type Metadata:Death Date","Item Type Metadata:Occupation","Item Type Metadata:Biographical Text","Item Type Metadata:Bibliography","Item Type Metadata:Digital Reproduction Information","Item Type Metadata:Repository","Item Type Metadata:Repository Collection","Item Type Metadata:Contact information.","Item Type Metadata:File Name","Item Type Metadata:Notes","Item Type Metadata:Digital item created","Item Type Metadata:Digital item modified","Item Type Metadata:Executive Orders","Item Type Metadata:Record Created","Item Type Metadata:Record Modified","Item Type Metadata:Transcription2","Item Type Metadata:Source URL","Omeka Legacy File:Additional Creator","Omeka Legacy File:Transcriber","Omeka Legacy File:Producer","Omeka Legacy File:Render Device","Omeka Legacy File:Render Details","Omeka Legacy File:Capture Date","Omeka Legacy File:Capture Device","Omeka Legacy File:Capture Details","Omeka Legacy File:Change History","Omeka Legacy File:Watermark","Omeka Legacy File:Encryption","Omeka Legacy File:Compression","Omeka Legacy File:Post Processing","Omeka Image File:Width","Omeka Image File:Height","Omeka Image File:Bit Depth","Omeka Image File:Channels","Omeka Image File:Exif String","Omeka Image File:Exif Array","Omeka Image File:IPTC String","Omeka Image File:IPTC Array","Omeka Video File:Bitrate","Omeka Video File:Duration","Omeka Video File:Sample Rate","Omeka Video File:Codec","Omeka Video File:Width","Omeka Video File:Height",tags,file,itemType,collection,public,featured
22567,https://www.iowaheritage.org/items/show/22567,"Convocation with University officials and band at the west steps of Old Capitol, The University of Iowa, 1930s","Rites & ceremonies|Academic costume|University of Iowa|United States -- Iowa -- Iowa City|1930-1940|Graduation ceremonies|Crowds|Bands|Musical instruments|Universities & colleges|Old Capitol (Iowa City, Iowa)",,"Kent, Frederick W. (Frederick Wallace), 1894-1984",,"The University of Iowa. Libraries. University Archives",1930/1939|2008-05,,"Educational use only, no other permissions given. U.S. and international copyright laws may protect this digital object. Commercial use or distribution of the object is not permitted without prior permission of the copyright holder.","Iowa City Town and Campus Scenes|Frederick W. Kent collection of photographs, 1866-2000|http://www.lib.uiowa.edu/collguides/?RG30.0001.01|Prints|Events and activities|Convocation|Convocation|Scanned with Ricoh Aficio 3228C at 600 ppi, full color. Master images saved in tiff format.",11|17,,"Still image|Photographs|jpeg",RG30.0001.01|ea0222.jpg|https://digital.lib.uiowa.edu/,,,,,,,,,,,,,,,,,,,,,,,,,,,,,,,,,,,,,,,,,,,,,,,,"<a href=""https://digital.lib.uiowa.edu/"" target=""_blank"">View this item in its source respository</a>",,,,,,,,,,,,,,,,,,,,,,,,,,,,,https://www.iowaheritage.org/files/original/64e8565d4b5664da57dd288bcf145764.jpg,"Remote Item","Iowa City Town and Campus Scenes",1,0
22565,https://www.iowaheritage.org/items/show/22565,"Crowd gathered for convocation at west side of Old Capitol, The University of Iowa, 1930s","Crowds|University of Iowa|United States -- Iowa -- Iowa City|1930-1940|Rites & ceremonies|Graduation ceremonies|Universities & colleges|Old Capitol (Iowa City, Iowa)|Jessup Hall (Iowa City, Iowa)|Halsey Hall (Iowa City, Iowa)","Jessup Hall in near background with Halsey Hall in far background.","Kent, Frederick W. (Frederick Wallace), 1894-1984",,"The University of Iowa. Libraries. University Archives",1930/1939|2008-05,,"Educational use only, no other permissions given. U.S. and international copyright laws may protect this digital object. Commercial use or distribution of the object is not permitted without prior permission of the copyright holder.","Iowa City Town and Campus Scenes|Frederick W. Kent collection of photographs, 1866-2000|http://www.lib.uiowa.edu/collguides/?RG30.0001.01|Prints|Events and activities|Convocation|Convocation|Scanned with Ricoh Aficio 3228C at 600 ppi, full color. Master images saved in tiff format.",11|17,,"Still image|Photographs|jpeg",RG30.0001.01|ea0221.jpg|https://digital.lib.uiowa.edu/,,,,,,,,,,,,,,,,,,,,,,,,,,,,,,,,,,,,,,,,,,,,,,,,"<a href=""https://digital.lib.uiowa.edu/"" target=""_blank"">View this item in its source respository</a>",,,,,,,,,,,,,,,,,,,,,,,,,,,,,https://www.iowaheritage.org/files/original/7612cf39949cc20b422fcb5f3edc2d51.jpg,"Remote Item","Iowa City Town and Campus Scenes",1,0
22541,https://www.iowaheritage.org/items/show/22541,"Commencement procession crossing Iowa Avenue bridge and heading west on walking trail, The University of Iowa, June 1932","Graduation ceremonies|Academic costume|University of Iowa|United States -- Iowa -- Iowa City|1930-1940|Alumni & alumnae|Bridges|Trails & paths|Universities & colleges|Jessup Hall (Iowa City, Iowa)|Old Capitol (Iowa City, Iowa)|MacLean Hall (Iowa City, Iowa)","Buildings in background are, from left, Jessup Hall, Old Capitol, and MacLean Hall.","Kent, Frederick W. (Frederick Wallace), 1894-1984",,"The University of Iowa. Libraries. University Archives",1932-06,,"Educational use only, no other permissions given. U.S. and international copyright laws may protect this digital object. Commercial use or distribution of the object is not permitted without prior permission of the copyright holder.","Iowa City Town and Campus Scenes|Frederick W. Kent collection of photographs, 1866-2000|http://www.lib.uiowa.edu/collguides/?RG30.0001.01|Prints|Events and activities|Commencement|Commencement|Scanned with Ricoh Aficio 3228C at 600 ppi, full color. Master images saved in tiff format.",13|18,,"Still image|Photographs|jpeg",RG30.0001.01|ea0188.jpg|https://digital.lib.uiowa.edu/,,,,,,,,,,,,,,,,,,,,,,,,,,,,,,,,,,,,,,,,,,,,,,,,"<a href=""https://digital.lib.uiowa.edu/"" target=""_blank"">View this item in its source respository</a>",,,,,,,,,,,,,,,,,,,,,,,,,,,,,https://www.iowaheritage.org/files/original/c40ca08fda233d05b599222ea47a48fb.jpg,"Remote Item","Iowa City Town and Campus Scenes",1,0
22528,https://www.iowaheritage.org/items/show/22528,"Commencement procession walking west on Iowa Avenue with Pentacrest in background, The University of Iowa, June 1929","Graduation ceremonies|Academic costume|University of Iowa|United States -- Iowa -- Iowa City|1920-1930|Alumni & alumnae|Automobiles|Street lights|Universities & colleges|Jessup Hall (Iowa City, Iowa)|Old Capitol (Iowa City, Iowa)|MacLean Hall (Iowa City, Iowa)","Buildings, from left, are Jessup Hall, Old Capitol, MacLean Hall.  Open field on left is now Hubbard Park.","Kent, Frederick W. (Frederick Wallace), 1894-1984",,"The University of Iowa. Libraries. University Archives",1929-06,,"Educational use only, no other permissions given. U.S. and international copyright laws may protect this digital object. Commercial use or distribution of the object is not permitted without prior permission of the copyright holder.","Iowa City Town and Campus Scenes|Frederick W. Kent collection of photographs, 1866-2000|http://www.lib.uiowa.edu/collguides/?RG30.0001.01|Prints|Events and activities|Commencement|Commencement|Scanned with Ricoh Aficio 3228C at 600 ppi, full color. Master images saved in tiff format.",13|18,,"Still image|Photographs|jpeg",RG30.0001.01|ea0172.jpg|https://digital.lib.uiowa.edu/,,,,,,,,,,,,,,,,,,,,,,,,,,,,,,,,,,,,,,,,,,,,,,,,"<a href=""https://digital.lib.uiowa.edu/"" target=""_blank"">View this item in its source respository</a>",,,,,,,,,,,,,,,,,,,,,,,,,,,,,https://www.iowaheritage.org/files/original/3d1c9d39edf63c97a8a870186c240ef5.jpg,"Remote Item","Iowa City Town and Campus Scenes",1,0
22526,https://www.iowaheritage.org/items/show/22526,"Commencement procession on west side of Pentacrest with Madison Street in foreground, The University of Iowa, June 1929","Graduation ceremonies|Academic costume|University of Iowa|United States -- Iowa -- Iowa City|1920-1930|Alumni & alumnae|Universities & colleges|Old Capitol (Iowa City, Iowa)|MacLean Hall (Iowa City, Iowa)","Old Capitol in center and MacLean Hall to right.","Kent, Frederick W. (Frederick Wallace), 1894-1984",,"The University of Iowa. Libraries. University Archives",1929-06,,"Educational use only, no other permissions given. U.S. and international copyright laws may protect this digital object. Commercial use or distribution of the object is not permitted without prior permission of the copyright holder.","Iowa City Town and Campus Scenes|Frederick W. Kent collection of photographs, 1866-2000|http://www.lib.uiowa.edu/collguides/?RG30.0001.01|Prints|Events and activities|Commencement|Commencement|Scanned with Ricoh Aficio 3228C at 600 ppi, full color. Master images saved in tiff format.",13|18,,"Still image|Photographs|jpeg",RG30.0001.01|ea0171.jpg|https://digital.lib.uiowa.edu/,,,,,,,,,,,,,,,,,,,,,,,,,,,,,,,,,,,,,,,,,,,,,,,,"<a href=""https://digital.lib.uiowa.edu/"" target=""_blank"">View this item in its source respository</a>",,,,,,,,,,,,,,,,,,,,,,,,,,,,,https://www.iowaheritage.org/files/original/ad009ac77c40f459be88bbb55b612e07.jpg,"Remote Item","Iowa City Town and Campus Scenes",1,0
22524,https://www.iowaheritage.org/items/show/22524,"Graduation procession walking along Madison Street and west side of Pentacrest, The University of Iowa, June 1929","Graduation ceremonies|Academic costume|University of Iowa|United States -- Iowa -- Iowa City|1920-1930|Alumni & alumnae|Automobiles|Universities & colleges|Jessup Hall (Iowa City, Iowa)|MacLean Hall (Iowa City, Iowa)|Old Capitol (Iowa City, Iowa)","Jessup Hall on left, MacLean Hall on right, and Old Capitol in background center.","Kent, Frederick W. (Frederick Wallace), 1894-1984",,"The University of Iowa. Libraries. University Archives",1929-06,,"Educational use only, no other permissions given. U.S. and international copyright laws may protect this digital object. Commercial use or distribution of the object is not permitted without prior permission of the copyright holder.","Iowa City Town and Campus Scenes|Frederick W. Kent collection of photographs, 1866-2000|http://www.lib.uiowa.edu/collguides/?RG30.0001.01|Prints|Events and activities|Commencement|Commencement|Scanned with Ricoh Aficio 3228C at 600 ppi, full color. Master images saved in tiff format.",13|18,,"Still image|Photographs|jpeg",RG30.0001.01|ea0170.jpg|https://digital.lib.uiowa.edu/,,,,,,,,,,,,,,,,,,,,,,,,,,,,,,,,,,,,,,,,,,,,,,,,"<a href=""https://digital.lib.uiowa.edu/"" target=""_blank"">View this item in its source respository</a>",,,,,,,,,,,,,,,,,,,,,,,,,,,,,https://www.iowaheritage.org/files/original/575339d82be4e7029f526f24c4b2ba51.jpg,"Remote Item","Iowa City Town and Campus Scenes",1,0
22522,https://www.iowaheritage.org/items/show/22522,"Marching band and commencement procession on west side of Pentacrest, The University of Iowa, June 1929","Graduation ceremonies|Academic costume|University of Iowa|United States -- Iowa -- Iowa City|1920-1930|Alumni & alumnae|Marching bands|Automobiles|Universities & colleges|Jessup Hall (Iowa City, Iowa)|MacLean Hall (Iowa City, Iowa)|Old Capitol (Iowa City, Iowa)","Jessup Hall on left, MacLean Hall on right, and Old Capitol in background center.","Kent, Frederick W. (Frederick Wallace), 1894-1984",,"The University of Iowa. Libraries. University Archives",1929-06,,"Educational use only, no other permissions given. U.S. and international copyright laws may protect this digital object. Commercial use or distribution of the object is not permitted without prior permission of the copyright holder.","Iowa City Town and Campus Scenes|Frederick W. Kent collection of photographs, 1866-2000|http://www.lib.uiowa.edu/collguides/?RG30.0001.01|Prints|Events and activities|Commencement|Commencement|Scanned with Ricoh Aficio 3228C at 600 ppi, full color. Master images saved in tiff format.",13|18,,"Still image|Photographs|jpeg",RG30.0001.01|ea0169.jpg|https://digital.lib.uiowa.edu/,,,,,,,,,,,,,,,,,,,,,,,,,,,,,,,,,,,,,,,,,,,,,,,,"<a href=""https://digital.lib.uiowa.edu/"" target=""_blank"">View this item in its source respository</a>",,,,,,,,,,,,,,,,,,,,,,,,,,,,,https://www.iowaheritage.org/files/original/1f9ddc9b910067fa9e51206020680597.jpg,"Remote Item","Iowa City Town and Campus Scenes",1,0
22518,https://www.iowaheritage.org/items/show/22518,"Commencement officials filing out of Old Capitol, with North Hall in background, The University of Iowa, 1910s","Graduation ceremonies|Academic costume|University of Iowa|United States -- Iowa -- Iowa City|1910-1920|Alumni & alumnae|Old Capitol (Iowa City, Iowa)|Old North Hall (Iowa City, Iowa)",,"Kent, Frederick W. (Frederick Wallace), 1894-1984",,"The University of Iowa. Libraries. University Archives",1910/1919,,"Educational use only, no other permissions given. U.S. and international copyright laws may protect this digital object. Commercial use or distribution of the object is not permitted without prior permission of the copyright holder.","Iowa City Town and Campus Scenes|Frederick W. Kent collection of photographs, 1866-2000|http://www.lib.uiowa.edu/collguides/?RG30.0001.01|Prints|Events and activities|Commencement|Commencement|Scanned with Ricoh Aficio 3228C at 600 ppi, full color. Master images saved in tiff format.",12|18,,"Still image|Photographs|jpeg",RG30.0001.01|ea0106.jpg|https://digital.lib.uiowa.edu/,,,,,,,,,,,,,,,,,,,,,,,,,,,,,,,,,,,,,,,,,,,,,,,,"<a href=""https://digital.lib.uiowa.edu/"" target=""_blank"">View this item in its source respository</a>",,,,,,,,,,,,,,,,,,,,,,,,,,,,,https://www.iowaheritage.org/files/original/ebed8ab89e94e72d14ebe8545cf2685c.jpg,"Remote Item","Iowa City Town and Campus Scenes",1,0
22516,https://www.iowaheritage.org/items/show/22516,"Commencement procession passing by Old Capitol west portico, with Engineering Building in background, The University of Iowa, 1920s","Graduation ceremonies|Academic costume|University of Iowa|United States -- Iowa -- Iowa City|1920-1930|Alumni & alumnae|Universities & colleges|Old Capitol (Iowa City, Iowa)|Engineering Building (Iowa City, Iowa)",,"Kent, Frederick W. (Frederick Wallace), 1894-1984",,"The University of Iowa. Libraries. University Archives",1920/1929,,"Educational use only, no other permissions given. U.S. and international copyright laws may protect this digital object. Commercial use or distribution of the object is not permitted without prior permission of the copyright holder.","Iowa City Town and Campus Scenes|Frederick W. Kent collection of photographs, 1866-2000|http://www.lib.uiowa.edu/collguides/?RG30.0001.01|Prints|Events and activities|Commencement|Commencement|Scanned with Ricoh Aficio 3228C at 600 ppi, full color. Master images saved in tiff format.",9|7,,"Still image|Photographs|jpeg",RG30.0001.01|ea0105.jpg|https://digital.lib.uiowa.edu/,,,,,,,,,,,,,,,,,,,,,,,,,,,,,,,,,,,,,,,,,,,,,,,,"<a href=""https://digital.lib.uiowa.edu/"" target=""_blank"">View this item in its source respository</a>",,,,,,,,,,,,,,,,,,,,,,,,,,,,,https://www.iowaheritage.org/files/original/d6ecc2f238a9c45b6e40ffd61ee7c6f5.jpg,"Remote Item","Iowa City Town and Campus Scenes",1,0
22514,https://www.iowaheritage.org/items/show/22514,"Commencement in front of MacLean Hall on the Pentacrest, with Jessup Hall to the left and the Old Capitol in background, The University of Iowa, 1910s","Graduation ceremonies|University of Iowa|United States -- Iowa -- Iowa City|1910-1920|Alumni & alumnae|Crowds|Universities & colleges|MacLean Hall (Iowa City, Iowa)|Old Capitol (Iowa City, Iowa)|Jessup Hall (Iowa City, Iowa)","MacLean Hall was formerly the Physics Building","Kent, Frederick W. (Frederick Wallace), 1894-1984",,"The University of Iowa. Libraries. University Archives",1910/1919,,"Educational use only, no other permissions given. U.S. and international copyright laws may protect this digital object. Commercial use or distribution of the object is not permitted without prior permission of the copyright holder.","Iowa City Town and Campus Scenes|Frederick W. Kent collection of photographs, 1866-2000|http://www.lib.uiowa.edu/collguides/?RG30.0001.01|Prints|Events and activities|Commencement|Commencement|Scanned with Ricoh Aficio 3228C at 600 ppi, full color. Master images saved in tiff format.",16|22,,"Still image|Photographs|jpeg",RG30.0001.01|ea0096.jpg|https://digital.lib.uiowa.edu/,,,,,,,,,,,,,,,,,,,,,,,,,,,,,,,,,,,,,,,,,,,,,,,,"<a href=""https://digital.lib.uiowa.edu/"" target=""_blank"">View this item in its source respository</a>",,,,,,,,,,,,,,,,,,,,,,,,,,,,,https://www.iowaheritage.org/files/original/27a843558969482044e3bb90190db44a.jpg,"Remote Item","Iowa City Town and Campus Scenes",1,0
